%YAML 1.1
%TAG !u! tag:unity3d.com,2011:
--- !u!1 &7677565986030301832
GameObject:
  m_ObjectHideFlags: 0
  m_CorrespondingSourceObject: {fileID: 0}
  m_PrefabInstance: {fileID: 0}
  m_PrefabAsset: {fileID: 0}
  serializedVersion: 6
  m_Component:
  - component: {fileID: 4879672565149559579}
  - component: {fileID: -7587236779349368735}
  m_Layer: 0
  m_Name: PF_EnemyBullet
  m_TagString: Untagged
  m_Icon: {fileID: 0}
  m_NavMeshLayer: 0
  m_StaticEditorFlags: 0
  m_IsActive: 1
--- !u!4 &4879672565149559579
Transform:
  m_ObjectHideFlags: 0
  m_CorrespondingSourceObject: {fileID: 0}
  m_PrefabInstance: {fileID: 0}
  m_PrefabAsset: {fileID: 0}
  m_GameObject: {fileID: 7677565986030301832}
  m_LocalRotation: {x: 0, y: 0, z: 0, w: 1}
  m_LocalPosition: {x: 77.93712, y: 7.590066, z: -72.51114}
  m_LocalScale: {x: 1, y: 1, z: 1}
  m_Children:
  - {fileID: 4452054355992013540}
  m_Father: {fileID: 0}
  m_RootOrder: 0
  m_LocalEulerAnglesHint: {x: 0, y: 0, z: 0}
--- !u!114 &-7587236779349368735
MonoBehaviour:
  m_ObjectHideFlags: 0
  m_CorrespondingSourceObject: {fileID: 0}
  m_PrefabInstance: {fileID: 0}
  m_PrefabAsset: {fileID: 0}
  m_GameObject: {fileID: 7677565986030301832}
  m_Enabled: 1
  m_EditorHideFlags: 0
  m_Script: {fileID: 11500000, guid: f783214c5902148419ffd2c6d1f461c8, type: 3}
  m_Name: 
  m_EditorClassIdentifier: 
  damage: 2
--- !u!1001 &4452054355992146020
PrefabInstance:
  m_ObjectHideFlags: 0
  serializedVersion: 2
  m_Modification:
    m_TransformParent: {fileID: 4879672565149559579}
    m_Modifications:
    - target: {fileID: 100000, guid: 77ec3c4e07a36814fb3169ecef41b50a, type: 3}
      propertyPath: m_Name
      value: PS_EnemyBulet
      objectReference: {fileID: 0}
    - target: {fileID: 400000, guid: 77ec3c4e07a36814fb3169ecef41b50a, type: 3}
      propertyPath: m_LocalPosition.x
      value: 0
      objectReference: {fileID: 0}
    - target: {fileID: 400000, guid: 77ec3c4e07a36814fb3169ecef41b50a, type: 3}
      propertyPath: m_LocalPosition.y
      value: 1
      objectReference: {fileID: 0}
    - target: {fileID: 400000, guid: 77ec3c4e07a36814fb3169ecef41b50a, type: 3}
      propertyPath: m_LocalPosition.z
      value: 0
      objectReference: {fileID: 0}
    - target: {fileID: 400000, guid: 77ec3c4e07a36814fb3169ecef41b50a, type: 3}
      propertyPath: m_LocalRotation.x
      value: 0
      objectReference: {fileID: 0}
    - target: {fileID: 400000, guid: 77ec3c4e07a36814fb3169ecef41b50a, type: 3}
      propertyPath: m_LocalRotation.y
      value: 0
      objectReference: {fileID: 0}
    - target: {fileID: 400000, guid: 77ec3c4e07a36814fb3169ecef41b50a, type: 3}
      propertyPath: m_LocalRotation.z
      value: 0
      objectReference: {fileID: 0}
    - target: {fileID: 400000, guid: 77ec3c4e07a36814fb3169ecef41b50a, type: 3}
      propertyPath: m_LocalRotation.w
      value: 1
      objectReference: {fileID: 0}
    - target: {fileID: 400000, guid: 77ec3c4e07a36814fb3169ecef41b50a, type: 3}
      propertyPath: m_RootOrder
      value: 0
      objectReference: {fileID: 0}
    - target: {fileID: 400000, guid: 77ec3c4e07a36814fb3169ecef41b50a, type: 3}
      propertyPath: m_LocalEulerAnglesHint.x
      value: 0
      objectReference: {fileID: 0}
    - target: {fileID: 400000, guid: 77ec3c4e07a36814fb3169ecef41b50a, type: 3}
      propertyPath: m_LocalEulerAnglesHint.y
      value: 0
      objectReference: {fileID: 0}
    - target: {fileID: 400000, guid: 77ec3c4e07a36814fb3169ecef41b50a, type: 3}
      propertyPath: m_LocalEulerAnglesHint.z
      value: 0
      objectReference: {fileID: 0}
    - target: {fileID: 400000, guid: 77ec3c4e07a36814fb3169ecef41b50a, type: 3}
      propertyPath: m_LocalScale.x
      value: 1
      objectReference: {fileID: 0}
    - target: {fileID: 400000, guid: 77ec3c4e07a36814fb3169ecef41b50a, type: 3}
      propertyPath: m_LocalScale.y
      value: 1
      objectReference: {fileID: 0}
    - target: {fileID: 400000, guid: 77ec3c4e07a36814fb3169ecef41b50a, type: 3}
      propertyPath: m_LocalScale.z
      value: 1
      objectReference: {fileID: 0}
    - target: {fileID: 10800000, guid: 77ec3c4e07a36814fb3169ecef41b50a, type: 3}
      propertyPath: m_Intensity
      value: 0.8
      objectReference: {fileID: 0}
    - target: {fileID: 19800002, guid: 77ec3c4e07a36814fb3169ecef41b50a, type: 3}
      propertyPath: ColorModule.enabled
      value: 0
      objectReference: {fileID: 0}
    - target: {fileID: 19800002, guid: 77ec3c4e07a36814fb3169ecef41b50a, type: 3}
      propertyPath: SizeModule.enabled
      value: 0
      objectReference: {fileID: 0}
    - target: {fileID: 19800002, guid: 77ec3c4e07a36814fb3169ecef41b50a, type: 3}
      propertyPath: SizeModule.y.minMaxState
      value: 1
      objectReference: {fileID: 0}
    - target: {fileID: 19800002, guid: 77ec3c4e07a36814fb3169ecef41b50a, type: 3}
      propertyPath: SizeModule.z.minMaxState
      value: 1
      objectReference: {fileID: 0}
    - target: {fileID: 19800002, guid: 77ec3c4e07a36814fb3169ecef41b50a, type: 3}
      propertyPath: InitialModule.startSize.minMaxState
      value: 0
      objectReference: {fileID: 0}
    - target: {fileID: 19800002, guid: 77ec3c4e07a36814fb3169ecef41b50a, type: 3}
      propertyPath: InitialModule.startSizeY.minMaxState
      value: 0
      objectReference: {fileID: 0}
    - target: {fileID: 19800002, guid: 77ec3c4e07a36814fb3169ecef41b50a, type: 3}
      propertyPath: InitialModule.startSizeZ.minMaxState
      value: 0
      objectReference: {fileID: 0}
    - target: {fileID: 19800002, guid: 77ec3c4e07a36814fb3169ecef41b50a, type: 3}
      propertyPath: startDelay.scalar
      value: 0
      objectReference: {fileID: 0}
    - target: {fileID: 19800002, guid: 77ec3c4e07a36814fb3169ecef41b50a, type: 3}
      propertyPath: InitialModule.startLifetime.scalar
      value: 2
      objectReference: {fileID: 0}
    - target: {fileID: 19800002, guid: 77ec3c4e07a36814fb3169ecef41b50a, type: 3}
      propertyPath: InitialModule.startSize.scalar
      value: 1
      objectReference: {fileID: 0}
    m_RemovedComponents: []
  m_SourcePrefab: {fileID: 100100000, guid: 77ec3c4e07a36814fb3169ecef41b50a, type: 3}
--- !u!4 &4452054355992013540 stripped
Transform:
  m_CorrespondingSourceObject: {fileID: 400000, guid: 77ec3c4e07a36814fb3169ecef41b50a,
    type: 3}
  m_PrefabInstance: {fileID: 4452054355992146020}
  m_PrefabAsset: {fileID: 0}
