{
"type": "FeatureCollection",
"name": "Zone_etude_3km",
"crs": { "type": "name", "properties": { "name": "urn:ogc:def:crs:EPSG::3857" } },
"features": [
{ "type": "Feature", "properties": { "id": 6 }, "geometry": { "type": "MultiPolygon", "coordinates": [ [ [ [ -76693.666744563844986, 5809437.544185692444444 ], [ -76616.839661649180925, 5809436.877430281601846 ], [ -76540.035723204811802, 5809434.877364912070334 ], [ -76463.278066520608263, 5809431.544592106714845 ], [ -76386.58981523696275, 5809426.880115879699588 ], [ -76309.994071757755592, 5809420.885341408662498 ], [ -76233.51391105359653, 5809413.562074659392238 ], [ -76157.172372747780173, 5809404.912521763704717 ], [ -76080.992455128638539, 5809394.939288442954421 ], [ -76004.99710769529338, 5809383.645379175432026 ], [ -75929.209224094607634, 5809371.034196257591248 ], [ -75853.651635843329132, 5809357.109538877382874 ], [ -75778.347104799482622, 5809341.875601862557232 ], [ -75703.318316741802846, 5809325.336974493227899 ], [ -75628.587874411867233, 5809307.498639104887843 ], [ -75554.178290403870051, 5809288.365969505161047 ], [ -75480.111981052454212, 5809267.944729526527226 ], [ -75406.411258917680243, 5809246.241071090102196 ], [ -75333.098326691033435, 5809223.261532527394593 ], [ -75260.195270006413921, 5809199.013036458753049 ], [ -75187.724051291239448, 5809173.502887869253755 ], [ -75115.706502632499905, 5809146.73877174127847 ], [ -75044.164319523231825, 5809118.728750838898122 ], [ -74973.119054375594715, 5809089.481263308785856 ], [ -74902.592109718141728, 5809059.005120017565787 ], [ -74832.604732105857693, 5809027.309502038173378 ], [ -74763.178005379784736, 5808994.403957740403712 ], [ -74694.332844580130768, 5808960.29840003233403 ], [ -74626.089989617656101, 5808925.003103365190327 ], [ -74558.469998711982043, 5808888.528700478374958 ], [ -74491.493242754062521, 5808850.886179483495653 ], [ -74425.179898589791264, 5808812.086880245245993 ], [ -74359.549943461781368, 5808772.142491255886853 ], [ -74294.623148462414974, 5808731.065045805647969 ], [ -74230.419073096185457, 5808688.866918667219579 ], [ -74166.957059015607229, 5808645.560822144150734 ], [ -74104.256224332610145, 5808601.159802318550646 ], [ -74042.335457913126447, 5808555.677235168404877 ], [ -73981.213413568417309, 5808509.126822449266911 ], [ -73920.908504521852592, 5808461.52258763089776 ], [ -73861.438897824846208, 5808412.878871645778418 ], [ -73802.822508823810495, 5808363.210328516550362 ], [ -73745.076996012576274, 5808312.531921152025461 ], [ -73688.219755316327792, 5808260.858916501514614 ], [ -73632.267915177479153, 5808208.206881237216294 ], [ -73577.238331292610383, 5808154.591676976531744 ], [ -73523.147581504963455, 5808100.029455478303134 ], [ -73470.011960807678406, 5808044.536653766408563 ], [ -73417.847476504801307, 5807988.129989257082343 ], [ -73366.669843254276202, 5807930.826454571448267 ], [ -73316.494478526248713, 5807872.643312631174922 ], [ -73267.336497808762942, 5807813.598091294057667 ], [ -73219.210710127692437, 5807753.708578154444695 ], [ -73172.131613473553443, 5807692.992815050296485 ], [ -73126.113390633399831, 5807631.469092872925103 ], [ -73081.169904667389346, 5807569.155945737846196 ], [ -73037.314695039342041, 5807506.072145812213421 ], [ -72994.560973206855124, 5807442.23669720068574 ], [ -72952.921618899781606, 5807377.668830585666001 ], [ -72912.409176066910732, 5807312.387997183017433 ], [ -72873.035849265230354, 5807246.413863139227033 ], [ -72834.813499797644909, 5807179.766303309239447 ], [ -72797.75364228982653, 5807112.465395520441234 ], [ -72761.867441135298577, 5807044.531414375640452 ], [ -72727.16570716156275, 5806975.984825190156698 ], [ -72693.658894383654115, 5806906.846277858130634 ], [ -72661.357096833598916, 5806837.13660058286041 ], [ -72630.270045545417815, 5806766.876793657429516 ], [ -72600.40710557778948, 5806696.088023041374981 ], [ -72571.777273236541077, 5806624.791614076122642 ], [ -72544.38917336956365, 5806553.009045081213117 ], [ -72518.251056705004885, 5806480.761940720491111 ], [ -72493.370797453128034, 5806408.072065718472004 ], [ -72469.755890868545976, 5806334.961318125016987 ], [ -72447.413451006184914, 5806261.451722748577595 ], [ -72426.350208611853304, 5806187.565424638800323 ], [ -72406.572509045450715, 5806113.324682245962322 ], [ -72388.086310413884348, 5806038.751860876567662 ], [ -72370.897181735097547, 5805963.86942579690367 ], [ -72355.010301288813935, 5805888.699935578741133 ], [ -72340.430455053341575, 5805813.266035292297602 ], [ -72327.162035252782516, 5805737.5904496377334 ], [ -72315.209039038905757, 5805661.69597611296922 ], [ -72304.57506729317538, 5805585.605478191748261 ], [ -72295.263323533246876, 5805509.341878375969827 ], [ -72287.276612951609422, 5805432.928151320666075 ], [ -72280.617341569493874, 5805356.387316895648837 ], [ -72275.287515515243285, 5805279.742433289065957 ], [ -72271.288740415548091, 5805203.01659001223743 ], [ -72268.622220914214267, 5805126.232900971546769 ], [ -72267.288760308918427, 5805049.414497501216829 ], [ -72267.288760308918427, 5804972.584521391429007 ], [ -72268.622220914214267, 5804895.766117921099067 ], [ -72271.288740415548091, 5804818.982428880408406 ], [ -72275.287515515243285, 5804742.256585603579879 ], [ -72280.617341569493874, 5804665.611701996996999 ], [ -72287.276612951609422, 5804589.070867571979761 ], [ -72295.263323533246876, 5804512.657140516676009 ], [ -72304.57506729317538, 5804436.393540700897574 ], [ -72315.209039038905757, 5804360.303042779676616 ], [ -72327.162035252782516, 5804284.408569254912436 ], [ -72340.430455053341575, 5804208.732983600348234 ], [ -72355.010301288813935, 5804133.299083313904703 ], [ -72370.897181735097547, 5804058.129593095742166 ], [ -72388.086310412050807, 5803983.247158024460077 ], [ -72406.572509047473432, 5803908.674336639232934 ], [ -72426.350208615476731, 5803834.433594239875674 ], [ -72447.413451006199466, 5803760.547296142205596 ], [ -72469.755890864005778, 5803687.03770078253001 ], [ -72493.370797451250837, 5803613.926953179761767 ], [ -72518.251056707231328, 5803541.237078165635467 ], [ -72544.38917336956365, 5803468.989973811432719 ], [ -72571.777273236541077, 5803397.207404816523194 ], [ -72600.407105580321513, 5803325.910995844751596 ], [ -72630.270045539946295, 5803255.122225247323513 ], [ -72661.357096836582059, 5803184.862418303266168 ], [ -72693.658894383654115, 5803115.152741034515202 ], [ -72727.16570716156275, 5803046.014193702489138 ], [ -72761.867441135298577, 5802977.467604517005384 ], [ -72797.75364228982653, 5802909.533623372204602 ], [ -72834.813499797644909, 5802842.232715583406389 ], [ -72873.035849265230354, 5802775.585155753418803 ], [ -72912.409176066910732, 5802709.611021709628403 ], [ -72952.921618904161733, 5802644.330188299529254 ], [ -72994.560973202082096, 5802579.762321699410677 ], [ -73037.314695034845499, 5802515.926873086951673 ], [ -73081.169904677270097, 5802452.843073140829802 ], [ -73126.113390623009764, 5802390.529926033690572 ], [ -73172.13161347899586, 5802329.006203835830092 ], [ -73219.210710112209199, 5802268.290440757758915 ], [ -73267.336497824755497, 5802208.400927579030395 ], [ -73316.494478526263265, 5802149.355706261470914 ], [ -73366.66984327242244, 5802091.172564300708473 ], [ -73417.847476467126398, 5802033.869029677473009 ], [ -73470.011960827250732, 5801977.462365105748177 ], [ -73523.147581504978007, 5801921.969563414342701 ], [ -73577.238331292624935, 5801867.407341916114092 ], [ -73632.267915200223797, 5801813.792137634009123 ], [ -73688.219755293030175, 5801761.140102412551641 ], [ -73745.076996012576274, 5801709.467097740620375 ], [ -73802.82250882902008, 5801658.788690371438861 ], [ -73861.43889781931648, 5801609.120147251524031 ], [ -73920.908504521867144, 5801560.476431261748075 ], [ -73981.213413568431861, 5801512.872196443378925 ], [ -74042.335457913140999, 5801466.321783724240959 ], [ -74104.256224332624697, 5801420.83921657409519 ], [ -74166.957059011081583, 5801376.43819675128907 ], [ -74230.419073101016693, 5801333.132100221700966 ], [ -74294.623148462414974, 5801290.933973086997867 ], [ -74359.549943461781368, 5801249.856527636758983 ], [ -74425.179898594054976, 5801209.912138644605875 ], [ -74491.493242749565979, 5801171.112839411944151 ], [ -74558.469998711996595, 5801133.470318414270878 ], [ -74626.089989617670653, 5801096.995915527455509 ], [ -74694.33284458014532, 5801061.700618860311806 ], [ -74763.178005379799288, 5801027.595061152242124 ], [ -74832.604732102816342, 5800994.689516856335104 ], [ -74902.592109721401357, 5800962.993898874148726 ], [ -74973.119054375594715, 5800932.51775558385998 ], [ -75044.164319525720202, 5800903.270268052816391 ], [ -75115.706502627479495, 5800875.260247153230011 ], [ -75187.724051295808749, 5800848.496131021529436 ], [ -75260.195270004245685, 5800822.985982434824109 ], [ -75333.098326689199894, 5800798.737486366182566 ], [ -75406.411258921187255, 5800775.757947801612318 ], [ -75480.111981049369206, 5800754.054289367049932 ], [ -75554.178290406591259, 5800733.633049386553466 ], [ -75628.587874410615768, 5800714.500379787757993 ], [ -75703.318316740973387, 5800696.662044399417937 ], [ -75778.347104800413945, 5800680.123417030088603 ], [ -75853.651635844027624, 5800664.889480015262961 ], [ -75929.209224093836383, 5800650.964822635054588 ], [ -76004.997107695307932, 5800638.353639717213809 ], [ -76080.992455128347501, 5800627.059730449691415 ], [ -76157.172372748391354, 5800617.086497128941119 ], [ -76233.513911053320044, 5800608.436944233253598 ], [ -76309.994071757770143, 5800601.113677483983338 ], [ -76386.589815236977302, 5800595.118903012946248 ], [ -76463.278066520622815, 5800590.454426785930991 ], [ -76540.035723204826354, 5800587.121653980575502 ], [ -76616.839661649195477, 5800585.12158861104399 ], [ -76693.666744563786779, 5800584.454833200201392 ], [ -76770.493827478203457, 5800585.12158861104399 ], [ -76847.297765922688995, 5800587.121653980575502 ], [ -76924.055422606747015, 5800590.454426785930991 ], [ -77000.743673890450737, 5800595.118903012946248 ], [ -77077.339417369657895, 5800601.113677483983338 ], [ -77153.819578074107994, 5800608.436944233253598 ], [ -77230.161116379036685, 5800617.086497128941119 ], [ -77306.341033999473439, 5800627.059730449691415 ], [ -77382.336381431799964, 5800638.353639717213809 ], [ -77458.124265033606207, 5800650.964822635054588 ], [ -77533.681853283414966, 5800664.889480015262961 ], [ -77608.986384327028645, 5800680.123417030088603 ], [ -77684.015172386469203, 5800696.662044399417937 ], [ -77758.745614745741477, 5800714.500379795208573 ], [ -77833.155198718319298, 5800733.633049385622144 ], [ -77907.221508052301942, 5800754.054289359599352 ], [ -77980.922230206269887, 5800775.757947801612318 ], [ -78054.235162440338172, 5800798.737486367113888 ], [ -78127.138219121290604, 5800822.985982433892787 ], [ -78199.609437831662945, 5800848.496131021529436 ], [ -78271.626986499992199, 5800875.260247153230011 ], [ -78343.169169601751491, 5800903.270268052816391 ], [ -78414.214434751876979, 5800932.51775558385998 ], [ -78484.741379409329966, 5800962.993898875080049 ], [ -78554.728757021614001, 5800994.689516854472458 ], [ -78624.155483747686958, 5801027.595061152242124 ], [ -78693.000644551211735, 5801061.700618862174451 ], [ -78761.243499506177614, 5801096.995915525592864 ], [ -78828.863490415504202, 5801133.470318414270878 ], [ -78895.840246377934818, 5801171.112839411944151 ], [ -78962.153590533445822, 5801209.912138644605875 ], [ -79027.78354566571943, 5801249.856527636758983 ], [ -79092.710340681413072, 5801290.933973097242415 ], [ -79156.914416010258719, 5801333.132100210525095 ], [ -79220.376430122167221, 5801376.43819675501436 ], [ -79283.077264789913897, 5801420.839216570369899 ], [ -79344.998031211012858, 5801466.321783721446991 ], [ -79406.120075549013563, 5801512.872196435928345 ], [ -79466.424984613375273, 5801560.476431268267334 ], [ -79525.894591318938183, 5801609.120147259905934 ], [ -79584.510980293329339, 5801658.788690366782248 ], [ -79642.25649311496818, 5801709.467097740620375 ], [ -79699.113733844875242, 5801761.140102421864867 ], [ -79755.065573925458011, 5801813.792137631215155 ], [ -79810.095157827236108, 5801867.407341907732189 ], [ -79864.185907602091902, 5801921.969563393853605 ], [ -79917.321528339831275, 5801977.462365147657692 ], [ -79969.486012629975448, 5802033.869029643014073 ], [ -80020.663645871449262, 5802091.172564318403602 ], [ -80070.839010601965128, 5802149.355706261470914 ], [ -80119.996991313659237, 5802208.400927592068911 ], [ -80168.122779005367192, 5802268.290440744720399 ], [ -80215.201875643528183, 5802329.006203829310834 ], [ -80261.220098504578345, 5802390.529926033690572 ], [ -80306.163584455251112, 5802452.84307314734906 ], [ -80350.018794088246068, 5802515.926873080432415 ], [ -80392.772515925520565, 5802579.762321699410677 ], [ -80434.411870223440928, 5802644.330188299529254 ], [ -80474.924313060691929, 5802709.611021709628403 ], [ -80514.297639866563259, 5802775.585155760869384 ], [ -80552.519989322085166, 5802842.23271556943655 ], [ -80589.579846833396005, 5802909.533623363822699 ], [ -80625.466048000031151, 5802977.467604532837868 ], [ -80660.167781971817021, 5803046.014193713665009 ], [ -80693.674594740354223, 5803115.152741026133299 ], [ -80725.976392292141099, 5803184.862418306060135 ], [ -80757.063443583771004, 5803255.122225238010287 ], [ -80786.926383548707236, 5803325.910995848476887 ], [ -80815.55621589103248, 5803397.207404816523194 ], [ -80842.94431575917406, 5803468.989973814226687 ], [ -80869.08243241958553, 5803541.237078162841499 ], [ -80893.962691672917572, 5803613.926953169517219 ], [ -80917.577598264848348, 5803687.0377007862553 ], [ -80939.920038120573736, 5803760.547296140342951 ], [ -80960.983280514570652, 5803834.4335942491889 ], [ -80980.760980080187437, 5803908.674336639232934 ], [ -80999.247178715610062, 5803983.247158024460077 ], [ -81016.436307392563322, 5804058.129593095742166 ], [ -81032.323187838846934, 5804133.299083313904703 ], [ -81046.9030340732279, 5804208.732983594760299 ], [ -81060.171453875853331, 5804284.408569261431694 ], [ -81072.124450088769663, 5804360.303042779676616 ], [ -81082.758421834500041, 5804436.393540700897574 ], [ -81092.070165594326681, 5804512.657140515744686 ], [ -81100.056876176327933, 5804589.070867574773729 ], [ -81106.71614755821065, 5804665.611701996065676 ], [ -81112.045973612359376, 5804742.256585601717234 ], [ -81116.044748712156434, 5804818.982428880408406 ], [ -81118.711268213475705, 5804895.766117921099067 ], [ -81120.044728818756994, 5804972.584521391429007 ], [ -81120.044728818771546, 5805049.414497501216829 ], [ -81118.711268213475705, 5805126.232900971546769 ], [ -81116.044748712141882, 5805203.01659001223743 ], [ -81112.045973612519447, 5805279.742433288134634 ], [ -81106.716147558050579, 5805356.387316897511482 ], [ -81100.056876176444348, 5805432.928151316940784 ], [ -81092.07016559423937, 5805509.341878377832472 ], [ -81082.758421834150795, 5805585.605478193610907 ], [ -81072.124450088798767, 5805661.69597611296922 ], [ -81060.171453874922008, 5805737.5904496377334 ], [ -81046.903034074362949, 5805813.266035292297602 ], [ -81032.32318783889059, 5805888.699935578741133 ], [ -81016.436307394847972, 5805963.869425785727799 ], [ -80999.247178713965695, 5806038.751860874705017 ], [ -80980.760980079110595, 5806113.324682258069515 ], [ -80960.983280513464706, 5806187.565424648113549 ], [ -80939.920038122625556, 5806261.451722745783627 ], [ -80917.577598260933883, 5806334.961318119429052 ], [ -80893.962691676468239, 5806408.072065712884068 ], [ -80869.082432420487748, 5806480.761940727010369 ], [ -80842.944315758155426, 5806553.009045081213117 ], [ -80815.556215891177999, 5806624.791614076122642 ], [ -80786.926383549929596, 5806696.088023041374981 ], [ -80757.063443582301261, 5806766.876793657429516 ], [ -80725.97639229412016, 5806837.13660058286041 ], [ -80693.674594744064962, 5806906.846277858130634 ], [ -80660.167781966156326, 5806975.984825190156698 ], [ -80625.466047992420499, 5807044.531414375640452 ], [ -80589.579846837892546, 5807112.465395520441234 ], [ -80552.519989330074168, 5807179.766303309239447 ], [ -80514.297639862488722, 5807246.413863139227033 ], [ -80474.924313060808345, 5807312.387997183017433 ], [ -80434.41187022793747, 5807377.668830585666001 ], [ -80392.772515916425618, 5807442.236697207204998 ], [ -80350.018794097733917, 5807506.072145798243582 ], [ -80306.163584455411183, 5807569.155945745296776 ], [ -80261.220098494319245, 5807631.469092872925103 ], [ -80215.201875654165633, 5807692.992815050296485 ], [ -80168.12277900816116, 5807753.708578144200146 ], [ -80119.996991308726138, 5807813.598091306164861 ], [ -80070.839010603449424, 5807872.643312629312277 ], [ -80020.663645855296636, 5807930.826454591937363 ], [ -79969.486012660592678, 5807988.129989215172827 ], [ -79917.321528300468344, 5808044.536653786897659 ], [ -79864.18590762274107, 5808100.029455478303134 ], [ -79810.095157835094142, 5808154.591676976531744 ], [ -79755.065573927495279, 5808208.206881258636713 ], [ -79699.11373382943566, 5808260.85891648568213 ], [ -79642.256493125954876, 5808312.531921141780913 ], [ -79584.510980293125613, 5808363.210328525863588 ], [ -79525.894591308402596, 5808412.878871641121805 ], [ -79466.424984605851932, 5808461.52258763089776 ], [ -79406.120075559287216, 5808509.126822449266911 ], [ -79344.998031214578077, 5808555.677235168404877 ], [ -79283.077264790103072, 5808601.159802322275937 ], [ -79220.376430121919839, 5808645.560822137631476 ], [ -79156.914416026687832, 5808688.86691867094487 ], [ -79092.71034066528955, 5808731.065045805647969 ], [ -79027.783545661586686, 5808772.14249125868082 ], [ -78962.153590542497113, 5808812.086880242452025 ], [ -78895.840246373627451, 5808850.886179483495653 ], [ -78828.863490415707929, 5808888.528700478374958 ], [ -78761.24349950638134, 5808925.003103367052972 ], [ -78693.000644554645987, 5808960.298400028608739 ], [ -78624.155483741313219, 5808994.40395774319768 ], [ -78554.728757028220571, 5809027.30950203537941 ], [ -78484.741379406288615, 5809059.005120018497109 ], [ -78414.214434752095258, 5809089.481263308785856 ], [ -78343.16916960196977, 5809118.728750839829445 ], [ -78271.626986500210478, 5809146.738771739415824 ], [ -78199.609437831881223, 5809173.5028878711164 ], [ -78127.138219123444287, 5809199.013036457821727 ], [ -78054.235162438490079, 5809223.26153252646327 ], [ -77980.922230206502718, 5809246.241071091033518 ], [ -77907.221508078320767, 5809267.944729525595903 ], [ -77833.155198721098714, 5809288.36596950609237 ], [ -77758.745614717074204, 5809307.498639104887843 ], [ -77684.015172386716586, 5809325.336974493227899 ], [ -77608.986384327276028, 5809341.875601862557232 ], [ -77533.681853283662349, 5809357.109538877382874 ], [ -77458.12426503385359, 5809371.034196257591248 ], [ -77382.336381432382041, 5809383.645379175432026 ], [ -77306.341033999342471, 5809394.939288442954421 ], [ -77230.161116379298619, 5809404.912521763704717 ], [ -77153.819578074369929, 5809413.562074659392238 ], [ -77077.339417369919829, 5809420.885341408662498 ], [ -77000.743673890712671, 5809426.880115879699588 ], [ -76924.055422607067158, 5809431.544592106714845 ], [ -76847.297765922863618, 5809434.877364912070334 ], [ -76770.493827478494495, 5809436.877430281601846 ], [ -76693.666744563844986, 5809437.544185692444444 ] ] ] ] } }
]
}
