BidderAgent('tcp://localhost:5555/1') was called for proposal to 3.
BidderAgent('tcp://localhost:5555/2') was called for proposal to 3.
BidderAgent('tcp://localhost:5555/1') was accepted for proposal 0.84.
BidderAgent('tcp://localhost:5555/2') was rejected for proposal 0.04.
The outcome of accepting the bid was "yay".
