[
	{
		"question": "Worüber trifft Hick's-Law eine aussage?",
		"choices": {
			"a": "Verhältnis von Größe und Gewicht der Maus",
			"b": "Verhältnis von Bedien Elementgröße und Zeiger Position",
			"c": "Zeit die für die Auswahl eines Elemntes aus n Elemten gebraucht wird",
			"d": "Meintest du das Higgs-Boson?"
		},
		"answers": ["c"]
	},
	{
		"question": "Welcher der folgenden Sätze beschreibt den Begriff Kompetenz-Illusion am besten?",
		"choices": {
			"a": "Man merkt, was man nicht weiß.",
			"b": "Man weiß, mehr als man möchte.",
			"c": "Es fehlt genug Wissen, um die eigene Kompetenz einzuschätzen.",
			"d": "Es wirkt als sei man kompetent, ist es aber nicht."
		},
		"answers": ["c"]
	}
]
