[
  {
    "type" : "group",
    "padding" : { "top"     : "1,2",
                  "right"   : "1,2",
                  "bottom"  : "1,2",
                  "left"    : "1,2" }
  },
  {
    "type" : "button",
    "graphic_path" : "assets/aufgaben/gui_bau/guiElement_button.png",
    "icon_path" : "assets/aufgaben/gui_bau/guiElement_button_icon.png",
    "graphic" : "button",
    "icon" : "button_icon",
    "title" : "Button",
    "color": "white",
    "groups": null,
    "padding" : { "top"     : "1,1",
                  "right"   : "1,1",
                  "bottom"  : "1,1",
                  "left"    : "1,1" }
  },
  {
    "type" : "label",
    "graphic_path" : null,
    "icon_path" : "assets/aufgaben/gui_bau/guiElement_label_icon.png",
    "graphic" : null,
    "icon" : "label_icon",
    "title" : "Label",
    "groups": null,
    "padding" : { "top"     : "0,1",
                  "right"   : "0,1",
                  "bottom"  : "0,1",
                  "left"    : "0,1" }
  },
  {
    "type" : "input_text",
    "graphic_path" : "assets/aufgaben/gui_bau/guiElement_input.png",
    "icon_path" : "assets/aufgaben/gui_bau/guiElement_input_icon.png",
    "graphic" : "input",
    "icon" : "input_icon",
    "title" : "Text-Eingabefeld",
    "color": "#c2c2c2",
    "text" : "Platzhalter",
    "groups": null,
    "padding" : { "top"     : "1,1",
                  "right"   : "1,1",
                  "bottom"  : "1,1",
                  "left"    : "1,1" }
  },
  {
    "type" : "dropdown_select",
    "graphic_path" : "assets/aufgaben/gui_bau/guiElement_select.png",
    "icon_path" : "assets/aufgaben/gui_bau/guiElement_select_icon.png",
    "graphic" : "dropdown",
    "icon" : "dropdown_icon",
    "title" : "Dropdown-Menü",
    "color": "#c2c2c2",
    "text" : "Auswählen",
    "groups": null,
    "padding" : { "top"     : "1,1",
                  "right"   : "1,1",
                  "bottom"  : "1,1",
                  "left"    : "1,1" }
  },
  {
    "type" : "checkbox_unchecked",
    "graphic_path" : "assets/aufgaben/gui_bau/guiElement_checkbox.png",
    "icon_path" : "assets/aufgaben/gui_bau/guiElement_checkbox_icon.png",
    "graphic" : "checkbox",
    "icon" : "checkbox_icon",
    "title" : "Checkbox",
    "subtitle" : "Nicht ausgewählt",
    "color": "#c2c2c2",
    "text" : "",
    "groups": null,
    "padding" : { "top"     : "1,1",
                  "right"   : "0,1",
                  "bottom"  : "1,1",
                  "left"    : "0,1" }
  },
  {
    "type" : "checkbox_checked",
    "graphic_path" : "assets/aufgaben/gui_bau/guiElement_checkbox_selected.png",
    "icon_path" : "assets/aufgaben/gui_bau/guiElement_checkbox_selected_icon.png",
    "graphic" : "checkbox_selected",
    "icon" : "checkbox_selected_icon",
    "title" : "Checkbox",
    "subtitle" : "Ausgewählt",
    "color": "#c2c2c2",
    "text" : "",
    "groups": null,
    "padding" : { "top"     : "1,1",
                  "right"   : "0,1",
                  "bottom"  : "1,1",
                  "left"    : "0,1" }
  },
  {
    "type" : "radio",
    "graphic_path" : "assets/aufgaben/gui_bau/guiElement_radio.png",
    "icon_path" : "assets/aufgaben/gui_bau/guiElement_radio_icon.png",
    "graphic" : "radio",
    "icon" : "radio_icon",
    "title" : "Radio Button",
    "subtitle" : "Nicht ausgewählt",
    "color": "#c2c2c2",
    "text" : "",
    "groups": null,
    "padding" : { "top"     : "1,1",
                  "right"   : "0,1",
                  "bottom"  : "1,1",
                  "left"    : "0,1" }
  },
  {
    "type" : "radio_selected",
    "graphic_path" : "assets/aufgaben/gui_bau/guiElement_radio_selected.png",
    "icon_path" : "assets/aufgaben/gui_bau/guiElement_radio_selected_icon.png",
    "graphic" : "radio_selected",
    "icon" : "radio_selected_icon",
    "title" : "Radio Button",
    "subtitle" : "Ausgewählt",
    "color": "#c2c2c2",
    "text" : "",
    "groups": null,
    "padding" : { "top"     : "1,1",
                  "right"   : "0,1",
                  "bottom"  : "1,1",
                  "left"    : "0,1" }
  },
  {
    "type" : "textarea",
    "graphic_path" : "assets/aufgaben/gui_bau/guiElement_textarea.png",
    "icon_path" : "assets/aufgaben/gui_bau/guiElement_textarea_icon.png",
    "graphic" : "textarea",
    "icon" : "textarea_icon",
    "title" : "Text Eingabefeld",
    "subtitle" : "Textarea",
    "color": "#c2c2c2",
    "text" : "",
    "groups": null,
    "padding" : { "top"     : "1,1",
                  "right"   : "1,1",
                  "bottom"  : "1,1",
                  "left"    : "1,1" }
  },
  {
    "type" : "back_button",
    "graphic_path" : "assets/aufgaben/gui_bau/guiElement_back-button.png",
    "icon_path" : "assets/aufgaben/gui_bau/guiElement_back-button_icon.png",
    "graphic" : "back_button",
    "icon" : "back_button_icon",
    "title" : "Zurück - Knopf",
    "groups": null,
    "padding" : { "top"     : "0,1",
                  "right"   : "0,1",
                  "bottom"  : "0,1",
                  "left"    : "0,1" }
  },
  {
    "type" : "skip_button",
    "graphic_path" : "assets/aufgaben/gui_bau/guiElement_skip-button.png",
    "icon_path" : "assets/aufgaben/gui_bau/guiElement_skip-button_icon.png",
    "graphic" : "skip_button",
    "icon" : "skip_button_icon",
    "title" : "Skip - Knopf",
    "groups": null,
    "padding" : { "top"     : "0,1",
                  "right"   : "0,1",
                  "bottom"  : "0,1",
                  "left"    : "0,1" }
  },
  {
    "type" : "forward_button",
    "graphic_path" : "assets/aufgaben/gui_bau/guiElement_forward-button.png",
    "icon_path" : "assets/aufgaben/gui_bau/guiElement_forward-button_icon.png",
    "graphic" : "forward_button",
    "icon" : "forward_button_icon",
    "title" : "Vorspulen - Knopf",
    "groups": null,
    "padding" : { "top"     : "0,1",
                  "right"   : "0,1",
                  "bottom"  : "0,1",
                  "left"    : "0,1" }
  },
  {
    "type" : "rewind_button",
    "graphic_path" : "assets/aufgaben/gui_bau/guiElement_rewind-button.png",
    "icon_path" : "assets/aufgaben/gui_bau/guiElement_rewind-button_icon.png",
    "graphic" : "rewind_button",
    "icon" : "rewind_button_icon",
    "title" : "Zurückspulen - Knopf",
    "groups": null,
    "padding" : { "top"     : "0,1",
                  "right"   : "0,1",
                  "bottom"  : "0,1",
                  "left"    : "0,1" }
  },
  {
    "type" : "play_button",
    "graphic_path" : "assets/aufgaben/gui_bau/guiElement_play-button.png",
    "icon_path" : "assets/aufgaben/gui_bau/guiElement_play-button_icon.png",
    "graphic" : "play_button",
    "icon" : "play_button_icon",
    "title" : "Start - Knopf",
    "groups": null,
    "padding" : { "top"     : "0,1",
                  "right"   : "0,1",
                  "bottom"  : "0,1",
                  "left"    : "0,1" }
  },
  {
    "type" : "pause_button",
    "graphic_path" : "assets/aufgaben/gui_bau/guiElement_pause-button.png",
    "icon_path" : "assets/aufgaben/gui_bau/guiElement_pause-button_icon.png",
    "graphic" : "pause_button",
    "icon" : "pause_button_icon",
    "title" : "Pause - Knopf",
    "groups": null,
    "padding" : { "top"     : "0,1",
                  "right"   : "0,1",
                  "bottom"  : "0,1",
                  "left"    : "0,1" }
  },
  {
    "type" : "stop_button",
    "graphic_path" : "assets/aufgaben/gui_bau/guiElement_stop-button.png",
    "icon_path" : "assets/aufgaben/gui_bau/guiElement_stop-button_icon.png",
    "graphic" : "stop_button",
    "icon" : "stop_button_icon",
    "title" : "Stop - Knopf",
    "groups": null,
    "padding" : { "top"     : "0,1",
                  "right"   : "0,1",
                  "bottom"  : "0,1",
                  "left"    : "0,1" }
  },
  {
    "type" : "record_button",
    "graphic_path" : "assets/aufgaben/gui_bau/guiElement_record-button.png",
    "icon_path" : "assets/aufgaben/gui_bau/guiElement_record-button_icon.png",
    "graphic" : "record_button",
    "icon" : "record_button_icon",
    "title" : "Aufnehmen - Knopf",
    "groups": null,
    "padding" : { "top"     : "0,1",
                  "right"   : "0,1",
                  "bottom"  : "0,1",
                  "left"    : "0,1" }
  },
  {
    "type" : "mute_button",
    "graphic_path" : "assets/aufgaben/gui_bau/guiElement_mute-button.png",
    "icon_path" : "assets/aufgaben/gui_bau/guiElement_mute-button-icon.png",
    "graphic" : "mute_button",
    "icon" : "mute_button_icon",
    "title" : "Stumm - Knopf",
    "groups": null,
    "padding" : { "top"     : "0,1",
                  "right"   : "0,1",
                  "bottom"  : "0,1",
                  "left"    : "0,1" }
  },
  {
    "type" : "on_switch",
    "graphic_path" : "assets/aufgaben/gui_bau/guiElement_on-button.png",
    "icon_path" : "assets/aufgaben/gui_bau/guiElement_on-button_icon.png",
    "graphic" : "on_button",
    "icon" : "on_button_icon",
    "title" : "An - Knopf",
    "groups": null,
    "padding" : { "top"     : "0,1",
                  "right"   : "0,1",
                  "bottom"  : "0,1",
                  "left"    : "0,1" }
  },
  {
    "type" : "off_switch",
    "graphic_path" : "assets/aufgaben/gui_bau/guiElement_off-button.png",
    "icon_path" : "assets/aufgaben/gui_bau/guiElement_off-button_icon.png",
    "graphic" : "off_button",
    "icon" : "off_button_icon",
    "title" : "Aus - Knopf",
    "groups": null,
    "padding" : { "top"     : "0,1",
                  "right"   : "0,1",
                  "bottom"  : "0,1",
                  "left"    : "0,1" }
  },
  {
    "type" : "slider_horizontal",
    "graphic_path" : "assets/aufgaben/gui_bau/guiElement_slider-horizontal.png",
    "icon_path" : "assets/aufgaben/gui_bau/guiElement_slider_icon.png",
    "graphic" : "slider-horizontal",
    "icon" : "slider-horizontal_icon",
    "title" : "Slider",
    "subtitle" : "Horizontaler Slider",
    "groups": null,
    "padding" : { "top"     : "1,1",
                  "right"   : "1,1",
                  "bottom"  : "1,1",
                  "left"    : "1,1" }
  },
  {
    "type" : "slider_horizontal_long",
    "graphic_path" : "assets/aufgaben/gui_bau/guiElement_slider-horizontal-long.png",
    "icon_path" : "assets/aufgaben/gui_bau/guiElement_slider_icon.png",
    "graphic" : "slider-horizontal-long",
    "icon" : "slider-horizontal_icon",
    "title" : "Slider (lang)",
    "subtitle" : "Horizontaler Slider (lang)",
    "groups": null,
    "padding" : { "top"     : "0,1",
                  "right"   : "0,1",
                  "bottom"  : "0,1",
                  "left"    : "0,1" }
  },
  {
    "type" : "slider_vertical",
    "graphic_path" : "assets/aufgaben/gui_bau/guiElement_slider-vertical.png",
    "icon_path" : "assets/aufgaben/gui_bau/guiElement_slider_icon.png",
    "graphic" : "slider_vertical",
    "icon" : "slider_vertical_icon",
    "title" : "Slider",
    "subtitle" : "Vertikaler Slider",
    "groups": null,
    "padding" : { "top"     : "1,1",
                  "right"   : "1,1",
                  "bottom"  : "1,1",
                  "left"    : "1,1" }
  },
  {
    "type" : "album_cover",
    "graphic_path" : "assets/aufgaben/gui_bau/guiElement_music_cover.png",
    "icon_path" : "assets/aufgaben/gui_bau/guiElement_music_cover_icon.png",
    "graphic" : "music_cover",
    "icon" : "music_cover_icon",
    "title" : "Slider",
    "subtitle" : "Album Cover",
    "groups": null,
    "padding" : { "top"     : "1,1",
                  "right"   : "1,1",
                  "bottom"  : "0,1",
                  "left"    : "1,1" }
  }
]
