[
	{
        "question": "Schieße alle fehlerhaften Code-Ausschnitte ab!",
		"choices": {
			"a": "System.out('Hello World');",
			"b": "for(i=0; i<5; i++) { methode(); }",
			"c": "int a = 5.23;",
			"d": "float f = 5.23 + 2;",
            "e": "if(boolean = false) { methode(); }",
            "f": "if(boolean == false) { methode(); }"
		},
		"answers": ["d", "f"]
    }, {
        "question": "Was sollte man tun, um seinen Code übersichtlich zu halten?",
		"choices": {
			"a": "So wenig Kommentare wie möglich",
			"b": "Einrücken",
			"c": "Javadoc zur Beschreibung von Methoden verwenden",
			"d": "Variablen Namen nur sher kurz halten (1-2 Buchstaben)",
            "e": "Beschreibende Namen verwenden",
            "f": "Nicht zu viele Schleifen verwenden"
		},
		"answers": ["b", "c", "e"]
    }, {
        "question": "Eine Variable soll ein Array beschreiben, indem all diese Käfer gespeichert sind! Welche Namen wären dafür passend?",
		"choices": {
			"a": "alleKäfer",
			"b": "hierSindAlleKäferDrin",
			"c": "ak",
			"d": "allKäfer",
            "e": "allBugs",
            "f": "arrayAllerKäfer"
		},
		"answers": ["a", "e"]
    }, {
        "question": "Bei welcher Schleife wird auf jeden Fall zuerst der Anweisung in der Schleife ausgeführt?",
		"choices": {
			"a": "Do-While",
			"b": "While",
			"c": "For mit mind. einem Durchlauf",
			"d": "Foreach",
            "e": "Keiner"
		},
		"answers": ["a", "c"]
    }
]
