[
	{
		"frage": "Bringe den Code in Ordnung.",
		"pieces": [
			"for (int i = 0; i < 10; i++)",
			"{",
			"System.out.println(i);",
			"}"
		]
	},
	{
		"frage": "Bringe den Code in Ordnung.",
		"pieces": [
			"switch (value) {",
			"case 0:",
			"doSomething();",
			"break;",
			"}"
		]
	},
	{
		"frage": "Bringe den Code in Ordnung.",
		"pieces": [
			"Iterator it = set.iterator();",
			"while (it.hasNext()) {",
			"System.out.println(it.next());",
			"}"
		]
	}
	
]
