{

"frames": [

	{
		"filename": "bg",
		"frame": {"x":0,"y":0,"w":1024,"h":576},
		"rotated": false,
		"trimmed": true,
		"spriteSourceSize": {"x":0,"y":0,"w":1024,"h":576},
		"sourceSize": {"w":1024,"h":576}
	},
	
	
	
	{
		"filename": "wall_top",
		"frame": {"x":0,"y":0,"w":1024,"h":86},
		"rotated": false,
		"trimmed": true,
		"spriteSourceSize": {"x":0,"y":0,"w":1024,"h":86},
		"sourceSize": {"w":1024,"h":86}
	},
	{
		"filename": "wall_top_left",
		"frame": {"x":0,"y":0,"w":484,"h":86},
		"rotated": false,
		"trimmed": true,
		"spriteSourceSize": {"x":0,"y":0,"w":484,"h":86},
		"sourceSize": {"w":484,"h":86}
	},
	{
		"filename": "wall_top_right",
		"frame": {"x":540,"y":0,"w":484,"h":86},
		"rotated": false,
		"trimmed": true,
		"spriteSourceSize": {"x":0,"y":0,"w":484,"h":86},
		"sourceSize": {"w":470,"h":86}
	},
	
	
	
	{
		"filename": "wall_right",
		"frame": {"x":936,"y":0,"w":86,"h":576},
		"rotated": false,
		"trimmed": true,
		"spriteSourceSize": {"x":0,"y":0,"w":86,"h":576},
		"sourceSize": {"w":86,"h":576}
	},
	{
		"filename": "wall_right_up",
		"frame": {"x":936,"y":0,"w":86,"h":260},
		"rotated": false,
		"trimmed": true,
		"spriteSourceSize": {"x":0,"y":0,"w":86,"h":260},
		"sourceSize": {"w":86,"h":260}
	},
	{
		"filename": "wall_right_down",
		"frame": {"x":936,"y":316,"w":86,"h":260},
		"rotated": false,
		"trimmed": true,
		"spriteSourceSize": {"x":0,"y":0,"w":86,"h":260},
		"sourceSize": {"w":86,"h":260}
	},
	
	
	
	{
		"filename": "wall_bottom",
		"frame": {"x":0,"y":490,"w":1024,"h":86},
		"rotated": false,
		"trimmed": true,
		"spriteSourceSize": {"x":0,"y":0,"w":1024,"h":86},
		"sourceSize": {"w":1024,"h":86}
	},
	{
		"filename": "wall_bottom_left",
		"frame": {"x":0,"y":490,"w":484,"h":86},
		"rotated": false,
		"trimmed": true,
		"spriteSourceSize": {"x":0,"y":0,"w":484,"h":86},
		"sourceSize": {"w":484,"h":86}
	},
	{
		"filename": "wall_bottom_right",
		"frame": {"x":540,"y":490,"w":484,"h":86},
		"rotated": false,
		"trimmed": true,
		"spriteSourceSize": {"x":0,"y":0,"w":484,"h":86},
		"sourceSize": {"w":470,"h":86}
	},
	
	
	
	
	
	{
		"filename": "wall_left",
		"frame": {"x":0,"y":0,"w":86,"h":576},
		"rotated": false,
		"trimmed": true,
		"spriteSourceSize": {"x":0,"y":0,"w":86,"h":576},
		"sourceSize": {"w":86,"h":576}
	},
	{
		"filename": "wall_left_up",
		"frame": {"x":0,"y":0,"w":86,"h":260},
		"rotated": false,
		"trimmed": true,
		"spriteSourceSize": {"x":0,"y":0,"w":86,"h":260},
		"sourceSize": {"w":86,"h":260}
	},
	{
		"filename": "wall_left_down",
		"frame": {"x":0,"y":316,"w":86,"h":260},
		"rotated": false,
		"trimmed": true,
		"spriteSourceSize": {"x":0,"y":0,"w":86,"h":260},
		"sourceSize": {"w":86,"h":260}
	},
	
	
	
	
	
	
	{
		"filename": "door_bow",
		"frame": {"x":0,"y":576,"w":126,"h":98},
		"rotated": false,
		"trimmed": true,
		"spriteSourceSize": {"x":0,"y":0,"w":127,"h":98},
		"sourceSize": {"w":127,"h":98}
	},
	{
		"filename": "door_bg",
		"frame": {"x":127,"y":576,"w":86,"h":98},
		"rotated": false,
		"trimmed": true,
		"spriteSourceSize": {"x":0,"y":0,"w":86,"h":98},
		"sourceSize": {"w":86,"h":98}
	},
	{
		"filename": "door",
		"frame": {"x":213,"y":576,"w":86,"h":98},
		"rotated": false,
		"trimmed": true,
		"spriteSourceSize": {"x":0,"y":0,"w":86,"h":98},
		"sourceSize": {"w":86,"h":98}
	}

]

}