[
  {
    "assignment" : "Erstelle ein einfaches Anmeldeformular, zum Abbonieren eines Newsletters.",
    "elements" : [
      {
        "id": 0,
        "type" : "group",
        "name" : "Eingabefelder-Bereich",
        "elements" : [
          {
            "type" : "group",
            "above" : 37,
            "name" : "Eingabefeld mit Label für Vornamen",
            "elements" : [
              {
                "id" : 1,
                "type" : "input_text",
                "title" : "Eingabefeld",
                "subtitle" : "Für Texteingaben",
                "text" : "Vorname",
                "padding" : { "top"     : "1,2",
                              "right"   : "1,1",
                              "bottom"  : "1,2",
                              "left"    : "0,1" }
              },
              {
                "type" : "label",
                "title" : "Label Vorname",
                "subtitle" : "Label für den Vornamen",
                "text" : "Vorname:",
                "left_of" : 1
              }
            ]
          },
          {
            "type" : "group",
            "id" : 37,
            "above" : 38,
            "name" : "Eingabefeld mit Label  für Nachnamen",
            "elements" : [
              {
                "id" : 2,
                "type" : "input_text",
                "title" : "Eingabefeld",
                "subtitle" : "Für Texteingaben",
                "text" : "Nachname",
                "padding" : { "top"     : "1,2",
                              "right"   : "1,1",
                              "bottom"  : "1,2",
                              "left"    : "0,1" }
              },
              {
                "type" : "label",
                "title" : "Label Nachname",
                "subtitle" : "Label für den Nachnamen",
                "text" : "Nachname:",
                "left_of" : 2
              }
            ]
          },
          {
            "type" : "group",
            "id" : 38,
            "name" : "Eingabefeld mit Label  für E-Mail",
            "elements" : [
              {
                "id" : 3,
                "type" : "input_text",
                "title" : "Eingabefeld",
                "subtitle" : "Für Texteingaben",
                "text" : "E-Mail Adresse",
                "padding" : { "top"     : "1,2",
                              "right"   : "1,1",
                              "bottom"  : "1,2",
                              "left"    : "0,1" }
              },
              {
                "type" : "label",
                "title" : "Label E-Mail",
                "subtitle" : "Label für die E-Mail Adresse",
                "text" : "E-Mail:",
                "left_of" : 3
              }
            ]
          }
        ]
      },
      {
        "type" : "group",
        "name" : "Bestätigen-Bereich",
        "under" : 0,
        "elements" : [
          {
            "type" : "button",
            "title" : "Abonnieren-Button",
            "text" : "Abbonieren",
            "padding" : { "top"     : "1,2",
                          "right"   : "1,1",
                          "bottom"  : "1,1",
                          "left"    : "1,1" }
          }
        ]
      }
    ],
    "additionalElements" : [
      {
        "type" : "button",
        "title" : "Bestätigen-Button",
        "subtitle" : "Sendet die Eingaben ab",
        "text" : "Bestätigen"
      },
      {
        "type" : "button",
        "title" : "Abbrechen-Button",
        "subtitle" : "Setzt alle Eingaben zurück",
        "text" : "Abbrechen"
      },
      {
        "type" : "radio"
      },
      {
        "type" : "radio"
      },
      {
        "type" : "radio_selected"
      },
      {
        "type" : "checkbox_unchecked"
      },
      {
        "type" : "checkbox_unchecked"
      },
      {
        "type" : "checkbox_checked"
      },
      {
        "type" : "textarea"
      },
      {
        "type" : "on_switch"
      },
      {
        "type" : "off_switch"
      }
    ]
  },
  {
    "assignment" : "Entwerfe ein GUI-Element für eine Website, welche am Ende einer Seite als Navigationselement angezeigt werden soll.\nDieses soll ermöglichen einzelne Seiten vor und zurückzuspringen, sowie zum Start bzw. zum Ende zu springen. Außerdem soll angezeigt werden, auf welcher Seite man sich derzeit befindet.",
    "elements" : [
      {
        "id": 0,
        "type" : "group",
        "left_of" : 1,
        "name" : "Zurück Gehen - Bereich",
        "elements" : [
          {
            "type" : "button",
            "id" : 66,
            "left_of" : 77,
            "title" : "Erste Seite - Button",
            "text" : "Erste Seite"
          },
          {
            "type" : "button",
            "id" : 77,
            "right_of" : 66,
            "title" : "Vorherige - Button",
            "text" : "Vorherige"
          }
        ]
      },
      {
        "id": 1,
        "type" : "group",
        "right_of" : 0,
        "left_of" : 2,
        "name" : "Label Seitenanzeige",
        "elements" : [
          {
            "type" : "label",
            "text" : "Seite X"
          }
        ]
      },
      {
        "id": 2,
        "type" : "group",
        "right_of" : 1,
        "name" : "Weiter Gehen - Bereich",
        "elements" : [
          {
            "type" : "button",
            "id" : 88,
            "left_of" : 99,
            "title" : "Nächste - Button",
            "text" : "Nächste"
          },
          {
            "type" : "button",
            "id" : 99,
            "right_of" : 88,
            "title" : "Letzte Seite - Button",
            "text" : "Letzte Seite"
          }
        ]
      }
    ],
    "additionalElements" : [
      {
        "type" : "button",
        "title" : "Zurück - Button",
        "text" : "Zurück"
      },
      {
        "type" : "button",
        "title" : "Start - Button",
        "text" : "Start"
      },
      {
        "type" : "button",
        "title" : "Ende - Button",
        "text" : "Ende"
      },
      {
        "type" : "button",
        "title" : "Weiter - Button",
        "text" : "Weiter"
      },
      {
        "type" : "label",
        "title" : "Label - Sie befinden sich hier",
        "text" : "Sie befinden sich jetzt auf Seite X"
      },
      {
        "type" : "button",
        "title" : "+ Button",
        "text" : "+"
      },
      {
        "type" : "button",
        "title" : "- Button",
        "text" : "-"
      }
    ]
  },
  {
    "assignment" : "Entwerfe eine Benutzeroberfläche für einen Musikplayer, von einem Smartphone, welches seitlich (horizontal) gehalten wird.",
    "elements" : [
      {
        "type" : "group",
        "name" : "links",
        "id" : 100,
        "left_of" : 101,
        "above" : 102,
        "elements" : [
          {
            "type" : "album_cover",
            "padding" : { "top"     : "1,1",
                          "right"   : "1,2",
                          "bottom"  : "1,2",
                          "left"    : "1,2" }
          }
        ]
      },
      {
        "type" : "group",
        "name" : "rechts",
        "id" : 101,
        "right_of" : 100,
        "above" : 102,
        "elements" : [
          {
            "type" : "group",
            "name" : "song_info",
            "id" : 120,
            "above" : 121,
            "elements" : [
              {
                "type" : "label",
                "title" : "Songtitel - Label",
                "text" : "Mambo No. 5"
              },
              {
                "type" : "label",
                "title" : "Interpret - Label",
                "text" : "Lou Bega"
              }
            ]
          },
          {
            "type" : "group",
            "name" : "buttons",
            "id" : 121,
            "under" : 120,
            "elements" : [
              {
                "type" : "group",
                "name" : "volume",
                "elements" : [
                  {
                    "type" : "mute_button",
                    "id" : 66,
                    "left_of" : 77,
                    "padding" : { "top"     : "0,1",
                                  "right"   : "0,1",
                                  "bottom"  : "0,2",
                                  "left"    : "0,1" }
                  },
                  {
                    "type" : "slider_horizontal",
                    "id" : 77,
                    "right_of" : 66,
                    "padding" : { "top"     : "0,1",
                                  "right"   : "1,1",
                                  "bottom"  : "0,2",
                                  "left"    : "0,1" }
                  }
                ]
              },
              {
                "type" : "group",
                "name" : "controls",
                "elements" : [
                  {
                    "type" : "back_button",
                    "id" : 4,
                    "left_of" : 5,
                    "padding" : { "top"     : "0,1",
                                  "right"   : "0,1",
                                  "bottom"  : "0,2",
                                  "left"    : "0,1" }
                  },
                  {
                    "type" : "rewind_button",
                    "id" : 5,
                    "left_of" : 6,
                    "right_of" : 4,
                    "padding" : { "top"     : "0,1",
                                  "right"   : "0,1",
                                  "bottom"  : "0,2",
                                  "left"    : "0,1" }
                  },
                  {
                    "type" : "play_button",
                    "id" : 6,
                    "left_of" : 7,
                    "right_of" : 5,
                    "padding" : { "top"     : "0,1",
                                  "right"   : "0,1",
                                  "bottom"  : "0,2",
                                  "left"    : "0,1" }
                  },
                  {
                    "type" : "forward_button",
                    "id" : 7,
                    "left_of" : 8,
                    "right_of" : 6,
                    "padding" : { "top"     : "0,1",
                                  "right"   : "0,1",
                                  "bottom"  : "0,2",
                                  "left"    : "0,1" }
                  },
                  {
                    "type" : "skip_button",
                    "id" : 8,
                    "right_of" : 7,
                    "padding" : { "top"     : "0,1",
                                  "right"   : "0,1",
                                  "bottom"  : "0,2",
                                  "left"    : "0,1" }
                  }
                ]
              }
            ]
          }
        ]
      },
      {
        "type" : "group",
        "name" : "timeline",
        "id" : 102,
        "under" : 101,
        "elements" : [
          {
            "type" : "label",
            "title" : "Aktuelle Zeit - Label",
            "id" : 1,
            "left_of" : 2,
            "text" : "0:00",
            "padding" : { "top"     : "1,2",
                          "right"   : "0,1",
                          "bottom"  : "1,1",
                          "left"    : "1,1" }
          },
          {
            "type" : "slider_horizontal_long",
            "title" : "Timeline",
            "id" : 2,
            "right_of" : 1,
            "left_of" : 3,
            "padding" : { "top"     : "1,2",
                          "right"   : "1,1",
                          "bottom"  : "1,1",
                          "left"    : "1,1" }
          },
          {
            "type" : "label",
            "title" : "Dauer - Label",
            "id" : 3,
            "right_of" : 2,
            "text" : "3:39",
            "padding" : { "top"     : "1,2",
                          "right"   : "1,1",
                          "bottom"  : "1,1",
                          "left"    : "0,1" }
          }
        ]
      }
    ],
    "additionalElements" :[
      {
        "type" : "record_button"
      },
      {
        "type" : "button",
        "title" : "Start - Button",
        "text" : "Start"
      },
      {
        "type" : "on_switch"
      },
      {
        "type" : "off_switch"
      },
      {
        "type" : "dropdown_select"
      }
    ]
  }
]
