[
	{
		"frage": "Sortiere die 7 Handlungsschritte nach Norman",
		"pieces": [
			"Formulieren",
			"Planen",
			"Ausführen",
			"Einwirken und Reaktion",
			"Wahrnehmen",
			"Interpretieren",
			"Vergleichen"
		]
	}
	
]
