{
  "statement_1" : {
    "text" : "Hey du!",
    "next" : "statement_2"
  },
  "statement_2" : {
    "text" : "Wie ich sehe hast du es geschafft.",
    "next" : "statement_3"
  },
  "statement_3" : {
    "text" : "Erst einmal Herzlichen Glückwunsch dafür.",
    "next" : "statement_4"
  },
  "statement_4" : {
    "text" : "Aber kommen wir zu Sache...",
    "next" : "statement_5"
  },
  "statement_5" : {
    "text" : "Siehst du die Truhe da drüben?",
    "next": "statement_6"
  },
  "statement_6" : {
    "text" : "Natürlich tust du das.\nSchwer zu übersehen...",
    "next" : "statement_7"
  },
  "statement_7" : {
    "text" : "Ich werde sie dir öffnen.",
    "next": "statement_8"
  },
  "statement_8" : {
    "text" : "Aber dazu musst du dich zuerst einer abschließenden Prüfung stellen.",
    "next": "statement_9"
  },
  "statement_9" : {
    "text" : "Wenn du dich anstrengst...",
    "next" : "statement_10"
  },
  "statement_10" : {
    "text" : "Kannst du deine Punkte VERDOPPELN!",
    "next" : "statement_11"
  },
  "statement_11" : {
    "text" : "Ja du hast richtig gehört.\nAlles was du dafür tun musst, ist durch die Türe hinter mir zu gehen.",
    "next" : "statement_12"
  },
  "statement_12" : {
    "text" : "Dahinter befinden sich eine Reihe von Räumen.\nIn jedem dieser Räume musst du eine meiner Fragen beantworten.",
    "next" : "statement_13"
  },
  "statement_13" : {
    "text" : "Nur wenn du sie richtig beantwortest, gelangst du in den nächsten Raum.",
    "next" : "statement_14"
  },
  "statement_14" : {
    "text" : "Beantwortest du auch nur eine einzige Frage falsch, ist die Prüfung vorbei.",
    "next": "statement_15"
  },
  "statement_15" : {
    "text" : "Also wähle weise. Denn je mehr Fragen du schaffst, vor Ablauf der Zeit, richtig zu beantworten, desto großzügiger wird meine Belohung für dich ausfallen.",
    "next" : "statement_16"
  },
  "statement_16" : {
    "text" : "Warte ...\nhabe ich etwa gerade 'vor Ablauf der Zeit' gesagt?",
    "next" : "statement_17"
  },
  "statement_17" : {
    "text" : "Natürlich habe ich das. Du brauchst schließlich mal eine richtige Herausforderung.",
    "next" : "question_1"
  },
  "question_1" : {
    "text" : "Also... Hast du verstanden, was zu tun ist?",
    "answer_1" : {
      "text" : "Ja klar, lass uns loslegen!",
      "next" : "statement_19"
    },
    "answer_2" : {
      "text" : "Nein, erklär es mir besser nochmal.",
      "next" : "statement_18"
    }
  },
  "statement_18" : {
    "text" : "Nagut. Also nochmal von vorne!\nAber diesmal pass auch auf!",
    "next": "statement_5"
  },
  "statement_19" : {
    "text" : "Sehr gut! Gehe einfach durch die Tür wenn du bereit bist...",
    "next": "statement_20"
  },
  "statement_20" : {
    "text" : "...aber denk dran. Du hast nur genau einen Versuch!",
    "next": "statement_80"
  },
  "statement_80" : {
    "text" : "Viel Glück!",
    "next": ""
  },




  "statement_21" : {
    "text" : "Ich muss sagen, etwas mehr hätte ich schon von dir erwartet.",
    "enter": "success_failed",
    "next" : "statement_22"
  },
  "statement_22" : {
    "text" : "Mit diesem Ergebnis hast du dir die Belohnung nicht verdient. Tut mir leid.",
    "callback" : "success_failed",
    "next" : ""
  },

  "statement_23" : {
    "text" : "Garnicht mal schlecht. Dir fehlt vielleicht noch etwas die Übung, aber das kommt schon noch.",
    "enter": "success_okay",
    "next" : "statement_24"
  },
  "statement_24" : {
    "text" : "Deine Belohnung hast du dir auf jeden Fall verdient.",
    "callback" : "success_okay",
    "next" : ""
  },

  "statement_25" : {
    "text" : "Super! Du warst wirklich verdahmt gut!",
    "enter": "success_good",
    "next" : "statement_26"
  },
  "statement_26" : {
    "text" : "Damit hast du dir deine Belohnung mehr als verdient.",
    "next" : "statement_27"
  },
  "statement_27" : {
    "text" : "Los, geh und hol sie dir!",
    "callback" : "success_good",
    "next" : ""
  }

}
