[
	{
		"question": "Was macht der Compiler in Java?",
		"choices": {
			"a": "Er wandelt Java Code in für den Rechner lesbaren Code um",
			"b": "Er ist mein Freund",
			"c": "Er wandelt für den Rechner lesbaren Code in Java Code um ",
			"d": "Er wandelt Java Code in C Code um, weil ein Rechner C besser lesen kann"
		},
		"answers": ["a", "b"]
	}, {
		"question": "Welche Methode sollte man benutzen, um ein Objekt in ein String umzuwandeln?",
		"choices": {
			"a": "Object.toString();",
			"b": "(String) Object;",
			"c": "toString(Object);",
			"d": "String str = Object;"
		},
		"answers": ["a"]
	}, {
		"question": "Wie sollte man seinen Java-Code kommentieren?",
		"choices": {
			"a": "JavaDoc für Methoden und Inline Kommentare zur Unterstützung",
			"b": "Nur JavaDoc",
			"c": "Nur Inline Kommentare",
			"d": "Am Anfang der Klasse eine Doku schreiben",
            "e": "Zusätzlich noch Inline Kommentare bei komplizierten Abschnitten"
		},
		"answers": ["a", "e"]
	}, {
		"question": "Wo beginnt der Bereich für Lateinische Buchstaben in der ASCII Tabelle?",
		"choices": {
			"a": "65",
			"b": "0",
			"c": "1",
			"d": "128",
            "e": "56"
		},
		"answers": ["a"]
	},
	{
		"question": "Welche der folgenden Aussagen trifft/treffen auf Klassenkonstruktoren zu?",
		"choices": {
			"a": "Werden beim Erzeugen von Objekten einer Klasse aufgerufen.",
			"b": "Verändern den Anfangszustand eines neu gebildeten Objektes der Klasse nicht.",
			"c": "Auch wenn ein leerer Konstruktor benötigt wird muss dieser angegeben werden.",
			"d": "Es kann keinen, einen oder mehrere in einer Klasse geben."
		},
		"answers": ["a", "d"]
	}
]
