[
	{
		"question": "Was ist kein NUI?",
		"choices": {
			"a": "Kinect",
			"b": "Wiimote",
			"c": "Hand tracking",
			"d": "Maus"
		},
		"answers": ["d"]
	}, {
		"question": "Womit nimmt die Kinect Tiefe wahr?",
		"choices": {
			"a": "Laser",
			"b": "Structured Light",
			"c": "Gliedermaßstab",
			"d": "Schall"
		},
		"answers": ["b"]
	}, {
		"question": "Was Geschieht in der Captur-Phase eines GUI-Baums?",
		"choices": {
			"a": "Pfadsuche Root -> Ziel",
			"b": "abfangen von Fehlern",
			"c": "Filtern von Events",
			"d": "fangen einer Phase"
		},
		"answers": ["a"]
	}, {
		"question": "Wer fängt in der Capture-Phase Events ab?",
		"choices": {
			"a": "Event-Filter",
			"b": "Event-Fänger",
			"c": "Ich",
			"d": "ein Baum"
		},
		"answers": ["a"]
	}
]
