{
    "statement_1" : {
    "text" : "Hallo Abenteurer!",
    "next" : "statement_2"
    },
    "statement_2" : {
    "text" : "Du musst mir helfen diese Käferplage zu beseitigen. Diese Bugs zerfressen das ganze Dungeon!",
    "next" : "statement_3"
    },
    "statement_3" : {
    "text" : "Aber nicht jeder dieser Käfer hier ist ein Bug! Manche halten das Dungeon auch am Leben!",
    "next" : "statement_4"
    },
    "statement_4" : {
    "text" : "Wenn du mir also helfen willst, dann schieße nur die Bugs mit den FALSCHEN Antworten auf die Frage ab, lasse die mit den RICHTIGEN Antworten auf die Frage durch!",
    "next" : "statement_5"
    },
    "statement_5" : {
    "text" : "Nach jeder Welle kannst du wieder zu mir kommen oder den Raum verlassen! Höhere Wellen geben mehr Punkte, sind aber schwieriger! Los geht's!",
    "next" : "statement_6"
    },
    "statement_6" : {
    "text" : "Welche Datentypen sind Zahlen-Datentypen? Drücke 'E', wenn du bereit bist! Schieße mit 'F'! Komme danach wieder zu mir!",
    "next" : "statement_7"
    },
    "statement_7" : {
    "text" : "Du hast es geschafft! Es gibt aber leider noch mehr Bugs hier...",
    "next" : "statement_8"
    },
    "statement_8" : {
    "text" : "Und diese Bugs werden immer fieser! Das nächste mal wirds also nicht so einfach!",
    "next" : "statement_9"
    },
    "statement_9" : {
    "text" : "Wenn du bereit für noch eine Runde bist, dann schieße die falschen Antworten auf diese Frage ab:",
    "next" : "statement_10"
    },
    "statement_10" : {
    "text" : "Was ist grün? Drücke wieder 'E', um zu starten! Ich habe danach aber noch mal eine Aufgabe für dich!",
    "next" : "statement_11"
    }, 
    "statement_11" : {
    "text" : "Es sind immer noch so viele Bugs! Du musst mir unbedingt weiterhelfen! Sie werden immer schlimmer!",
    "next" : "statement_12"
    }, 
    "statement_12" : {
    "text" : "Frage? Drücke wieder 'E', um zu starten! Das werden aber sicher nicht die letzten Bugs sein!",
    "next" : "statement_13"
    }, 
    "statement_13" : {
    "text" : "Soweit ich weiß, sollten das jetzt die letzten Bugs sein! Die sind aber richtig fies und schnell!",
    "next" : "statement_14"
    }, 
    "statement_14" : {
    "text" : "Frage? Drücke wieder 'E', um zu starten!",
    "next" : "statement_15"
    }, 
    "statement_15" : {
    "text" : "Vielen Dank, dass du mir geholfen hast! Auf Wiedersehen!",
    "next" : ""
    }   
    
}