[
	{
		"question": "Ein AVL-Baum ...",
		"choices": {
			"a": "ist eine spezielle Form des binären Suchbaums.",
			"b": "ist immer komplett ausgeglichen.",
			"c": "kann pro Knoten, beliebig viele Kindknoten haben.",
			"d": "ist ein umgekehrter Binärbaum."
		},
		"answers": ["a"]
	},
	{
		"question": "Was ist ein Iterator?",
		"choices": {
			"a": "Ein Objekt, welches eine Datenstruktur rekursiv durchläuft",
			"b": "Ein Objekt, welches eine Datenstruktur sequnziell durchläuft",
			"c": "Eine Methode, welche ermöglicht eine Datenstruktur zu durchlaufen",
			"d": "Eine schnellere while-Schleife"
		},
		"answers": ["b"]
	},
	{
		"question": "Wann ist ein Binärbaum 'entartet'?",
		"choices": {
			"a": "Wenn jeder Knoten entweder ein Blatt ist oder nur ein Kind hat.",
			"b": "Wenn jeder Knoten ein Blatt ist oder genau zwei Kinder hat",
			"c": "Wenn seine maximale Tiefe, gleich seiner Anzahl an Knoten ist",
			"d": "Der Begriff 'entartet' gilt nicht für Binärbäume"
		},
		"answers": ["a"]
	},
	{
		"question": "Welche Art der Traversierung liefert die Elemente eines geordneten binären Suchbaums in korrekter Reihenfolge zurück?",
		"choices": {
			"a": "In-Order",
			"b": "Pre-Order",
			"c": "Post-Order"
		},
		"answers": ["a"]
	}
]
