[
	{
		"question": "Welche dieser Eingaben sind NUIs?",
		"choices": {
			"a": "Kinect",
			"b": "Wiimote",
			"c": "Hand tracking",
			"d": "Maus"
		},
		"answers": ["a", "b", "c"]
	}, {
		"question": "Womit nehmen Kinects Tiefe wahr?",
		"choices": {
			"a": "Laser",
			"b": "Structured Light",
			"c": "Time of flight",
			"d": "Schall"
		},
		"answers": ["b", "c"]
	}, {
		"question": "Was Geschieht in der Captur-Phase eines GUI-Baums?",
		"choices": {
			"a": "Pfadsuche Root -> Ziel",
			"b": "abfangen von Fehlern",
			"c": "Filtern von Events",
			"d": "fangen einer Phase"
		},
		"answers": ["a", "c"]
	}
]
