[
	{
		"question": "Schieße die oder den Käfer ab, welche(r) ein falsches Kriterium für Usability trägt:",
		"choices": {
			"a": "Effektivität",
			"b": "Effizienz",
			"c": "Zufriedenheit",
			"d": "Performant"
		},
		"answers": ["a", "b", "c"]
	},
	{
		"question": "Wie kann man Fehler des Nutzers vorbeugen?",
		"choices": {
			"a": "Abbrechen Funktion bereitstellen",
			"b": "Feedback nach Eingabe geben",
			"c": "Verschiedene Farben benutzen",
			"d": "Pop-Up Fenster mit Erklärungen bereitstellen"
		},
		"answers": ["a", "b"]
	},
	{
		"question": "Wie übersetzt man am besten das Wort 'Usability'?",
		"choices": {
			"a": "Gebrauchstauglichkeit",
			"b": "Benutzerfreundlichkeit",
			"c": "Gute Interaktion",
			"d": "Intuitivität",
            "e": "Zufriedenheit"
		},
		"answers": ["a"]
	},
	{
		"question": "Mit welchen zwei Organen nehmen wir die meisten Eindrücke auf?",
		"choices": {
			"a": "Augen",
			"b": "Ohren",
			"c": "Haut",
            "d": "Nase",
            "e": "Innenohr"
		},
		"answers": ["a", "b"]
	},
    {
		"question": "Welche der folgenden Begriffe verbindet man mit den okulomotorische Kriterien?",
		"choices": {
			"a": "Texturgradient",
			"b": "Fokussierung",
			"c": "Luftperspektive",
            "d": "Verdeckung",
            "e": "Sehwinkel"
		},
		"answers": ["b", "e"]
	}
]
