[
	{
		"question": "Was beschreibt die Syntax einer Sprache",
		"choices": {
			"a": "Ihre Struktur",
			"b": "Die Bedeutung der Sprachelemente",
			"c": "Ihre Lesbarkeit",
			"d": "Das Häufigkeit des Wortes Sinn in ihr"
		},
		"answers": ["a"]
	},
	{
		"question": "Worauf bezieht sich die Semantik einer Sprache",
		"choices": {
			"a": "Auf die Struktur",
			"b": "Auf die Bedeutung der Sprachelemente",
			"c": "Auf Ihre Lesbarkeit",
			"d": "Auf ihre Wohlgeformtheit"
		},
		"answers": ["a"]
	},
	{
		"question": "Eine syntaktisch korrekter Ausdruck wird auch ... genannt",
		"choices": {
			"a": "semantisch korrekt",
			"b": "vollständig",
			"c": "wohlgeformt",
			"d": "allumfassend"
		},
		"answers": ["c"]
	},
    {
		"question": "Welche der folgenden Aussagen trifft nicht auf Klassenkonstruktoren zu?",
		"choices": {
			"a": "Sie tragen immer den Namen der Klasse.",
			"b": "Sie können überladen werden (mehrere Konstruktoren)",
			"c": "Sie besitzen einen Rückgabewert",
			"d": "Werden mit super() erweitert, wenn ihrerseits ein anderer Konstruktor aufgerufen werden soll"
		},
		"answers": ["c"]
	}
]
