{ 
	"type": "minecraft:crafting_shaped",
	"pattern": [
		" A ",
		" SA"
	],
	"key": {
		"S": [
			{ "item": "minecraft:chicken" },
			{ "item": "minecraft:beef" },
			{ "item": "minecraft:porkchop" },
			{ "item": "minecraft:mutton" },
			{ "item": "minecraft:rabbit" },
			{ "item": "hwell:hamburger" }
		],
		"A": [{ "item": "hwell:mutation_paste" }]
	},
	"result": { "item": "minecraft:porkchop" }
}