{
  "name": "lenovo-moto",
  "version": "0.1.0",
  "author": "lenovo",
  "summary": "",
  "license": "Apache-2.0",
  "source": "",
  "operatingsystem_support": [
    {
      "operatingsystem": "CentOS",
      "operatingsystemrelease": [
        "7"
      ]
    },
    {
      "operatingsystem": "OracleLinux",
      "operatingsystemrelease": [
        "7"
      ]
    },
    {
      "operatingsystem": "RedHat",
      "operatingsystemrelease": [
        "8"
      ]
    },
    {
      "operatingsystem": "Scientific",
      "operatingsystemrelease": [
        "7"
      ]
    },
    {
      "operatingsystem": "Debian",
      "operatingsystemrelease": [
        "9"
      ]
    },
    {
      "operatingsystem": "Ubuntu",
      "operatingsystemrelease": [
        "18.04"
      ]
    }
  ],
  "requirements": [
    {
      "name": "puppet",
      "version_requirement": ">= 4.10.0 < 7.0.0"
    }
  ],
  "dependencies": [
    {
      "name": "puppetlabs/stdlib",
      "version_requirement": ">= 4.19.0 < 7.0.0"
    },
    {
      "name": "puppet/python",
      "version_requirement": ">= 2.0.0 < 4.0.0"
    }
  ],
  "pdk-version": "1.13.0",
  "template-url": "pdk-default#1.13.0",
  "template-ref": "1.13.0-0-g66e1443"
}
