invert693a918d9ff5b4dd72f7e928,invertcca85e8b94da606828dea3b5
invertf49ce4ce01e593a2e5406d76,invert1adc08078133373d2b45c8b5
invert09e9944c32901e7c9f493d30,invert873b58f1e91b4d4ed202d33c
invertde4298865b9df2108f15c0bf,invert647a2515784f35b85fac63f1
invert6fa473823a0da990f1bc8467,invertacadb042bb7eff4412c46d0d
invert56440a1b0e13df4bfb0aef82,invertae491e5d1e8f50bbceb1cf79
invertacf537a49a1fe27e665e313e,invert90a1f81cb6f8ec43ea6632f5
inverte552fcac208968d436b60cd2,invert7ea1e309d44dcdb9772c887c
invert619f6c7272bbae0b836dffd9,invert63ee3e80e5692d3b1472bf6c
invert14d75d4715cc9e0256d20f70,inverta530bb7cd4d3c0d27eaeef88
invertce3cab2ade330a1b317146e2,invertf06ece050eaba2bad43aab31
invertbc59125cde5f203e5a9a490e,invert34cb6bb6ebddad11b6800b9a
invert78b4c4f2c3401f8f4e71d437,invertaf4a9bc75625c20a0dcd3723
inverte1672aad342846963e1600d4,invertbddce57bf11892a287678eeb
invert506d76b200bbf20d57b7126f,invertc146d030d1928c72cbbc7a11
inverte902fe66af70a12b05d8b080,invertb88be52de2e07527ea970156
invert91ecdff34496d65d2178db61,invert2e7ea1bca837d22f6b6e0d39
inverte03d7cc526842d59c2c25507,invert392caa7c1a9980b3875c2ef7
invert17569c7aa4e804814b35c2ce,invert007d9eef80620987427ea522
invert67b13611fb8c5691b7a6f3d8,invert19c8ee9b2b597ef97fd51598
invertf613a428deacb37cfbeaf813,invert6ca6106598a5ed8c8acb157a
invert0d710a0d69916f29b45a80c5,invert997348efecba91c50d2d06d0
invert5c8e4db4aa3685828b6ea6bc,invert77268127cf8441d3ad34658d
invert457ea29b554e2e03eeeda7d4,invert3e4dc3962c033a2c53015241
invert55b6a55fdc98c13363c87b48,invertaeacfb838738e8071dac2007
invertd8f0d3ddde6ee0f6ba75d665,invert0885b2379c6417c3c4926d15
invertb22c5712530c2dd3654c5c62,invert2b40f247a1b634389ce20777
invert0514f0b2cf9194f14de44175,invert60d1110de1eeee7190dd7926
inverta261229eb60895e498309b79,invert9d4d5c7f26478348b09bb544
invert372b552ca65592e29073f8d1,invertfc5357c63c89435a596944e4
invert7e136f186737aff173018b81,inverta3f7d131d625b2b3548646cb
invertbc9de846ef78ec7d6cfefc8f,inverteb88892247b4e1c9628fdaaf
invert55bf69d8ad03970a41ddd7eb,invert473704fb3bb6e4ec33aa7fcf
invertb8f32a66935f9f55b08d50c4,invertc19e2d030f992a92fdfb32d9
invertc21bb71e96adcb3b7a491632,invert1a1bc5c4c950de41ad790921
invert95a5236efb3c11512a2d2769,invert1b4748ca17e395622a32331b
invert741bdedaf695cf201b51f2b2,invert63e8668cd23ef7d82effb6b4
invert62e930aee7a7215ff9ce29e8,invertfb8c29a3800d681dfdd67ed6
invert7f639379ba78a541710c9600,invert2781959ab87342b9b77bceb5
invert841fa33f3687f6839ed0d92f,invert351faf9404b3e5fad391fd5a
invert6770ba93fbc05fcc6809eb26,invert3458cea9c2f9710ec738ab34
invert5c13d40fd4c6333f21b8145f,invert218b628fbb3500ba9f6e5564
invert8985e6f09d4ab63b35202353,invert2991983abc132358bfb0369f
invertbe6edbe8c1720de57ce32b55,invert765fd189eeec21b2b1fc39db
invert65d2e3c2d3c7ed864ab0b70a,invert347438bf0a6e1732dec74dea
invert3f5d3d4fa01798219ab66e5e,invert4f822fccbcafbb6370c3782b
invert1f199abd20c5501289823cfb,invertb33f0516fb04c343f0716021
invertb591d7a69ea98ec65ef5b56e,invert574c858bec0716d081ba1a3b
invert9442cdc1e48ba3198bfa1653,invert2718df0b12cdca9c4e758e92
invertc5e4148bec8d637c94c49fb3,invert44410e69201ff827dcf0d009
invert1715010e5cf26d3f8616c2ce,invert27d07ef84d88ab2c7d5cf219
invertb2daeeb207a375786ad8650f,invert41d59b55ea3821524f097950
invertc644eb4cdc95763ea570860b,invert01a0ecfe389770bdd788131f
invert5c4da5d867b863e6b26054ed,invert6a4682404cda003a2d184580
invert9c30d41b760e873bf2ad7883,invert463cbaa80cb2a76e61df0ad3
invertd342b1a7215f035f6d43998a,invertb7456168e04051f17aa08e8c
invertdbe03ae1d19a460461300929,invertd68456b59b997ab27877b4cf
invert13c685ea81f27f3bed3fe259,inverte4d990ae77d49a028d860fd1
invert34bb642665396c11bfaddbb6,invert489a1a2cc16f2ac58b426ae0
invertcab6f332e1e44b4eada52f61,invert45c32f48929c4edb54453ad8
invert0e5a4a0488bd3de01784a025,invertd7c7969cdfd9514b70da6f53
invertb3051d064bfef56fbdc871ca,invert31ee3508b391746c530c36a8
invert0604b837ba992866e1cab6b2,invert2566b0c8fd8e949038c5d65d
invert7946f19b81662cb43aca2f1f,invert5b41565ac0beaef90dd3d504
invertd06f5905a2e7967b1adfad5d,invert424fdd920d5602ce22a4ad7d
invert4f1da4cbd49d807a9e238e31,invert59a574c31ff3ee81ce53e809
invert3835006d4678c254c6a15044,invert9d55ef03172b1ee4efb871a3
invert12953e1901f6fa8726f73109,invertf998e288a13b77b52eba3a9c
invertff737469da6a316b04ec4198,invert56b116fa23e238bd1793bbaf
invert190a2001504215dd5580837a,invertf03a99129d6b12fd7a737f76
invertd369e3321d1fc5b3588bd169,invertb01f235ce9d5b01803ff6dd0
invert831c6affcff215301f1d1862,invert15cfa74b25af0f9b957aedd9
invert54ae4232d3ea5cd6772804b0,invert521e391318bbca8297c9a6d5
invertf15d42d654380f8de71358da,invertf68089f029dc6df50fdd9f32
invert42fa01510a1a130d638054c3,invertb009cc4897751d5a960b9465
invert370716d7d30ef7cfe8b76b12,inverta3aa7067523121f438df5ff2
invert243f4a0e4eb796f98d8e62e8,invertf735a042e4269747df9d5ccd
invert91399b90a4764ce616662574,invert7d4e1ed9f20b5127e2485339
inverta495ddf4949d25de9557acff,invertbcdb617e0703d01ab09b8f50
invert679deaed547737244a61cd9f,invert68fa491b6bc62b8ef16fb494
invert7d46153e0c97339d751a76af,inverta97b613ca24a1cd238b137b4
invert208384143c4c2688518a809d,inverte6e1cd96aa512979b5d8e284
invertc5b2127de63ea69046de0b05,invert347e3951f9ef2ccf85b9a26e
invert4ca2a0c25de64f4853db1c8e,inverta81a14c229066c0b3357a36b
inverte0edf7af32916d9d3be52e7d,invertd9e84d78e4772a5f849e373a
invert29fd3524721a2c14f50b0de8,inverta8f832d5eb2d071da1bd78ee
invertb0453e26712148ad6e658942,invertce4d4572d11d257d41ff3c70
invert4b9f6b9efbd19dc629d79a48,invertc3b82ad076b8c218c932f6e5
invert800cddd3148012734cd795ec,invertf31b6739a6f47a15584526e0
invertd94753ed35120f308f6dbf5f,invert92bc5bd71e7555a8e7a26145
invert0a114e5a59551b155b5b3f39,invertf324a1e545397bc4ae2c1879
invert9d5f59920e90aa1bcbb05b39,invertc96b7a2c6d80417c8dd71916
invert7d971f1bd1806b82c8acb9e9,invert4f92cd50840e3b16324b87a4
invert4942a166c927f035c5675bb7,invertfd75c9acff409674250b3eb3
invert6f133abd10ae74a5f72aaf65,invert4b6d1f10776efc155716c627
invert1f3546ec7518787790615cc3,inverte94111865d8953a85e2ce81d
invert989e1f3f897d3d8d7651e217,inverta3a65d96037192e8631dadd7
inverte4dc69b28b1f1c656ad9775b,invert18e637301be635d147c02851
invert44f00c75e472166954ac5a77,invert66052ada92190bee424246e2
invertb1a0a38aecdac5576d8b1971,invert58552a1e59b9b9f63bac494e
invert79befed2f54f0d956999e0e7,invert60b14be21d169ab621edc551
invert3176c365a8635fac35bd7007,invert2de7253f70684466a0da70ac
invert91e8e826642e875403323b2a,inverte3f749aa52a6cb33cc803227
inverte7c9e98b48a43b6e07acd9f7,invert6b54c4330f204a83ba7cb131
invertd59f9e9aa9a4fef1e22b6798,invert35e1ffc2d78f6a8303853b2f
invertf51ff58d7ba54954d60f9904,invertc7df79808fb43f51676f44de
inverta5d739d5cff6b2b80a14cbd1,invert9c83c2456e4e6b129603ccba
invert9086101c31f330398ed3cb9d,invertbedf637f159906a700c24a7a
inverte4c14fb37bf04c6f8ad86cb4,invert5f28227ff12c82b5629086d2
invert7ce7f71e5aa1636b1dcb5b46,invert2bb3a83f05a1c0c1db66800c
invertb5f93d0234b83261f7eb507f,invertb854bda83e54bf129134d3f1
invertdc7defa3dbbc06f638bc3bdc,invertba266efc26f0b7d53790256c
invert114860edf071ae49a99284a9,inverta76535216e30cd37c96f72a4
invert52925005e7b5df6d995684fb,invert0e2ff3b434dcc7af6749b1c8
invert3e78112025fee29432160fab,invertf871963ce415313aa7c66945
invertefdfc09e6cb46bdd1dd41cf3,invertc8479f2e0bc94a0f723b5aab
invert68d9b79f020f40738335ae91,invert625ccd72abc43fbba2a12671
invert039d0b7fa8443598f277668d,inverte28716717829015ee0651c78
invert55ad062ac3c097b19529b857,invert5aebcb0194789c53a22e538d
inverte7561e044f38af8fa709812a,invertedc3ad853f924133ec75da40
invert55a5fd9517219755c9b38fc1,invert235d6d16d9811bf5d4ad4b38
invert8d8e9005065186468ce3fd88,invert9429f35edca2f671693f3b74
invert91cce19f6c6727bbcff9855c,invert973310ce673daf74b8d8d8fd
invert1d8f617a8f6291beb5e4d447,invert791f9fae8fa87f32c017f390
invert46d7fc8f171fc758a1540f9f,invert95723e94dbcb9aa49a646555
63bd70367cd71b409b8cbe26,c5d3b90902dc34b64f167b00
d4a9dffeb261e6245633cf24,2e69984a9608434ecb57116a
7a5a9b06a4ecdc0b31571a56,08141f4a49b4af5e60799835
6e0d84f958f05b99320753b0,567de20049d68756d5de71c7
d6dcfbd8122ae91be4ce07e5,6a02ae60693659d00a49cef0
b76cb490bbcac6a5b6ac68ea,3654a89a5e583e72a0c491f0
53c0ede15e83f5f095ff5fd3,e06d2968e08bc297347b45c0
4703edc4c8e52e95899152d0,b585c2aff45bff950d3196a1
cb2ee9637f5512081ad8cf79,acb1322255dfb623fb22bd26
50c812aa6a512a69bfc9f320,8014da8678aabd403c7d2f7c
0bea511fcf43b164dcc64061,5a00923d9cf39f5ac6a3219d
55282cf65aba8d57ecbd44f7,becba239ebfc571425384b31
916aaf6c7a13a8b071835ab1,3c424fafc62cb399735f9a44
4095770742389e239d387b8a,e617033949267fd161e14d28
839f29a3c375ef471d5b5616,3f8664b92ccfa8be6de50ddd
fe9a2643ccd70550ac554fd6,ada310b4dd66f507a5c97521
e842936e7c7f259e4fb02249,233b9a4cab9b87d73bce50fd
b10bf808fc46fcaaba9b99c8,bc010f8cc045cbe7acc76f58
02a60a6dd9ff6759716ec64f,78b6f189a035d785d9a3634d
d22bda0141e8165eed664c1a,8acb612513ddef7ce9406884
2b74a43a8310c496b8d16e50,e85fa35cd1cfbc1296db45b9
391514370d8299061aa36207,43cc7d21204f11c509dfe665
703f856d783ddfa38a4a07a8,63fd86d01a1817034cbadf97
aac737cd6daf066be4703c34,e7db7b1c3148d25d13c1ab5e
888cc6f77c3366aa21f88633,c854c6882a0e5f7d638b17f2
faa0be70560e3dee4f7adfab,9a2f98472b7ab827ab7ff56a
ded1cf69cd616c20a20a902e,2da7787edad02da08636fdbd
71e1302fef715705197c32b1,a29710e82816f0ff3989a0cf
51aacec51e30472068d9804b,04e8405e9504ce480d7c74ad
e15643964bb97a758bde2878,5210039aced682cb07714065
b47e0256fe1943094e52e5d9,649731109467104c2a6c5b5a
c256290dd1960cf89e047175,f5025d1b86fa687c0956dc8f
219410f4076e7375092bdecf,76ffbeaf17257ff63dc9f020
ca33892ee729f268be2be3b3,3f3f0846795322b29419e53d
b8f496cc43cfd99b35d91a83,ea14a97dcb0f16a974a612ec
50e76d8fe273b6c5bf43956e,ec9f3525e3c938f97b9f52e5
1a6eaca73bd915fde046f58d,f2210c00b5b12b0c5235888f
4ff09f7557cb6ded0b3dc4d2,1bf4fa7f4c57e34027cdbb95
a00980a6f4337a5c90ce70b7,06353a191db8300f491f96fb
e62cd65fd5112e158ab3127e,47848cd4ffff4df41684e5a0
08be874ada561dc0e777d904,a40ba67021deeb135a718d8b
317ea174132c498283e5574a,040cfd25d9a35f1ae7b6df32
c3c8cbd619414324f1509701,a78c3b36d27ae2077c5c4fb9
40e8e7366be489a8dbc7ffcb,7bfa5fe485007ece7c5c8080
26fefc3bc46461dc4a01380f,ecdfce1396a44e3a1a3e30ab
7a64000a57f154f7b786498a,81ba6ccff094cc90fe7536a6
861ae0ae5ae6ec0e0520549a,5e11f94d4e99b5e6d5744d62
1d3f916d0264bb726b1ac15b,c1f8cb985dc118095bb93bcf
92daeaaaf4f143531600efa8,e09dcea48d24f9b929bc7008
e20c244a7a5e611085578261,31390c38cfcc49e7f37226f2
942ac333885636cadabf06cd,f70779fdc6f59e0c4f7bf40a
a31c18f4c79039b8f175d7f8,19e253c65bd48c468ef16c97
aff2429cc392a8e043373b2a,ebec3cb7ef5c687b47582e14
5fe95744b2cf767bf3f9a5a0,16e06d0332d410a57f637bbd
e27481d22e0891c49b73db73,d7607c9826b70712a7036474
7ba6c6037486c82e4587255f,e6454dc324b4d2c9b7067f15
f0fce747653ad408362638f7,eeae30d97dff5ae0359befd7
ceee3f94cd3c0d566d527608,4c556224a66d410d4cd7ee65
762edfd4789c6aa2919e7431,cc1192823e1debc373b58238
994c79f30b7067ff4e114aee,12e251f30430405858beb959
ef493873e506db0abc7b7339,01ae9e412905db0e6b61792d
8d1d77259dcec6877d3fbd7f,ec72997275ed06b0e9ead268
f57c545ad892e93351e55792,1f7c08d6c51f47ae4d413892
10719f7042900cc5e5bbd443,534e6a515bbcc70dc8abb488
9644eb1b1b14cb3ab0306460,9dbc159dc9142c0bbf8e3ba3
cf4c5c89d9ac0d524b09fd71,3fb12f872f1cc657bfc53cf8
82f119a0ca4e8bf9dd75760b,a251c54f11ec0157ada41ced
63b7f5bd3784b575f6a1aa0b,e47b66a783377071e4223215
92a7f09ffd47199791ebacac,3b36a753bfc1ed9036fa59df
826eaec212feef5abaa9d31d,e83fea883730a0f99e01933f
8ed376e5d05af8828598a0d2,a72d57e7af6538362d099fae
c38c06d656611a2179fe0fbc,634c92e776314bc8218fae08
463a42119c729f8eea5ffaa4,ab1a92a602caab4f9148cd1e
3bb7ff561b317a04599de475,8bd93c33c99f50d8238df10b
d7c7870a760cf9b56b0d31a8,aa8d66162b8312496f8797a3
3c1525a9369e766b3d85d6b4,d65303ec760a086ae592410e
255d09d13e4053a3ece37f92,24307c7b3ee40384cea55f7c
58bd166e3213da6ce14d7246,d4a2e589310548a455555f70
787d38e978b5cedff4b1dd5d,7f4651fcf1c0ecd4dde489cc
592ac1954133e9f824d1cf88,fbbafb364b5081156ac962af
8d3b49e9c48bec96288b3381,f4a324ce13fdfe8198a687f3
0cd9c2c708a8f3936f9d2a28,55bccc177033bac60f4789c2
da0b00e5864cad09d46d6065,81fe7c6f154fe9df625e0d11
00a43076a7e1df86286cf613,505f55913c30c34e93ca0f0b
c8e5fd21ca92da4073f84ab3,fe850460b6bbfd7b1b92ba0f
6576818a5dc944f4388ed74b,b475ac989aa4f29a14118659
d639c8cc6c5247ea43a72513,4afbef58e4635dd3d6e73b79
cdd77e854089e637d23d2f40,6b35efece16a67065b4a4f03
8757e0a344406b91b7d86a90,f70a6910770f1fb35e5edb00
8e02708384a01f9347c7bdd2,7a31658e01cf12d13dbd43ff
2aba12143010b21b9c1aadb9,aa784715826c5f26508d4568
e71257e67aa001afe75a88b8,3918bc7ac2766420fcee1443
a2222eef9439c5e664fdee9d,c3d4713453d6376f62b6de73
e7dc1581bd95c39e202e5d2b,164fbd7da20cf433a2001298
4993fa205a490a21faf96e3c,998d0555e8234c368c2688e3
28aabb02dde029ba7c8fd865,0516e63c5896c41c33615fc2
10799fd4dfb0a3635aba4c1b,af6697ae0a3480ab23a683e9
dfdc50dcf07f56fc69636bb3,6685ab88c7d9545f81d278eb
8013a2e93d58ea3d119ef2ff,d42f61b4401039762f51383f
fa28ffe98e8b83c0ea64e0d7,e03bc89b26ed8a74ca0a7374
e64d0c5831158827dd522b94,fa17ed8b986d64c8bc17f0c8
4be136dae26ce9b8246d1e8c,7732db8c43bb057d5d17f7b6
f30ab7ca8d14eaed8be5b422,240ff4e3c307d7400e6e6539
ef500c95be975c369b2bed39,cffb2037c89597f6bb4a6180
6a989ca3a70e986fb6f2bfa5,89966e4db0c1a14d036e8f5d
82499806b14c2b69017c525f,ceaccc31d95136d108051ea8
ac9a329661231c17a007d924,4c69e94f5207600bc123cb0a
8a0a31d87f5589a1558eb11a,25646a29a1d291aa51925c1a
0693de2c70a339bb890d841d,ab1de2048e73063f2fadfee9
e004cf96dfc1bf73b7c0b568,93b244423270423f3667b94e
56e5c1980165c09919e08ebf,c1bfc2f72fac583dfdb8f9f3
f7854dd108438a2ac5a4f2c1,d7683b6b0f288156b01e4bab
b56ec89fe68d4205bf1d6cbb,348b48155800f75dd37f2e64
83b90a7cf63e049710b13232,6825fb4f2285933e640ec29e
e8e9977b3491b177f37f2d93,7f2692968f509dbd1aff6e30
c67ef2fc5939ae7670ccf764,5285726791edf7d5d35e796a
4ad894a5dbe3f1d5f63fc335,db9d19038dd6124a40c55e64
8a40be684aa246b3349e5d22,f61a9d11a9f39564d4d494b5
6c99d1765d8c3f70dde30992,e611e9f6c369f09064973eeb
ea2462525c1b6725ef41c7a9,411f4d58fbec4a04388b4200
333f3e31b3f58b74695cdf98,27d04255832f990ce596b040
3c5492526eab67f2c25186bf,55a48654f6bb4ed4766049dd
cc210b4c2434be7b69945458,8f78c7dfb3873c6044150c1b
77921f17f8c0b35d8d0b198e,7e601605562acbbca6c114e4
46363853b752a38936c91ec4,f791da50825aa582c1a623b9
f96af6bc49815793667ceddb,4a819b8b9b87f91cb680d8ed
1bd964e21c6a952a72945ff9,bf70c438005d056fc7e7f466
e6fb1c7e999e605435ff2bac,0ed62dc5af39c638011d7b93
