Product Name,Price
Lenovo PC portable - IDEAPAD 3 -15IGL05 N4020 4GO 1TO - GRIS,949.00
Hp Pc HP15 - N4020 4Mo Cache - 8 G - 1Tb - Win10 - Garantie 1an,1299.00
Lenovo Pc portable 15.6FHD - 4GO - 1TO Freedos - Blue,999.00
Lenovo PC portable - IDEAPAD 3 15IGL05 N4020 - 4GO -1TO - Bleu,949.00
Asus Pc portable - Asus vivobook e210ma - dual core - 4 go - Pink,839.00
Asus Pc portable - Asus vivobook x515ep i5 11gén - 8go - 512go ssd silver,2175.00
Lenovo IdeaPad3 - Intel  I3 10émé Gén - 8G - 1Tb - Garantie 1an,1575.00
Hp Pc Portable  Duel-core N4020 / 4 GO / 1To / Windows10 / Garantie 1 an,1199.00
Lenovo Portable IP3 - AMD 3050U - 8G - Radeon Graphic - Garantie1an,1049.00
Asus Pc portable - Asus vivobook x415ea - i7 11è gén - 8 go 512ssd hd 14 - Grey,2519.00
Hp Pc portable HP15 - N4020 - 4GB -1TB - silver- Win10 - Garantie: 1 an,999.00
Lenovo Portable - V15 - Intel N4020 - 4Go - 1To - Garantie 1 an,799.00
Lenovo IdeaPad3 - I3 10éme - 8G - 1T + Sac T210 - Garantie 1an,1599.00
Lenovo PC Portable - V14 - 14 Pouces - N4020 - 4G - 1T + Sac B210,1049.00
Gigabyte PC gamer - G5 MD - Windows 10 home - Garantie 1an,4119.00
Apple MacBook Air 13 pouces M1 - 256 Go - Clavier Azerty - Gris Sidéral - Garantie 1 an,4050.00
Lenovo Pc portable - P3 3050E -15.6FHD - 4GO - 1T Freedos - Gris,999.00
Lenovo Pack pc portable - Sacoche - Flash disque - Imprimante,1250.00
Apple MacBook Pro 14 - Puce Apple M1 Pro - Gris Sidéral - Garantie 1 an,9475.00
Hp PC PORTABLE HP 15- I5 11GEN - 8GO -1TO - Noir - Win11 - Garantie: 1 an,2099.00
DELL PC Portable Gamer - G15 5510 I5 10È GÉN 8GO GTX 1650,2699.00
Hp Pc portable HP15 -N4020 - 4GB -1TB - noir - Win10 - Garantie: 1 an,999.00
Asus Pc  X543MA - N4020 - 4G- 1Tb - Gris - W10 - Garantie 1an,1049.00
Lenovo Pc Portable V15 N4020 Dualcore 4G 1T - Garantie 1an,1039.00
Infinix INBOOK X2 - Intel i3-1005G1- 256GB-4GB - Bleu,1399.00
Lenovo Pc portable - P3 3050E - 15.6 - 4G -1T Freedos - Noir,999.00
Asus I5-11400h - 8g 512ssd rtx 3050 - 4g win 11 - Black,3389.00
Asus Pc portable - Asus vivobook x415fa - i3 10è gén - 4 go - Silver,1299.00
Lenovo IdeaPad3 - Intel I3 - 8G - 1Tb - Garantie 1an,1425.00
Lenovo Portable - IP3 - N4020 - 4G - 1T - Gris - Garantie 1an,999.00
Lenovo PC Portable -v15 4020 - DualCore - 4Go - 1To - Silver - Garantie 1An,1000.00
Lenovo Portable - IP3 - Intel - Windows 11 - 1T + Sac à dos Promate,929.00
Hp Pc HP15 - I3 11éme Gén - 8 G - 256 SSD - W10 - Garantie 1an,1799.00
Lenovo PC portable IDEAPAD 3-81WQ00GSFG,679.00
Asus Pc  X543MA - N4020 - 4G- 1Tb + Souris et sac ASUS - W10,1049.00
Apple MacBook Pro 13 pouces Puce Apple M1 - 512 Go - Clavier Azerty - Gris Sidéral - Garantie 1 an,5680.00
Lenovo Portable - V15 - AMD Radeon - 8G - 256 SSD M2 - Garantie 1an,1099.00
Lenovo Pc Portable Gaming 3 I5 11È-Fhd- 8Go- 512ssd - 4g Rtx 3050Ti,3100.00
Hp PC PORTABLE HP 15- I5 11GEN - 8GO -1TO- GRIS  - Win10 - Garantie: 1 an,2099.00
Msi I5-11éme  8G Ram 512SSD 4G GTX1650 - Garantie 1 an,3100.00
Finish Tablettes Lave-Vaisselle - 45 Tabs,55.00
Nuk Liquide vaisselle Biberons et Tétines 500 ml,25.00
NADHIF Poudre main - Regular - 300g +50g Gratuit,2.21
W5 Tablettes lave-vaisselle - 40 Tabs+ 4 Gratuit,40.00
Finish Sel régénérant lave vaisselle - 2 Kg,27.90
Judy Judy Javel Parfumé 15L Forêt,3.08
Judy Judy Javel Parfumé 15L Lavande,3.08
Finish Pastilles Lave-Vaisselle Powerball Classic 40 Tablettes Lave-Vaisselle,44.00
NADHIF Poudre main - Savon marseille - 300g+50g Gratuit,2.24
Ariel ARIEL poudre machine DOWNY POLYBAG - 4KG,37.19
Vanish Oxi Action Gel Détachant textile - Liquide - 1L,24.90
Finish Sel régénérant lave vaisselle - 1 Kg,20.00
Dash Lessive liquide - 23 lavages fleurs de lotus et lys,29.99
NADHIF Gel Machine - Regular - 3L,21.67
Ariel Liquide Lessive - Reg - 2.5L,29.99
Vanish Pistolet Détachant Avant-Lavage - 500ml,28.90
Ariel Lessive Capsule - Pods Alpine - 31 Dosettes,49.99
Lilas Javel Parfumé Foret 3L,3.99
Dixan Gel Machine - Regular - 3L,20.85
Dash Lessive liquide - 23 lavages - Fleurs de frangipanier et mandarinier,27.99
Scoop Pack de 2 Assouplissant 1L,6.00
Pierre d'argent Détergent - Nettoyant universel - 100 % Naturel - 300 gr,35.00
Ariel Ariel Liquide Lessive - Reg - 18kg,27.19
Vanish Poudre détacheur Oxi Action - 450g,25.90
Ariel Lessive Capsule - Pods Original - 31 Dosettes,39.99
Lilas Assouplissant douceur extrême - 3L,16.99
SIC Mécano - Savon &amp; Abrasif - Détergent Pâte - Mains - 4 Kg,18.90
Dash Lessive liquide - 23 lavages – Coquelicot et fleurs de cerisier,29.99
NADHIF Poudre main - Savon marseille - 1kg+150g Gratuit,7.28
Calgon Tablettes Anti Calcaire pour Machine a Laver - 17 tablettes,39.90
NADHIF Gel Machine - Rose - 3L,21.67
Judy Judy Linge 2L semi-automatique Ct,6.52
Ariel Liquide Regular - 2.5L - Equivalent à 5 Kg Poudre,45.00
Chicco Adoucissant Fleurs Délicates 750ML,24.00
Scoop Assouplissant  5L + Lessive Liquide Concentré 1 L,10.00
Finish Pack lave Vaisselle 40 Tablettes + Sel régénèrent 2 Kg,66.50
Chicco Adoucissant Lait Doux Sweet Talcum 750ML,24.00
Finish Pack lave Vaisselle - Tablette + Liquide Rinçage + Sel régénèrent,88.50
W5 Sel Régénérant - 2Kg + Tablette Lave Vaisselle 40 Tabs - W5,79.00
Boules anti-mites - Naphtaline - Sachet de 100gr - Kafour,9.00
Indomie Indomie Sachet Nouille Légume Méditerranéen 70Gr,0.91
Indomie Indomie Nouilles cup curry 60 Gr,1.93
Indomie Indomie Nouilles cup poulet 60 Gr,1.93
More Life Nutrition Lot de 10 Power Cups - 10 x 50g,27.00
Saida Break Vanille Kids,0.21
Indomie Indomie Sachet Nouille Bœuf 70Gr,0.91
Indomie Indomie Nouilles cup légumes 60 Gr,1.93
DCROC DCROC Biscuit 110G - Tiramisu Kif,1.72
Daiyl'n Tarte Saveur Amande - 75g,0.60
Smile Smile Biscuit - Chocolat Kif,1.55
Indomie Indomie Sachet Nouille Poulet 70G,0.91
Binto Binto Biscuit Kif - Binto,1.59
Indomie Indomie Nouilles cup Bœuf 60 Gr,1.93
Fourré Fourré Biscuit Kif - Fourré,1.60
More Life Nutrition Lot de 4 Power Cups - 4 x 50g,10.90
Saida Saida Groupe 4 Mini Gateau,2.40
Saida Saida Sablito Chocolat,1.66
Sucre Erythritol  sucre naturel-250g,23.75
CEREALIS CEREALIS Finger Snax - Pizza 70 Gr,2.40
Smile Smile Biscuit - Noisette Kif,1.55
Smile Smile Biscuit - Chocolat lait Kif,1.55
Saida Mini Gaufrette 165G - Vanille Cc 60,0.20
Lay'S Chips Sel 45G,2.06
Saida Mini Gaufrette 165G - Chocolat Cc 60,0.20
Swing Swing Biscuit Kif,0.27
Daiyl'n Brownies Pépites,0.60
DCROC DCROC Biscuit 110G - Chocolat Kif,1.72
Golden Golden Crokidos Paprika 18 Gr,0.45
Saida Break Chocolat,0.53
Saida Mini Gateau,0.60
Saida Break Vanille,0.53
Saida Saida Prince Fourre Vanille,1.40
CEREALIS Finger Snax - Hot&amp;Spicy Cheese 70 Gr,2.40
Saida Saida Plum Cake,0.71
Saida Saida Major Chocolat,1.40
Doritos Chili 100 gr,4.37
Saida Sablito Fraise,1.66
Saida Brownie Chocolat,0.71
FLIGHT Donut cake Mosaïque goût Caramel 50G,0.58
Ferrero Rocher Coffret raffaello - 15 Pièces,29.00
Tiba Pack de 06 bouteilles D'eau - 1.5L,3.48
Delice Delice Pack de 06 Lait UHT - 1/2 écrémé - 1L,8.10
Coca-cola Coca-cola Boîte - 24Cl,0.98
Delice Delice Jus Poire 20Cl,0.80
Delice Punch Orange - 15L,2.36
Delice Delice Déli'o Pomme - 25Cl,0.78
Delice Punch Cidre - 15L,2.50
Delice Jus Mangue 20Cl,0.80
Delice Delice Punch Pomme 0.3L,0.95
Coca-cola Coca-cola - 1L,2.19
Delice Delice Jus Poire - Fruits Délice 1L,2.90
Delice Pack de 06 Lait Enrichi - Délisso lait - 1L,11.70
Delice Delice Punch Cidre - 03L,0.95
Delice Punch Lime 1L,2.05
Delice Jus Mangue - Fruits Délice 1L,2.90
Delice Delice Fruzzy Orange - 125 Ml,0.45
Delice Delice Punch Pomme 15L,2.50
Kent Kent Café 2 en 1 - 12g,0.83
Boga Boga Lim - 1L,2.19
Delice Punch Pomme 1L,2.05
Delice Punch Cidre - 1 L,2.05
grand-mère Café Grand Mère 250 gr,9.11
Delice Delice Punch Pulpe Orange 1.5L,2.65
Delice Delice Soluble Café Aggloméré Recharge 50G,4.31
Delice Delice Lait Arom Choc 20Cl Gouter,0.80
KYUFI KYUFI The Vert Soluble Menthe Ss Sucre 9G,7.32
CAFFEITALIA CARAMEL - Paquet de 10 Capsules compatibles Nespresso,11.00
Delice Pack de 06 Lait écrémé - 1L,11.70
CAFFEITALIA CAPUCIN - Paquet de 10 Capsules compatibles  Nespresso,12.00
Stil Stil Jus Stil Orange - 1L,2.55
KYUFI KYUFI The Vert Soluble Menthe Av Sucre 75G,7.32
Delice Delice Punch Orange 1L,2.05
Golden Coffee 30 Capsules Espresso - Décaféine,32.80
Stil Stil Jus Stil Ananas - 1L,2.55
Coca Cola Coca-Cola - 30 Cl,1.04
CAFFEITALIA Compatible Nespresso Paquet De 10 Capsules - PREGIO - 2 Paquets + 1 Gratuit,35.00
Torrie Pack de 60 capsules Expresso - Compatible Nespresso,85.00
CAFFEITALIA NOISETTE - Paquet de 10 Capsules compatibles Nespresso,11.00
Expresso Italia Boite de 16 capsules Cappuccino - Compatible Dolce Gusto.,27.00
Torrie Pack de 60 capsules Angola - Compatible Nespresso,85.00
Essence Mascara Lash Princess  False Lash ,13.90
Garnier SkinActive Biphase Micellaire - Tout En 1 Waterproof - 400 ml,23.99
Garnier Eau Micellaire Skin Active - Tout en 1 à l'Eau de Rose - 400ml,20.50
Topface Make-up Style Eyeliner Noir Tiny  - 01,19.90
Garnier SkinActive Biphase Micellaire Tout en 1 - Waterproof - 100ml,12.40
Maybelline New York Fit Me! - Fond de Teint Matte - 115 Ivoire,33.72
Dodo Girl Palette -  Nude,65.00
Maybelline New York Superstay 24 Matte Ink - Encre à Lèvres - 15 Lover,37.99
Maybelline New York Superstay 24 Matte Ink - Encre à Lèvres - 65 Seductress,37.99
Topface Make-up Style Huile Primer Vitamine,30.70
Essence Extreme  Plumping  Lip Filler,12.90
Maybelline New York Superstay 24 Matte Ink - Rouge à lèvres - 130 Self,37.99
Azal Hydra Tint Solution Colorante Lèvres &amp; Joues - Bella - Rouge Foncé - 20ml,18.50
Maybelline New York Superstay 24 Matte Ink - Encre à Lèvres - 70 Amazonian,37.99
Maybelline New York Instant anti-age - Gomme anti-cernes - 01 Chair clair,42.00
Essence Lipgloss - Extreme Shine 01,12.90
Maybelline New York Superstay 24 Matte Ink - Encre à Lèvres - 20 Pioneer,37.99
Maybelline New York Mascara - The Falsies Lash Lift - Noir - Waterproof,42.50
Maybelline New York Fit Me! - Anti-cernes - 25 Medium,31.99
Topface Make-up Style TOPFACE Skin Editor Matte Dipliner,17.90
Maybelline New York Mascara - The Falsies Lash Lift - Noir,42.50
Doris Baume À Lèvre Cerise  - 8ml,6.00
Maybelline New York Instant anti-age - Gomme anti-cernes - 07 Sable,42.00
Eveline 8in1 Total Action Sensitive,17.80
Azal Hydra Tint Solution Colorante Lèvres &amp; Joues - Anna - Rouge - 20ml,18.50
Maybelline New York Superstay 24 Matte Ink - Encre à Lèvres - 118 Dancer,37.99
Maybelline New York Fit Me! - Fond de Teint Matte - 128 Warm Nude,33.72
Revolution Eyesh15 - Reload Newtrals2 (181358),37.00
Maybelline New York Fit Me! - Fond de Teint Matte - 110 Porcelaine,33.72
Maybelline New York Instant anti-age - Gomme anti-cernes - 06 Neutraliser,42.00
Essence Lip Filler - Acid Hyaluronic,12.90
Revolution Palette Fard à Paupière  RELOADED AFFECTION(138222),37.00
Romantic Bird Palette fard a joue &amp; contour,20.00
Topface Make-up Style Mascara Rich Curl Instyle - Noir,21.00
Eveline Express Hard - Durcisseur d'ongles Express 72H,19.80
Doris Tint Solution Colorante Lèvres &amp; Joues Rouge - 12 Ml,12.90
Gabrini Contour yeux et Lèvre Waterproof - Eye &amp; Lip Pencil - 09,19.00
Romantic Bird Palette fard a joue &amp; contour,22.00
Gabrini Contour yeux et Lèvre Waterproof - Eye &amp; Lip  Pencil - 16,19.00
Maybelline New York Superstay Ink Crayon à Lèvres - Seek Adventure - n°30,35.99
Garnier SkinActive Eau Micellaire - Tout en 1 - Peaux Sensibles - 100 ml,9.30
Garnier SkinActive Eau Micellaire - Tout en 1 - Peaux Sensibles - 400ml,20.29
Essence Mascara Lash Princess  False Lash ,13.90
Garnier SkinActive Biphase Micellaire - Tout En 1 Waterproof - 400 ml,23.99
Garnier Eau Micellaire Skin Active - Tout en 1 à l'Eau de Rose - 400ml,20.50
Garnier SkinActive Biphase Micellaire Tout en 1 - Waterproof - 100ml,12.40
Kit de Gommage - Beauty Blender + Brosse Silicone - Multi-couleur,20.00
Topface Make-up Style Eyeliner Noir Tiny  - 01,19.90
Maybelline New York Fit Me! - Fond de Teint Matte - 115 Ivoire,33.72
Maybelline New York Superstay 24 Matte Ink - Encre à Lèvres - 15 Lover,37.99
Topface Make-up Style Huile Primer Vitamine,30.70
Maybelline New York Superstay 24 Matte Ink - Encre à Lèvres - 65 Seductress,37.99
Essence Extreme  Plumping  Lip Filler,12.90
Maybelline New York Superstay 24 Matte Ink - Rouge à lèvres - 130 Self,37.99
Azal Hydra Tint Solution Colorante Lèvres &amp; Joues - Bella - Rouge Foncé - 20ml,18.50
Maybelline New York Superstay 24 Matte Ink - Encre à Lèvres - 70 Amazonian,37.99
Dodo Girl Palette -  Nude,65.00
Maybelline New York Instant anti-age - Gomme anti-cernes - 01 Chair clair,42.00
Sesderma C-Vit - Sérum liposomal - 30ml,162.50
Essence Lipgloss - Extreme Shine 01,12.90
Maybelline New York Superstay 24 Matte Ink - Encre à Lèvres - 20 Pioneer,37.99
Kit Épilation - Chauffe Cire Multi Couleur + Cartouche Cire Miel + Papier Cire,40.00
L'Oréal Paris Elseve Huile Extraordinaire Oil Replacement - 125ml,12.40
Maybelline New York Mascara - The Falsies Lash Lift - Noir - Waterproof,42.50
Maybelline New York Fit Me! - Anti-cernes - 25 Medium,31.99
Topface Make-up Style TOPFACE Skin Editor Matte Dipliner,17.90
Doris Baume À Lèvre Cerise  - 8ml,6.00
Eveline 8in1 Total Action Sensitive,17.80
Sensea Coton Disque Doux pour Démaquiller Yeux et Peaux Sensibles 80 Pcs,7.50
Azal Hydra Tint Solution Colorante Lèvres &amp; Joues - Anna - Rouge - 20ml,18.50
Veet Crème dépilatoire Silk &amp; Fresh - Peaux Sensibles - 100ml,20.00
Revolution Eyesh15 - Reload Newtrals2 (181358),37.00
Essence Lip Filler - Acid Hyaluronic,12.90
Gum Dentifrice Paroex,20.00
Romantic Bird Palette fard a joue &amp; contour,20.00
Byphasse Crème Définition Boucles cheveux 250 ml,25.50
K-REINE Sérum réparateur ultra nutri-liss 60ml,26.00
Kit épilation cire - ( appareil chauffe cire - cartouche cire -20 papier),45.00
Sonar Tondeuse rasoir rechargeable - SN6020,45.00
Kit de pinceaux de maquillage professionnelle,35.00
Doris Coffret Parfum GLAMOUR Florale Pour Femme - 100ml,90.00
Doris Parfum Corps et Cheveux Moon - 0%Parabène 0%Alcool - 150ml,20.00
Cristian Lay Parfum - Femme - Diamond Intense - 50 ml,62.00
Cristian Lay Eau de parfum - Cl Diamond femme- Jaune transparent,45.00
Kyzel Brume Parfumée - Blooming Spring - 200ml,18.00
Cristian Lay Eau de Parfum- Blush for Woman- Rouge -,90.00
Lattafa Eau de parfum - YARA,90.00
Smart Collection Eau de parfum pour homme - N°313 - 100 ml,60.00
Doris Coffret Parfum CLASSY FLORALE AMBRE Pour Femme -100ML,90.00
Cristian Lay Eau de Parfum Blush Temptation,90.00
Tesori Tesori Eau De Parfum D Oriente Mixte H Argan Hammam 100Ml,19.15
Doris Coffret Parfum CLASSY FLORALE AMBRE Pour Femme,90.00
Cristian Lay Eau de parfum -Clm -Spécial -Edition-Blue -Homme-100ml,90.00
Prive Brume Corporelle Parfum Panorama 250ml,23.00
Cool Breeze Parfum Splash Cotton Candy 250 Ml - Cool Breeze,25.00
Lattafa Ana abiyedh - eau de parfum -30ml,45.00
Kyzel Brume corps - Pure Love - 200ml,17.00
Cristian Lay Lot-Eau de Parfum- Blush for Woman- Rouge -Lait de corps,109.00
Chronic Men Parfum Chronic Men Gentel 100ml,35.00
Cristian Lay Parfum - Femme - Diamond - 50ml,42.00
Kyzel Brume Parfumée - First Desire - 200ml,18.00
Lella Parfum femme EDP - norie bloom - 100ML,60.00
Doris Parfum Corps et Cheveux Lili Fleur- Sans parabène - Sans Alcool -150ml,20.00
Lt Piver Parfum Lotion Héliotrope Blanc pour Femme - Eau de Toilette - 100ml,25.00
Doris Body splash florale fraiche 200 Ml,25.00
Rasasi Hawas - Eau de Parfum- pour homme- 100ml,180.00
Black Open pour Femme - Eau de Parfum - 100ml,38.00
Doris Coffret Soin Corps Florale Fraîche- Noir,45.00
Cristian Lay Eau de parfum -MOMENTOS- Femme-100ml,70.00
Chronic Men Parfum Homme Honest 100ml,25.00
Lella Eau de Parfum Pour Femme - Belle  - 90 ml,49.00
Kyzel Brume Parfumée - Yellow Vibes - 200ml,18.00
Lattafa YARA - LATTAFA-EAU DE PARFUM -POUR FEMME 100 ML,100.00
Lord Of Fragrance Oculus - Eau de toilette - 100ml,42.00
New Dance pour Femme - Eau de Parfum - 100ml,38.00
Musk Noir Pur sans alcool Musk Tahara Original,12.00 - 35.00
Repute Eau De Parfum Femme - CHIC,37.50
Armaf Club de nuit intense - Eau de Toilette - 105ml,170.00
Armaf Club de nuit sillage - eau de parfum - 105 ml,170.00
Lattafa Badee al oud - lattafa - eau de parfum - unisexe,140.00
Redmi NOTE 10S - OCEAN BLUE - 8G RAM - 128G ROM - Garantie 1 An,1069.00
Infinix HOT11 Play - 6.82 - 4 Go - 64 Go - Haze Green - Garantie 1 An,569.00
Samsung Galaxy A03 - 6.5- Rouge - 4Go - 128Go - Garantie 1An,659.00
Infinix Smart 6 - 6.6 - 3 Go - 64 Go - Noir - Garantie 1 an,499.00
Infinix Hot 11 - 6.6 - 4 Go - 64 Go - Polar Black - Garantie 1 an,599.00
Samsung Galaxy A13 - 6.6- Bleu - 4Go - 64Go - Garantie 1An,799.00
Infinix Smart 6 - 6.6 - 3Go - 64Go - Quetzal Cyan - Garantie 1 an,499.00
Samsung Galaxy A03 - 6.5- Bleu - 4Go - 128Go - Garantie 1An,659.00
XIAOMI Redmi Note 10 Pro - 8 Go - 128 Go - Onxy Gray - Garantie 1 an,1219.00
Samsung Galaxy A13 - 6.6- Bleu - 4Go - 128Go - Garantie 1An,899.00
XIAOMI Redmi Note 11 - Graphite gray - 6GB RAM - 128GB ROM,999.00
Samsung Galaxy A03 - 6.5- Noir - 4Go - 128Go - Garantie 1An,659.00
Samsung Galaxy A32 - VIOLET - 6+128GB,1128.00
Infinix Smart 6 - 6.6 - 3 Go - 64 Go - Ocean Blue - Garantie 1 an,499.00
Samsung Galaxy A13 - 6.6- Noir - 4Go - 64Go - Garantie 1An,799.00
Infinix Smart 6 - 6.6 - 2 Go - 32 Go - Polar Black - Garantie 1 an,420.00
XIAOMI Redmi Note 11S - 8Go - 128Go - 108MP - Bleu Twilight - Garantie 1 an,1129.00
Infinix HOT11 Play - 6.82 - 4 Go - 64 Go - Exploratory Blue - Garantie 1 An,569.00
Samsung Galaxy A13 - 6.6- Peach - 4Go - 64Go - Garantie 1An,799.00
Realme C11 - 6.5 - 2 GO - 32 Go - Iron Grey- Garantie 2 Ans,379.00
Apple iPhone 13 Pro Max - 6.7 - 128GB - Bleu alpin - Garantie 1 an,6463.50
Samsung Galaxy A13 - 6.6- Blanc - 4Go - 64Go - Garantie 1An,799.00
Jbl Go 2 - Noir,119.00
Versus Téléphone Portable X7 -Noir Et Bleu - Garantie: 1 an,49.00
Infinix Note 11 - 6GB RAM - 128GB ROM - Celestial Snow - Power Bank + Bouteille Isotherme Gratuits,799.00
Infinix Hot 12 - 6.82 - (4+3) GO - 128 GO - Legend white - Garantie 1 an,679.00
Samsung Galaxy A32 - BLUE - 6+128GB,1128.00
Realme 8 - 6.40- 8 Go - 128 Go - Cyber Silver - Garantie 2 ans,839.00
Huawei Y9 A - Pink (FRL-L22) - 8Go/128Go,1149.00
Samsung Galaxy A32 - BLACK - 6+128GB,1128.00
XIAOMI Redmi 10C - 6.71- 4Go - 64Go - Gris - Garantie 1 an,729.00
Infinix Hot 12 - 6.82 - 4 Go - 64 Go - Legend White - Garantie 1 an + Cover Special Edition Free Fire,619.00
Versus Téléphone Portable X7 -Noir Et Rouge - Garantie: 1 an,49.00
Apple iPhone 11 - 6.1- 64 Go - Noir - Garantie 1 an +  Apple Earpods Offertes,3299.00
Infinix Hot 12 - 6.82 - 4 Go - 64 Go - Origin Blue - Garantie 1 an + Cover Special Edition Free Fire,619.00
XIAOMI Redmi Note 11 - 4GB RAM - 128GB ROM - Graphite gray - Garantie 1 an,899.00
Apple IPhone 13 Pro Max - 6.7- 256GB - Graphite - Garantie 1 an,6999.00
Infinix Hot 12 - 6.82 - 4 Go - 64 Go - Racing Black - Garantie 1 an + Cover Special Edition Free Fire,619.00
XIAOMI Redmi 10 2022 - 6.5 - 4 Go - 128 Go - Gris- Garantie 1 an,899.00
Versus Téléphone Portable X7 -Noir Et Vert - Garantie: 1 an,49.00
Samsung Galaxy TAB A8 X200 - 10.5- 3Go - 32Go - Gray - Garantie 1 An,699.00
XIAOMI MI LCD Writing Tablet - 135'',89.00
Samsung Galaxy TAB A8 X200 - 10.5- 3Go - 32Go - Silver - Garantie 1 An,699.00
Vega Tablette 4G ITAB A1 -Duos - 7 IPS - 4GB Ram - 32GB - 3000mAh - Pochette et Anticasse- NOIR - Garantie 1an,349.00
Huawei Media pad - T3 - 10 - 2Go - 16Go - Space Gray - Garantie 1 An,549.00
Huawei Media pad - T3 - 10 - 4800 mAh - Space Gray - Garantie 1 An,549.00
Etui iPad Pro 97 1ère génération (2016) - 360° - Noir,100.00
Nokia Tablette -T20 -Bleu -10.4 - 4G- 4 GO- 64 GO - Garantie 1 an,709.00
Samsung Tablette - TAB A8  - 10.5 - 3 Go - 32 Go - Gray - Garantie 1 an,939.00
Apple Smart cover - Rose - pour iPad mini 1 - 2 - 3 - MD968ZM/A,115.00
Huawei AGS-L09 - T3 - 10 HD  - 2Go - 32 Go - 4G  - Play Store - 4800 mAh - Grey- Garantie 1 An,699.00
Etui iPad mini 79 pouces - 360° - Noir - LCPB-IPADMINIR,70.00
Protect Pochette &amp; clavier Pour Android - Pour tablette 7'' &amp; 8'',49.00
Versus Tablette V777 -  7.0  - 2 Go - 16 Go  - 3G - Gris - Garantie 1 An,299.00
Samsung Tablette - TAB A8  - 10.5 - 3 Go - 32 Go - Silver - Garantie 1 an,939.00
YOOZ Pochette tablette - Similicuir- 7  - Standard,19.00
Etui pour Tablette Huawei T2 - Gold,25.00
Iku T4 - 7 - 1 Go - 16 Go - Double Sim - Turquoise  - Garantie 1 an,259.00
XIAOMI Mi LCD Writing Tablet 13.5 - Garantie 6 mois,99.00
Mini Clavier Bluetooth Androïd - Noir,49.00
Apple Smart cover cuir - Marron - pour iPad 2 - 3 - 4 - MD302ZM/A,173.00
Huawei Flip cover - MatePad T8,59.00
Lcd Tablette d'écriture - LCD - Rose - 10.5pouse,59.00
Apple Smart cover pour iPad 2 - 3 - 4 - Cuir bleu marine ,173.00
Étui Tablette - Simple - Rose - 7 Pouces,19.00
Kit Écouteur Casque Pour PC,15.00
Etui - Pour iPad mini 79 pouces - 360° - Rouge,70.00
Hexabyte Xpad X7 - 7 - 1 Go - 8 Go - Noir - Garantie 1 an,299.90
Huawei MatePad T - 10 - 2Go - 32Go - Deep Sea Blue - Garantie 1 An,599.00
Etui à rabat pour Tablette Lenovo  A3300,39.00
Tablette-Graphique-Portable LCD -Écriture- Dessin- Graffiti,25.00
Support de tablette - Métal - Tout type de tablette,59.00
Etui-Tablette-BLEU,15.60
Iku T4 - 7 - 1 Go - 16 Go - Double Sim - Turquoise - Garantie 1 an,270.00
Samsung Tablette - TAB A8  - 10.5 - 4 Go - 64 Go - Pink - Garantie 1 an,1039.00
Etui - Compatible avec IPAD-10 pouce-noir,38.00
Gigaset Téléphone sans Fil A116 + Porte clé - Garantie 1 An - Its,119.00
Kids Tablets LCD - Writing Tablet - noir,79.00
Samsung Tablette - TAB A8  - 10.5 - 3 Go - 32 Go - Pink - Garantie 1 an,939.00
Versus Tablette V777 - 3G - Gris - Ecran 7'' - Garantie 1 an,459.00
Infinix Earphones XE20 TWS - Noir,75.00
Infinix Earphones XE20 TWS - Blanc,75.00
XIAOMI Redmi Buds 3 Lite - Blanc,89.00
Jbl T510 - Noir,219.00
Jbl GO 3 - Noir,159.00
Support Cell Phone flexible avec selfie - Ring Light for Live Stream,99.00
Jbl T110 Filaire - Noir,41.00
Écouteurs Bluetooth 543 - 3ème génération -Blanc,120.00
YooKie Kit airpods - Avec afficheur - Noir,140.00
P47 Casque Bluetooth - Noir,50.00
Finger Manches - Mobile game - Compatible avec Android et iOS - Noir,25.00
Borofone Écouteurs sans fil BW03 avec microphone intégré - Android  ios et pc,199.00
Artek Smartwatch - Rose Gold,189.00
Qcy Ecouteur bluetooth - T13 - Noir,139.00
inPods 12 Écouteurs Stéréo Bluetooth 5.0 Sans Fil - Rose,79.00
Haut Parleur - Bluetooth Portable - USB - carte mémoire,49.00
Kit Tournevis Outils Réparation GSM - IFixer,11.00
Jbl Tune 115 - Noir,205.00
Jbl Go 2 - Noir,119.00
Borofone Ecouteur Filaire jack - Bright Sound White 1.2M pour Samsung Huawei Oppo Xiaomi Infinix,30.00
Qcy Ecouteur -T1C - Noir,99.00
pochette waterproof pour smartphone,25.00
Case en Silicone pour Samsung Galaxy A52 - Noir,49.00
Ring light LED 3 Lumières,150.00
TX Tws écouteurs bluetooth,60.00
Smart watch V11 - Noir - 1.44 pouces,89.00
Tecno Earphone TECNO P1 V2.0 - Rouge &amp; Noir,18.00
Ecouteur - Simple - Blanc,29.90
Haut Parleur Rechargeable Radio Bluetooth - GT-111 - Noir - EXTRA BASS,49.00
Microphone Karaoké Haut-parleur Bluetooth - ROSE,49.00
2 en 1 Microphone Karaoke et haut-parleur - Bluetooth - sans fil - Gris,34.90
Support de voiture pour Smartphone,100.00
Air EAR PHONE air 15 rouge,129.00
VR SHINECON Casque de Réalité Virtuelle 3D - Pour Smartphones Android iOS de 4.7 à 6.53,69.00
Écouteurs Bluetooth V5.0 - Super Bass,150.00
Mibro Smart Watch - Connectée - MibroX1 - By XIAOMI - Noir,299.00
Support de téléphone multifonction rétroviseur de voiture avec rotation à 360° réglable,84.00
Inkax Ecouteur Sans fils T03 - Bluetooth,149.00
Casque  Bluetooth  P47 - Blanc,39.00
Smart Watch - Montre connectée - 1.3 - Noir,99.00
