{
  "blogs": [
    {
      "title": "Avant Apres Changement incroyable !!",
      "author": "Marwen",
      "body": "Apres suivi les conseilles de ce site, je viens de perdre 20 kilo en seulement 30 jours, c'est incroyable !!!",
      "date": "2021-12-26 15:01:40.014Z",
      "id": 3
    },
    {
      "title": "avis",
      "author": "Salah",
      "body": "j'ai trop aimé le site",
      "date": "2022-01-12 20:11:54.766Z",
      "id": 4
    },
    {
      "title": "Avis",
      "author": "Tony",
      "body": "j'ai perdu 5 kg en 1 mois merciii !!!",
      "date": "2022-01-21 21:22:07.469Z",
      "id": 5
    }
  ],
  "Login": [
    {
      "id": 1,
      "nom": "Mouna",
      "motpasse": "123456789"
    },
    {
      "id": 2,
      "nom": "Marwen",
      "motpasse": "123456789"
    }
  ]
}