Place,Name,Sex,Event,Division,WeightClassKg,Equipment,BirthYear,Team,State,BodyweightKg,Squat1Kg,Squat2Kg,Squat3Kg,Best3SquatKg,Bench1Kg,Bench2Kg,Bench3Kg,Best3BenchKg,Deadlift1Kg,Deadlift2Kg,Deadlift3Kg,Best3DeadliftKg,TotalKg,Age,BirthDate
1,Isabel Olivarez,F,B,F-T1,63,Single-ply,2005,,TX,62.33,,,,,67.5,75,77.5,77.5,,,,,77.5,,
DQ,Adam Harper,M,B,MR-O,93,Raw,1989,,NM,90.9,,,,,-157.5,-157.5,-157.5,,,,,,,,
1,Paul Gates,M,B,MR-O,120,Raw,1961,,TX,114.7,,,,,147.5,155,-157.5,155,,,,,155,,
1,Isabel Olivarez,F,D,F-T1,63,Single-ply,2005,,TX,62.33,,,,,,,,,115,120,-130,120,120,,
1,Adam Harper,M,D,MR-O,93,Raw,1989,,NM,90.9,,,,,,,,,240,260,-272.5,260,260,,
1,Natali Dominguez,F,SBD,F-C,43,Single-ply,2001,Midland University,NE,42.58,115,-120,-122.5,115,-70,-70,70,70,125,132.5,-135,132.5,317.5,,
2,Alexandra Lazarus,F,SBD,F-C,43,Single-ply,2000,Midland University,LA,42.05,92.5,-97.5,-102.5,92.5,45,-47.5,-47.5,45,95,-102.5,-102.5,95,232.5,,
1,Sabra Warren,F,SBD,F-C,47,Single-ply,1996,Sam Houston State University Powerlifting Club,TX,46.95,105,-110,110,110,85,-90,90,90,90,100,105,105,305,,
2,Iliana Gamez,F,SBD,F-C,47,Single-ply,2001,,TX,46.39,120,-130,,120,-57.5,57.5,60,60,110,115,-125,115,295,,
3,Venu Phan,F,SBD,F-C,47,Single-ply,1999,Sam Houston State University Powerlifting Club,TX,46.84,105,115,-122.5,115,-57.5,57.5,62.5,62.5,97.5,110,-120,110,287.5,,
1,Mikaela Leibfried,F,SBD,F-C,52,Single-ply,1999,Midland University,WI,51.85,140,147.5,155,155,80,85,90,90,130,137.5,-142.5,137.5,382.5,,
2,Eliana Umbach,F,SBD,F-C,52,Single-ply,1999,,TX,50.28,137.5,-142.5,-142.5,137.5,65,67.5,70,70,142.5,150,-155,150,357.5,,
3,Daniela Echavarria,F,SBD,F-C,52,Single-ply,2000,,TX,50.92,115,122.5,127.5,127.5,52.5,57.5,62.5,62.5,135,142.5,147.5,147.5,337.5,,
4,Brooke Brown,F,SBD,F-C,52,Single-ply,1999,Sam Houston State University Powerlifting Club,TX,50.47,125,132.5,-140,132.5,50,55,-60,55,117.5,130,135,135,322.5,,
5,Sabrina Espinoza,F,SBD,F-C,52,Single-ply,2001,UTSA Roadrunner Powerlifting,TX,49.64,110,117.5,120,120,60,67.5,-70,67.5,120,127.5,132.5,132.5,320,,
1,Skyleigh Sears,F,SBD,F-C,57,Single-ply,2000,Midland University,TX,56.57,170,-182.5,-182.5,170,75,82.5,85,85,165,-175,-175,165,420,,
2,Destinie Small,F,SBD,F-C,57,Single-ply,2000,UTSA Roadrunner Powerlifting,TX,54.77,150,-157.5,157.5,157.5,80,82.5,85,85,145,152.5,-160,152.5,395,,
3,Luisa Soto,F,SBD,F-C,57,Single-ply,2000,Midland University,TX,52.68,132.5,137.5,-142.5,137.5,67.5,70,72.5,72.5,130,137.5,142.5,142.5,352.5,,
4,Yesenia Rocha,F,SBD,F-C,57,Single-ply,2001,Sam Houston State University Powerlifting Club,TX,56.4,112.5,122.5,132.5,132.5,62.5,-67.5,67.5,67.5,125,140,-155,140,340,,
5,Madalyn Hollingsworth,F,SBD,F-C,57,Single-ply,2000,UTSA Roadrunner Powerlifting,TX,55.99,130,137.5,-142.5,137.5,55,-60,-60,55,127.5,135,142.5,142.5,335,,
6,Haley Svadlenak,F,SBD,F-C,57,Single-ply,2000,,TX,54.48,120,125,132.5,132.5,60,-67.5,-67.5,60,117.5,127.5,-135,127.5,320,,
1,Cassandra Vargas,F,SBD,F-C,63,Single-ply,2001,UTSA Roadrunner Powerlifting,TX,62.11,150,157.5,-165,157.5,77.5,82.5,87.5,87.5,130,137.5,-147.5,137.5,382.5,,
2,Savannah McDougall,F,SBD,F-C,63,Single-ply,2001,,TX,62.1,127.5,135,140,140,60,62.5,-65,62.5,135,142.5,150,150,352.5,,
3,Charli Tumlinson,F,SBD,F-C,63,Single-ply,1997,Texas A&M Powerlifting,TX,61.08,95,102.5,-110,102.5,55,-60,60,60,125,130,135,135,297.5,,
1,Gabby Martinez,F,SBD,F-C,72,Single-ply,1997,UTSA Roadrunner Powerlifting,TX,71.99,225,232.5,242.5,242.5,-125,125,-132.5,125,182.5,190,-202.5,190,557.5,,
2,Rita Spirrison,F,SBD,F-C,72,Single-ply,2001,Texas A&M Powerlifting,TX,71.95,157.5,167.5,180,180,87.5,97.5,102.5,102.5,120,127.5,135,135,417.5,,
3,Victoria Torres,F,SBD,F-C,72,Single-ply,1998,,TX,69.32,-160,-160,160,160,95,-100,-100,95,142.5,147.5,152.5,152.5,407.5,,
4,Tori Contreras,F,SBD,F-C,72,Single-ply,2001,UTSA Roadrunner Powerlifting,TX,70.39,-150,150,162.5,162.5,-60,60,70,70,147.5,155,162.5,162.5,395,,
5,Natalia Marquez,F,SBD,F-C,72,Single-ply,2001,UTSA Roadrunner Powerlifting,TX,67.81,145,152.5,-160,152.5,67.5,70,75,75,147.5,155,160,160,387.5,,
6,Sa'mya Wallace,F,SBD,F-C,72,Single-ply,2001,,TX,70.15,-127.5,127.5,132.5,132.5,65,67.5,70,70,142.5,-147.5,147.5,147.5,350,,
7,Rachel De Marco,F,SBD,F-C,72,Single-ply,2001,,TX,70.2,130,-135,-135,130,-67.5,-70,70,70,100,107.5,112.5,112.5,312.5,,
DQ,Lacey Pender,F,SBD,F-C,72,Single-ply,2001,Midland University,TX,70.24,-165,-165,-165,,82.5,87.5,-92.5,87.5,137.5,147.5,-155,147.5,,,
DQ,Charity Campbell,F,SBD,F-C,72,Single-ply,2001,Midland University,TX,72,-175,-175,-175,,80,-85,-85,80,150,160,-172.5,160,,,
1,Marissa Lutz,F,SBD,F-C,84,Single-ply,2001,Midland University,TX,82.23,212.5,-227.5,-227.5,212.5,115,120,125,125,170,-180,-180,170,507.5,,
2,Layla Carrisalez,F,SBD,F-C,84,Single-ply,2001,Midland University,TX,82.95,175,-185,-185,175,95,-102.5,-102.5,95,-165,165,-175,165,435,,
3,Kimberly Edwards,F,SBD,F-C,84,Single-ply,1999,Sam Houston State University Powerlifting Club,TX,72.28,130,137.5,147.5,147.5,-77.5,77.5,82.5,82.5,127.5,137.5,-147.5,137.5,367.5,,
DQ,Mercedes Rodriguez,F,SBD,F-C,84,Single-ply,2001,,TX,75.04,-165,-165,-165,,-70,,,,,,,,,,
DQ,Abagail Stanfield,F,SBD,F-C,84,Single-ply,1998,UTSA Roadrunner Powerlifting,TX,82.15,137.5,-157.5,-157.5,137.5,-87.5,-87.5,-87.5,,-135,,,,,,
1,Christina Peterson,F,SBD,F-C,84+,Single-ply,2000,UTSA Roadrunner Powerlifting,TX,107.4,205,-212.5,-212.5,205,-105,-105,105,105,-150,-150,150,150,460,,
1,Alexandra Chavez,F,SBD,F-Jr,72,Single-ply,1999,,TX,70.45,195,207.5,-210,207.5,-125,125,127.5,127.5,160,172.5,185,185,520,,
1,Amber Gomez,F,SBD,F-M1a,84,Single-ply,1978,,TX,80.36,135,145,-155,145,92.5,-97.5,-97.5,92.5,147.5,157.5,165,165,402.5,,
1,Liszette Ortiz-Rosado,F,SBD,FR-C,47,Raw,2001,UTSA Roadrunner Powerlifting,TX,46.53,95,105,-110,105,-87.5,87.5,-95,87.5,107.5,115,125,125,317.5,,
2,Avelina Rivera,F,SBD,FR-C,47,Raw,1994,,TX,44.87,95,102.5,107.5,107.5,52.5,-60,-60,52.5,110,112.5,117.5,117.5,277.5,,
3,Cassidy Olivo,F,SBD,FR-C,47,Raw,2000,,TX,46.15,25,,,25,50,-52.5,-52.5,50,127.5,132.5,,132.5,207.5,,
4,Brenda Hernandez,F,SBD,FR-C,47,Raw,2000,,TX,46.81,55,57.5,67.5,67.5,35,40,42.5,42.5,80,90,97.5,97.5,207.5,,
1,Quynh Anh Nguyen,F,SBD,FR-C,52,Raw,1999,,TX,51.06,107.5,112.5,115,115,50,52.5,-55,52.5,132.5,140,-145,140,307.5,,
2,Shenina Delfin,F,SBD,FR-C,52,Raw,1998,,TX,51.75,105,112.5,-117.5,112.5,57.5,60,-62.5,60,117.5,125,135,135,307.5,,
3,Nicole Bolar,F,SBD,FR-C,52,Raw,1998,,TX,50.98,90,95,100,100,45,50,-52.5,50,120,-127.5,130,130,280,,
4,Martina Ramirez,F,SBD,FR-C,52,Raw,1999,,TX,51.4,85,90,95,95,47.5,52.5,57.5,57.5,85,-95,-95,85,237.5,,
5,Hailey Kopp,F,SBD,FR-C,52,Raw,2002,,TX,51.37,82.5,-85,-85,82.5,42.5,-45,-45,42.5,102.5,107.5,-112.5,107.5,232.5,,
1,Bella Vargas,F,SBD,FR-C,57,Raw,2000,,TX,56.13,110,115,117.5,117.5,87.5,90,-92.5,90,147.5,155,157.5,157.5,365,,
2,Amanda Imes,F,SBD,FR-C,57,Raw,2000,Midland University,TX,57,130,-135,135,135,70,75,-77.5,75,132.5,140,-155,140,350,,
3,Memory Seale,F,SBD,FR-C,57,Raw,1999,,TX,56.55,112.5,117.5,-122.5,117.5,-77.5,77.5,80,80,132.5,142.5,147.5,147.5,345,,
4,Leena Salinas,F,SBD,FR-C,57,Raw,1998,Texas A&M Powerlifting,TX,56.8,110,117.5,127.5,127.5,55,62.5,-65,62.5,125,135,142.5,142.5,332.5,,
5,Angel Esquibel,F,SBD,FR-C,57,Raw,2000,,TX,56.91,105,112.5,-120,112.5,60,67.5,-70,67.5,132.5,142.5,152.5,152.5,332.5,,
6,Victoria Vargas,F,SBD,FR-C,57,Raw,2000,,TX,56.19,110,117.5,-120,117.5,-57.5,62.5,-67.5,62.5,137.5,145,-152.5,145,325,,
7,Angela Darnell,F,SBD,FR-C,57,Raw,1995,,TX,54.16,92.5,100,105,105,40,45,-47.5,45,95,-102.5,102.5,102.5,252.5,,
8,Larissa Villanueva,F,SBD,FR-C,57,Raw,1997,Texas A&M Powerlifting,TX,56.34,62.5,70,-82.5,70,52.5,57.5,60,60,107.5,115,-122.5,115,245,,
9,Stephanie Degges,F,SBD,FR-C,57,Raw,2001,UTSA Roadrunner Powerlifting,TX,55.41,60,70,-77.5,70,42.5,-47.5,47.5,47.5,92.5,97.5,102.5,102.5,220,,
1,Destiny Dominguez,F,SBD,FR-C,63,Raw,1999,,TX,62.87,122.5,130,137.5,137.5,87.5,92.5,97.5,97.5,130,140,147.5,147.5,382.5,,
2,Luisa Cruz,F,SBD,FR-C,63,Raw,2000,Midland University,TX,60.44,132.5,137.5,-145,137.5,62.5,65,67.5,67.5,160,167.5,175,175,380,,
3,Taylor Ingram,F,SBD,FR-C,63,Raw,1999,,TX,62.6,132.5,140,145,145,52.5,57.5,62.5,62.5,137.5,145,152.5,152.5,360,,
4,Najihatussolehah Mohd-Zamri,F,SBD,FR-C,63,Raw,1998,,TX,62.85,117.5,125,-130,125,60,-65,65,65,155,165,-167.5,165,355,,
5,Marissa Olvera,F,SBD,FR-C,63,Raw,2001,Midland University,TX,61.83,117.5,-127.5,127.5,127.5,65,-70,70,70,125,135,142.5,142.5,340,,
6,Jessica Smith,F,SBD,FR-C,63,Raw,2000,Sam Houston State University Powerlifting Club,TX,58.31,80,92.5,-97.5,92.5,35,-40,-40,35,102.5,110,117.5,117.5,245,,
7,Kira Kopetski,F,SBD,FR-C,63,Raw,1998,Sam Houston State University Powerlifting Club,TX,62.28,80,82.5,-100,82.5,55,-60,60,60,85,97.5,-110,97.5,240,,
1,Camryn Ochs,F,SBD,FR-C,72,Raw,1999,,WI,71.71,150,157.5,162.5,162.5,82.5,90,-92.5,90,132.5,140,147.5,147.5,400,,
2,Jessica Salinas,F,SBD,FR-C,72,Raw,1999,,TX,69.7,137.5,145,152.5,152.5,65,70,-72.5,70,140,147.5,160,160,382.5,,
3,Ariel Johnson,F,SBD,FR-C,72,Raw,2001,,TX,64.27,107.5,112.5,-115,112.5,65,-67.5,-67.5,65,157.5,162.5,170,170,347.5,,
4,Ally Carraway,F,SBD,FR-C,72,Raw,2001,Midland University,TX,69.72,122.5,130,135,135,65,70,72.5,72.5,125,135,140,140,347.5,,
5,Brittney Butler,F,SBD,FR-C,72,Raw,1997,Texas A&M Powerlifting,TX,68.61,107.5,115,122.5,122.5,65,72.5,-85,72.5,115,125,142.5,142.5,337.5,,
6,Julianna Morales,F,SBD,FR-C,72,Raw,2000,,TX,69.61,112.5,122.5,127.5,127.5,67.5,-72.5,-72.5,67.5,120,130,140,140,335,,
7,Phoebe Fairbairn,F,SBD,FR-C,72,Raw,1994,UTSA Roadrunner Powerlifting,TX,67.79,102.5,107.5,112.5,112.5,70,-72.5,72.5,72.5,127.5,132.5,140,140,325,,
8,Sara Barron,F,SBD,FR-C,72,Raw,1999,,TX,69.19,110,120,127.5,127.5,45,47.5,50,50,117.5,125,130,130,307.5,,
9,Charisma Tante,F,SBD,FR-C,72,Raw,2000,,TX,70.22,110,115,-120,115,60,62.5,-65,62.5,110,117.5,125,125,302.5,,
10,Carolyn Estrada,F,SBD,FR-C,72,Raw,2000,Matador Powerlifting,TX,68.42,115,125,137.5,137.5,45,50,-57.5,50,-107.5,110,-137.5,110,297.5,,
11,Abigail Zeman,F,SBD,FR-C,72,Raw,1997,,TX,71.22,85,95,-97.5,95,62.5,65,67.5,67.5,130,132.5,-135,132.5,295,,
12,Lexie Becerra,F,SBD,FR-C,72,Raw,1995,,TX,67.46,105,110,117.5,117.5,40,45,-47.5,45,107.5,117.5,120,120,282.5,,
13,Abigail Wilson,F,SBD,FR-C,72,Raw,2000,,TX,69.48,85,92.5,95,95,47.5,52.5,-57.5,52.5,102.5,110,115,115,262.5,,
14,Julie Nguyen #1,F,SBD,FR-C,72,Raw,2000,,TX,68.26,92.5,-97.5,97.5,97.5,35,40,-45,40,100,107.5,110,110,247.5,,
15,Jenna Hetsko,F,SBD,FR-C,72,Raw,1997,,TX,68.68,90,95,97.5,97.5,40,45,-47.5,45,82.5,90,-95,90,232.5,,
1,Cassidy Estrada,F,SBD,FR-C,84,Raw,1995,,TX,80.42,165,172.5,182.5,182.5,90,97.5,102.5,102.5,155,162.5,170,170,455,,
2,Analisa Narro,F,SBD,FR-C,84,Raw,1998,UTSA Roadrunner Powerlifting,TX,74.5,112.5,120,127.5,127.5,77.5,82.5,-85,82.5,140,150,-157.5,150,360,,
3,Mikah Ward,F,SBD,FR-C,84,Raw,1998,,TX,81.9,122.5,127.5,135,135,62.5,65,-67.5,65,142.5,152.5,-157.5,152.5,352.5,,
4,Tolulope Olabinjo,F,SBD,FR-C,84,Raw,2000,,TX,80.07,112.5,120,127.5,127.5,47.5,-52.5,57.5,57.5,130,137.5,145,145,330,,
5,Samantha Piedra,F,SBD,FR-C,84,Raw,1996,Sam Houston State University Powerlifting Club,TX,73.44,80,87.5,100,100,45,-52.5,-52.5,45,92.5,105,-117.5,105,250,,
DQ,Victoria Guerra,F,SBD,FR-C,84,Raw,2000,,TX,76.12,-120,-120,-120,,42.5,47.5,-52.5,47.5,120,125,130,130,,,
1,Makenna Henderson,F,SBD,FR-C,84+,Raw,2000,Midland University,TX,97.17,165,180,192.5,192.5,92.5,97.5,102.5,102.5,145,155,-162.5,155,450,,
2,Samantha Heimer,F,SBD,FR-C,84+,Raw,2000,,TX,131.6,152.5,170,-175,170,70,77.5,85,85,137.5,147.5,157.5,157.5,412.5,,
3,Haley Jones,F,SBD,FR-C,84+,Raw,1993,UTSA Roadrunner Powerlifting,TX,101.73,112.5,120,137.5,137.5,67.5,70,-72.5,70,125,140,155,155,362.5,,
4,Gracie Groh,F,SBD,FR-C,84+,Raw,2001,Sam Houston State University Powerlifting Club,TX,89.09,107.5,-115,115,115,67.5,-72.5,72.5,72.5,110,122.5,135,135,322.5,,
5,Alexis Rodriguez #2,F,SBD,FR-C,84+,Raw,1999,Sam Houston State University Powerlifting Club,TX,88.71,92.5,-100,-100,92.5,47.5,50,-52.5,50,125,130,132.5,132.5,275,,
1,Calie Chesler,F,SBD,FR-Jr,63,Raw,1997,,TX,63,125,137.5,-142.5,137.5,60,67.5,72.5,72.5,137.5,155,165,165,375,,
1,Tessa Willis,F,SBD,FR-Jr,72,Raw,1996,,TX,71.26,120,-130,-137.5,120,52.5,-57.5,57.5,57.5,-145,145,152.5,152.5,330,,
1,Ashley Rosales,F,SBD,FR-Jr,84,Raw,1998,Oppose Gravity,TX,83,135,150,160,160,55,57.5,-60,57.5,120,132.5,137.5,137.5,355,,
2,Kendall Sullivan,F,SBD,FR-Jr,84,Raw,1996,,TX,79.38,105,112.5,120,120,60,-67.5,-67.5,60,130,142.5,-152.5,142.5,322.5,,
3,Leah Alaniz,F,SBD,FR-Jr,84,Raw,1999,,TX,76.52,92.5,102.5,110,110,50,57.5,-62.5,57.5,102.5,112.5,-122.5,112.5,280,,
1,Brandi King,F,SBD,FR-M1a,63,Raw,1979,,TX,61.51,75,-82.5,-82.5,75,37.5,45,-52.5,45,105,115,120,120,240,,
1,Kristin Nash,F,SBD,FR-O,84+,Raw,1980,Oppose Gravity,TX,112.68,60,65,70,70,42.5,45,47.5,47.5,75,82.5,90,90,207.5,,
1,Aimee Evans,F,SBD,FR-M1b,63,Raw,1972,,TX,62.94,-85,85,-95,85,45,50,52.5,52.5,120,130,-140,130,267.5,,
1,Lynne Homan,F,SBD,FR-M2b,57,Raw,1962,,TX,57,77.5,82.5,87.5,87.5,60,65,-67.5,65,115,125,-127.5,125,277.5,,
2,Loraine Efron,F,SBD,FR-M2b,57,Raw,1963,,TX,57,80,85,90,90,42.5,47.5,-50,47.5,97.5,-102.5,-102.5,97.5,235,,
1,Candy Zavala,F,SBD,FR-O,52,Raw,1992,,TX,51.91,110,-117.5,-122.5,110,60,-65,65,65,110,115,-122.5,115,290,,
2,Wichaya Nampror,F,SBD,FR-O,52,Raw,1993,,TX,50.94,82.5,87.5,95,95,35,40,-42.5,40,102.5,112.5,-117.5,112.5,247.5,,
1,Megan Hurlburt,F,SBD,FR-O,57,Raw,1992,,TX,56.94,100,-110,120,120,65,70,75,75,125,135,145,145,340,,
2,Cristina Garcia,F,SBD,FR-O,57,Raw,1993,,TX,56.76,97.5,105,110,110,57.5,60,-65,60,132.5,140,142.5,142.5,312.5,,
3,Claudia Diaz,F,SBD,FR-O,57,Raw,1985,Oppose Gravity,TX,56.47,-87.5,92.5,-95,92.5,55,-57.5,-57.5,55,105,110,120,120,267.5,,
1,Jenna Mayle,F,SBD,FR-O,63,Raw,1991,,TX,61.93,90,97.5,102.5,102.5,62.5,67.5,72.5,72.5,115,125,135,135,310,,
2,Alexsandra Trevino,F,SBD,FR-O,63,Raw,1992,,TX,60.85,100,105,110,110,60,62.5,65,65,115,120,125,125,300,,
3,Alison Joseph,F,SBD,FR-O,63,Raw,1982,,TX,61.61,80,87.5,-92.5,87.5,52.5,57.5,-62.5,57.5,115,120,127.5,127.5,272.5,,
1,Vanessa Johnson,F,SBD,FR-O,72,Raw,1988,,TX,71.36,112.5,122.5,-127.5,122.5,70,-75,-75,70,145,152.5,155,155,347.5,,
2,Tessa Willis,F,SBD,FR-O,72,Raw,1996,,TX,71.26,120,-130,-137.5,120,52.5,-57.5,57.5,57.5,-145,145,152.5,152.5,330,,
3,Ana Karen Raz,F,SBD,FR-O,72,Raw,1991,,TX,69.59,105,120,-130,120,50,-55,-55,50,110,120,127.5,127.5,297.5,,
4,Paige Johnson,F,SBD,FR-O,72,Raw,1992,,TX,69.38,92.5,97.5,107.5,107.5,52.5,57.5,62.5,62.5,107.5,115,122.5,122.5,292.5,,
1,Kelsey Letcher,F,SBD,FR-O,84,Raw,1986,,TX,82.1,102.5,110,115,115,70,77.5,82.5,82.5,137.5,150,160,160,357.5,,
2,Amanda Ham,F,SBD,FR-O,84,Raw,1985,,TX,75.9,102.5,107.5,117.5,117.5,57.5,62.5,67.5,67.5,125,132.5,142.5,142.5,327.5,,
1,Karla Tchou,F,SBD,FR-O,84+,Raw,1986,,TX,115.56,-130,130,150,150,55,62.5,70,70,135,157.5,167.5,167.5,387.5,,
2,Emma Grimes,F,SBD,FR-O,84+,Raw,1992,,TX,90.7,115,120,125,125,67.5,72.5,75,75,120,127.5,137.5,137.5,337.5,,
1,Alexia Olivo,F,SBD,FR-T3,72,Raw,2001,,TX,64.48,102.5,107.5,115,115,52.5,55,-62.5,55,102.5,110,125,125,295,,
1,Rosita Driscoll,F,SBD,FR-Y3,57,Raw,2006,,TX,54.86,62.5,65,67.5,67.5,45,47.5,-50,47.5,85,90,-92.5,90,205,,
1,Olivia Gholson,F,SBD,FR-Y3,84,Raw,2006,,TX,78.82,85,100,110,110,37.5,42.5,45,45,107.5,120,125,125,280,,
1,Savannah Zuniga,F,SBD,F-T1,63,Single-ply,2004,,TX,62.8,137.5,152.5,165,165,62.5,67.5,70,70,137.5,152.5,160,160,395,,
2,Isabel Olivarez,F,SBD,F-T1,63,Single-ply,2005,,TX,62.33,117.5,122.5,-125,122.5,67.5,75,77.5,77.5,115,120,-130,120,320,,
DQ,Faith Fisher,F,SBD,F-T1,84,Single-ply,2004,,TX,83.64,140,147.5,157.5,157.5,-92.5,-92.5,-97.5,,-132.5,,,,,,
1,Jalyssa Garcia,F,SBD,F-T1,84+,Single-ply,2004,,TX,113.71,120,132.5,137.5,137.5,82.5,92.5,97.5,97.5,125,132.5,135,135,370,,
1,Alyssa Ayers,F,SBD,F-T2,57,Single-ply,2002,,TX,53.24,110,-117.5,117.5,117.5,-60,60,-65,60,120,130,-132.5,130,307.5,,
1,DeAnna Wood,F,SBD,F-T2,84+,Single-ply,2002,,TX,116.55,117.5,127.5,132.5,132.5,60,110,112.5,112.5,107.5,115,125,125,370,,
1,Christopher Medina Jr,M,SBD,M-C,53,Single-ply,2001,UTSA Roadrunner Powerlifting,TX,52.6,155,167.5,182.5,182.5,87.5,95,-102.5,95,165,175,-190,175,452.5,,
1,Roberto Saenz,M,SBD,M-C,66,Single-ply,2000,Midland University,TX,63.26,230,240,250,250,152.5,160,-165,160,230,245,-255,245,655,,
2,Brandin Carballo,M,SBD,M-C,66,Single-ply,1999,,TX,64.12,-227.5,-227.5,227.5,227.5,112.5,122.5,-130,122.5,227.5,237.5,-245,237.5,587.5,,
3,Adrian Campos,M,SBD,M-C,66,Single-ply,2001,UTSA Roadrunner Powerlifting,TX,63.53,205,220,230,230,132.5,140,-145,140,165,172.5,185,185,555,,
4,Joshua Valenzuela,M,SBD,M-C,66,Single-ply,2001,UTSA Roadrunner Powerlifting,TX,65.6,205,-215,,205,120,125,132.5,132.5,195,207.5,-220,207.5,545,,
5,Jesus Rosillo III,M,SBD,M-C,66,Single-ply,1999,Sam Houston State University Powerlifting Club,TX,65.1,175,185,192.5,192.5,-110,-110,110,110,170,180,190,190,492.5,,
6,David Parmer,M,SBD,M-C,66,Single-ply,2001,Texas A&M Powerlifting,TX,64.57,162.5,-175,175,175,102.5,-110,-110,102.5,167.5,-182.5,182.5,182.5,460,,
1,Eric Jin,M,SBD,M-C,74,Single-ply,1999,,TX,73.6,240,255,262.5,262.5,-127.5,127.5,135,135,227.5,240,-250,240,637.5,,
2,Amilcar Flores,M,SBD,M-C,74,Single-ply,1997,Sam Houston State University Powerlifting Club,TX,73.4,205,217.5,-222.5,217.5,137.5,145,-147.5,145,200,210,220,220,582.5,,
3,Felix Del Rio,M,SBD,M-C,74,Single-ply,2000,UTSA Roadrunner Powerlifting,TX,69.48,210,217.5,235,235,132.5,135,140,140,190,200,-210,200,575,,
4,Hunter Dollery,M,SBD,M-C,74,Single-ply,1998,Sam Houston State University Powerlifting Club,TX,74,210,-220,-220,210,127.5,-132.5,132.5,132.5,207.5,215,-227.5,215,557.5,,
5,Christopher Martinez,M,SBD,M-C,74,Single-ply,1999,Sam Houston State University Powerlifting Club,TX,73.9,187.5,-197.5,197.5,197.5,147.5,-150,150,150,-197.5,197.5,202.5,202.5,550,,
6,Gage Trujillo,M,SBD,M-C,74,Single-ply,2000,Matador Powerlifting,TX,72.2,-165,167.5,177.5,177.5,120,-127.5,127.5,127.5,170,180,192.5,192.5,497.5,,
7,Jorge Elizondo,M,SBD,M-C,74,Single-ply,1999,,TX,71.2,165,-172.5,177.5,177.5,100,105,110,110,175,182.5,187.5,187.5,475,,
8,Joshua Faulkner,M,SBD,M-C,74,Single-ply,1999,Texas A&M Powerlifting,TX,71.79,155,165,-172.5,165,105,-110,-110,105,175,-195,-195,175,445,,
1,John Hodge,M,SBD,M-C,83,Single-ply,2000,,TX,81.98,295,-307.5,310,310,157.5,-165,-165,157.5,272.5,282.5,287.5,287.5,755,,
2,Daniel Hernandez,M,SBD,M-C,83,Single-ply,1998,,TX,82.08,245,265,275,275,110,145,160,160,255,265,275,275,710,,
3,Gavin Vara,M,SBD,M-C,83,Single-ply,2000,Midland University,TX,82.97,255,275,-280,275,150,152.5,-155,152.5,250,265,275,275,702.5,,
4,Alfred Young,M,SBD,M-C,83,Single-ply,1997,,CA,82.3,227.5,,,227.5,180,190,-200,190,217.5,227.5,237.5,237.5,655,,
5,Sebastian Sanchez,M,SBD,M-C,83,Single-ply,2001,Midland University,TX,83,220,230,240,240,-142.5,142.5,-150,142.5,230,240,245,245,627.5,,
6,Samuel Cannon,M,SBD,M-C,83,Single-ply,2000,,TX,82.2,175,185,-192.5,185,120,125,130,130,-175,182.5,-207.5,182.5,497.5,,
1,Obed Hernandez,M,SBD,M-C,93,Single-ply,2001,UTSA Roadrunner Powerlifting,TX,92.3,310,325,,325,-210,217.5,227.5,227.5,250,265,285,285,837.5,,
2,Mitchell Rees,M,SBD,M-C,93,Single-ply,1999,,TX,86.94,310,327.5,-345,327.5,162.5,-175,-175,162.5,270,-282.5,-282.5,270,760,,
3,Devin Kumar,M,SBD,M-C,93,Single-ply,1997,,TX,89.5,242.5,257.5,,257.5,180,187.5,-192.5,187.5,-260,260,272.5,272.5,717.5,,
4,Emanuel Ochoa,M,SBD,M-C,93,Single-ply,1998,Texas A&M Powerlifting,TX,91.9,235,250,260,260,105,-155,155,155,225,240,-260,240,655,,
5,Steban Mireles,M,SBD,M-C,93,Single-ply,1999,,TX,90.4,245,257.5,262.5,262.5,150,157.5,162.5,162.5,-202.5,202.5,212.5,212.5,637.5,,
6,Jaxsen Sewell,M,SBD,M-C,93,Single-ply,2000,,TX,91.7,230,-242.5,-250,230,155,165,167.5,167.5,205,215,-227.5,215,612.5,,
7,Zachary Wood,M,SBD,M-C,93,Single-ply,1997,Texas A&M Powerlifting,CA,92.25,205,215,225,225,125,-135,135,135,215,225,230,230,590,,
8,Farhan Siddiqui,M,SBD,M-C,93,Single-ply,1993,,TX,88.5,190,200,-210,200,105,110,-115,110,240,252.5,265,265,575,,
9,Joseph Hooker,M,SBD,M-C,93,Single-ply,1996,Sam Houston State University Powerlifting Club,TX,91.92,-190,190,195,195,127.5,137.5,142.5,142.5,205,217.5,220,220,557.5,,
10,David Blackburn,M,SBD,M-C,93,Single-ply,2000,Texas A&M Powerlifting,TX,91.53,215,227.5,-235,227.5,105,-150,-150,105,200,-222.5,-222.5,200,532.5,,
DQ,David Saunders,M,SBD,M-C,93,Single-ply,1998,Texas A&M Powerlifting,TX,91.56,240,255,260,260,-170,-170,-170,,265,-275,-275,265,,,
1,Joseph Bueno,M,SBD,M-C,105,Single-ply,2001,Midland University,TX,102.8,-255,255,287.5,287.5,125,175,-182.5,175,227.5,250,265,265,727.5,,
2,Cameron Bridges,M,SBD,M-C,105,Single-ply,2000,Sam Houston State University Powerlifting Club,TX,97.5,197.5,212.5,-225,212.5,125,135,140,140,185,195,205,205,557.5,,
3,Parker Bretz,M,SBD,M-C,105,Single-ply,1999,Sam Houston State University Powerlifting Club,TX,102.7,185,195,-210,195,125,132.5,140,140,180,195,215,215,550,,
1,March Thomas,M,SBD,M-C,120,Single-ply,2000,Sam Houston State University Powerlifting Club,TX,118.4,305,320,-335,320,247.5,262.5,-277.5,262.5,245,260,275,275,857.5,,
2,Joaquin Garza,M,SBD,M-C,120,Single-ply,1999,Sam Houston State University Powerlifting Club,TX,116.8,-217.5,217.5,-222.5,217.5,150,155,160,160,197.5,-215,215,215,592.5,,
1,Esteban Garcia,M,SBD,M-C,120+,Single-ply,1996,,TX,136.8,225,237.5,247.5,247.5,190,200,207.5,207.5,220,235,245,245,700,,
1,Royal Lucas,M,SBD,M-O,74,Single-ply,1993,,TX,73.8,260,275,280,280,175,185,-190,185,-190,190,240,240,705,,
1,Diamond Chau,M,SBD,MR-C,53,Raw,2001,,TX,51.4,-110,110,120,120,67.5,72.5,-77.5,72.5,135,145,155,155,347.5,,
1,Tyler Harris,M,SBD,MR-C,59,Raw,1998,,TX,58.8,152.5,162.5,170,170,87.5,92,97.5,97.5,212.5,225,230,230,497.5,,
2,Davion Aldridge,M,SBD,MR-C,59,Raw,1998,UTSA Roadrunner Powerlifting,TX,59,-155,155,,155,105,,,105,185,,,185,445,,
3,Anthony Morales #2,M,SBD,MR-C,59,Raw,2000,,TX,58.6,140,147.5,152.5,152.5,80,85,92.5,92.5,185,190,195,195,440,,
4,Carson Merket,M,SBD,MR-C,59,Raw,1999,Texas A&M Powerlifting,TX,56.8,102.5,110,-115,110,85,87.5,90,90,155,160,-165,160,360,,
1,Michael Casillas,M,SBD,MR-C,66,Raw,2000,,TX,66,185,195,200,200,140,-145,-145,140,207.5,220,-227.5,220,560,,
2,Austin Carrow,M,SBD,MR-C,66,Raw,1997,,TX,65.2,175,182.5,187.5,187.5,127.5,132.5,135,135,205,217.5,227.5,227.5,550,,
3,Ben Sánchez,M,SBD,MR-C,66,Raw,2000,,TX,64,170,177.5,182.5,182.5,115,-117.5,117.5,117.5,195,205,215,215,515,,
4,Matthew Hughes #1,M,SBD,MR-C,66,Raw,2000,,TX,65,152.5,165,177.5,177.5,97.5,107.5,-115,107.5,192.5,205,217.5,217.5,502.5,,
5,Jacob Roffwarg,M,SBD,MR-C,66,Raw,2000,,TX,65.5,150,-157.5,157.5,157.5,107.5,112.5,115,115,185,195,205,205,477.5,,
6,Christopher Lam,M,SBD,MR-C,66,Raw,2000,,TX,65.4,142.5,152.5,-157.5,152.5,97.5,102.5,107.5,107.5,195,207.5,-215,207.5,467.5,,
7,Steven Canales,M,SBD,MR-C,66,Raw,1999,,TX,64.3,160,162.5,165,165,100,102.5,-105,102.5,175,180,190,190,457.5,,
8,Zaahid Abdullah,M,SBD,MR-C,66,Raw,2000,,TX,65,135,145,155,155,82.5,90,92.5,92.5,185,195,205,205,452.5,,
9,Carter Winegeart,M,SBD,MR-C,66,Raw,1999,,TX,64.2,150,157.5,160,160,97.5,105,110,110,175,-180,180,180,450,,
10,Drake Moya,M,SBD,MR-C,66,Raw,2000,Matador Powerlifting,TX,65,132.5,142.5,,142.5,82.5,87.5,-90,87.5,177.5,187.5,-197.5,187.5,417.5,,
11,Michael Van,M,SBD,MR-C,66,Raw,2000,UTSA Roadrunner Powerlifting,TX,64.7,-125,-127.5,127.5,127.5,92.5,102.5,-107.5,102.5,165,172.5,185,185,415,,
12,Alex Cano,M,SBD,MR-C,66,Raw,2001,Texas A&M Powerlifting,TX,65.5,132.5,-135,135,135,-75,80,-87.5,80,162,175,-202.5,175,390,,
1,Ken Nguyen #1,M,SBD,MR-C,74,Raw,2000,,TX,73.5,215,227.5,-235,227.5,125,132.5,135,135,237.5,250,262.5,262.5,625,,
2,Randall Holliday,M,SBD,MR-C,74,Raw,1997,,TX,74,200,-210,-210,200,120,127.5,-132.5,127.5,227.5,240,-250,240,567.5,,
3,Parker Hay,M,SBD,MR-C,74,Raw,1999,Texas A&M Powerlifting,TX,73.6,202.5,212.5,-225,212.5,115,125,-132.5,125,197.5,207.5,220,220,557.5,,
4,Alejandro Saldana,M,SBD,MR-C,74,Raw,1998,,TX,73.5,165,175,182.5,182.5,115,122.5,125,125,217.5,222.5,237.5,237.5,545,,
5,JJ Ortiz,M,SBD,MR-C,74,Raw,1997,,TX,70,170,180,187.5,187.5,122.5,130,135,135,195,207.5,217.5,217.5,540,,
6,Connor White,M,SBD,MR-C,74,Raw,1998,Matador Powerlifting,TX,72.7,185,192.5,197.5,197.5,115,-125,125,125,195,207.5,-227.5,207.5,530,,
7,David Torres #3,M,SBD,MR-C,74,Raw,1997,UTSA Roadrunner Powerlifting,TX,72.9,190,197.5,202.5,202.5,122.5,127.5,-130,127.5,187.5,200,-205,200,530,,
8,Andrew Ritz,M,SBD,MR-C,74,Raw,2000,Texas A&M Powerlifting,TX,73.2,170,180,190,190,105,-112.5,115,115,182.5,192.5,200,200,505,,
9,Allan Ramirez,M,SBD,MR-C,74,Raw,1999,UTSA Roadrunner Powerlifting,TX,73.8,165,180,187.5,187.5,105,115,-125,115,175,190,200,200,502.5,,
10,Vaibhav Jaideep,M,SBD,MR-C,74,Raw,2002,,TX,72.4,165,177.5,-182.5,177.5,85,-92.5,97.5,97.5,200,212.5,220,220,495,,
11,Minoza Minoza,M,SBD,MR-C,74,Raw,1998,UTSA Roadrunner Powerlifting,TX,72.3,160,170,177.5,177.5,95,100,105,105,190,200,210,210,492.5,,
12,Andrew Rodriguez,M,SBD,MR-C,74,Raw,1999,,TX,71.8,185,-195,-195,185,105,110,-112.5,110,182.5,195,-235,195,490,,
13,Zackary Myers,M,SBD,MR-C,74,Raw,1998,Texas A&M Powerlifting,TX,74,160,170,-177.5,170,102.5,110,-112.5,110,200,-227.5,-227.5,200,480,,
15,Miles Jesurun,M,SBD,MR-C,74,Raw,1996,,TX,72.6,150,162.5,167.5,167.5,87.5,100,-107.5,100,175,190,202.5,202.5,470,,
14,Christopher Tran #4,M,SBD,MR-C,74,Raw,1998,UTSA Roadrunner Powerlifting,TX,72.6,150,165,-170,165,90,95,-97.5,95,190,200,210,210,470,,
16,Kevin Diaz-Gonzalez,M,SBD,MR-C,74,Raw,1997,Matador Powerlifting,TX,72.9,150,160,-170,160,102.5,107.5,115,115,170,182.5,190,190,465,,
1,Rob Escalante,M,SBD,MR-C,83,Raw,1997,,TX,82.7,237.5,250,255,255,172.5,180,-185,180,252.5,267.5,275,275,710,,
2,Joel Garza,M,SBD,MR-C,83,Raw,1999,UTSA Roadrunner Powerlifting,TX,82.3,215,230,240,240,155,165,175,175,250,260,-275,260,675,,
3,Donald Phounsavath,M,SBD,MR-C,83,Raw,2000,,TX,81.3,215,227.5,237.5,237.5,147.5,157.5,-162.5,157.5,250,262.5,272.5,272.5,667.5,,
4,Santiago Ramirez,M,SBD,MR-C,83,Raw,1997,UTSA Roadrunner Powerlifting,TX,82.9,210,220,-230,220,135,142.5,-150,142.5,275,302.5,-310,302.5,665,,
5,Jett Ertle,M,SBD,MR-C,83,Raw,2000,Matador Powerlifting,TX,82.99,235,245,250,250,150,157.5,-162.5,157.5,-247.5,247.5,-272.5,247.5,655,,
6,Sean Martinez,M,SBD,MR-C,83,Raw,1996,UTSA Roadrunner Powerlifting,TX,82.2,205,210,-212.5,210,132.5,137.5,,137.5,245,-255,255,255,602.5,,
7,Eutiquio Mondragon,M,SBD,MR-C,83,Raw,1996,,TX,82.9,197.5,205,207.5,207.5,162.5,-167.5,-167.5,162.5,207.5,215,222.5,222.5,592.5,,
8,Luke Janosky,M,SBD,MR-C,83,Raw,1999,,TX,79.5,182.5,192.5,207.5,207.5,102.5,112.5,122.5,122.5,225,240,260,260,590,,
9,Dominique Felder,M,SBD,MR-C,83,Raw,2000,Sam Houston State University Powerlifting Club,TX,80.6,197.5,210,212.5,212.5,115,122.5,-130,122.5,215,230,242.5,242.5,577.5,,
10,Braidon Clemence,M,SBD,MR-C,83,Raw,1998,,TX,82.8,185,192.5,197.5,197.5,122.5,132.5,-137.5,132.5,230,237.5,-250,237.5,567.5,,
11,Moinul Hossain,M,SBD,MR-C,83,Raw,1998,,TX,83,192.5,205,215,215,125,132.5,-140,132.5,220,-230,-230,220,567.5,,
12,Hunter Ducharme,M,SBD,MR-C,83,Raw,1997,Texas A&M Powerlifting,TX,81.5,190,197.5,202.5,202.5,110,120,-130,120,225,240,-245,240,562.5,,
13,Nathaniel Lujan,M,SBD,MR-C,83,Raw,1999,UTSA Roadrunner Powerlifting,TX,82.5,175,185,195,195,125,137.5,142.5,142.5,215,225,-230,225,562.5,,
14,Leonardo Diaz,M,SBD,MR-C,83,Raw,1999,,TX,81.59,-185,185,197.5,197.5,110,120,-125,120,205,215,227.5,227.5,545,,
15,Jacob Valdez,M,SBD,MR-C,83,Raw,1997,UTSA Roadrunner Powerlifting,TX,81.64,190,200,-205,200,105,110,112.5,112.5,200,210,220,220,532.5,,
16,Cristian Davila,M,SBD,MR-C,83,Raw,1997,,TX,77.5,157.5,167.5,180,180,115,-120,-125,115,200,210,215,215,510,,
17,Nate Spencer,M,SBD,MR-C,83,Raw,2000,Matador Powerlifting,TX,81.5,172.5,182.5,-187.5,182.5,112.5,-115,117.5,117.5,175,185,195,195,495,,
18,Blake Myers,M,SBD,MR-C,83,Raw,1998,Texas A&M Powerlifting,TX,82.1,162.5,175,-185,175,107.5,115,117.5,117.5,200,-215,-215,200,492.5,,
19,Harrison Fexer,M,SBD,MR-C,83,Raw,1997,Texas A&M Powerlifting,TX,81.3,145,155,162.5,162.5,110,115,-120,115,175,182.5,187.5,187.5,465,,
20,Roger Fernandez,M,SBD,MR-C,83,Raw,2000,,TX,78.6,140,150,-152.5,150,97.5,102.5,-105,102.5,-180,185,192.5,192.5,445,,
DQ,Austin Ballard,M,SBD,MR-C,83,Raw,2000,,TX,80.09,225,-230,-230,225,-130,-130,,,,,,,,,
1,Ethan Del Toro,M,SBD,MR-C,93,Raw,1996,,UT,92.3,262.5,277.5,285,285,145,152.5,160,160,305,325,-332.5,325,770,,
2,Isaac Salas,M,SBD,MR-C,93,Raw,1997,,TX,92.8,270,285,297.5,297.5,150,160,162.5,162.5,-275,290,-312.5,290,750,,
3,Connor Burke,M,SBD,MR-C,93,Raw,1997,,TX,89.7,205,215,-225,215,167.5,-172.5,-172.5,167.5,235,245,252.5,252.5,635,,
4,Morgan Landreth,M,SBD,MR-C,93,Raw,2000,,TX,92.2,225,237.5,-245,237.5,142.5,150,-155,150,220,232.5,240,240,627.5,,
5,Luke Li,M,SBD,MR-C,93,Raw,2000,,TX,92.2,210,220,230,230,112.5,117.5,122.5,122.5,220,237.5,255,255,607.5,,
6,Evan Green,M,SBD,MR-C,93,Raw,1999,,TX,92.9,-217.5,217.5,227.5,227.5,122.5,-127.5,-127.5,122.5,245,252.5,-260,252.5,602.5,,
7,Juan Gomez,M,SBD,MR-C,93,Raw,1998,UTSA Roadrunner Powerlifting,TX,91.9,195,205,-210,205,145,150,-155,150,240,-252.5,-252.5,240,595,,
8,Jared Wilkinson,M,SBD,MR-C,93,Raw,1999,,TX,92.53,182.5,192.5,205,205,92.5,105,-110,105,227.5,232.5,245,245,555,,
9,Nikhil Bopardikar,M,SBD,MR-C,93,Raw,1998,,TX,85.82,167.5,177.5,190,190,112.5,117.5,122.5,122.5,210,220,230,230,542.5,,
10,Gabriel Sanchez,M,SBD,MR-C,93,Raw,2001,,TX,91.45,192.5,200,205,205,92.5,100,-105,100,195,202.5,210,210,515,,
11,Austen Taylor,M,SBD,MR-C,93,Raw,1997,Sam Houston State University Powerlifting Club,TX,91.8,125,135,142.5,142.5,85,92.5,95,95,145,152.5,165,165,402.5,,
12,Graham Watson,M,SBD,MR-C,93,Raw,1990,UTSA Roadrunner Powerlifting,TX,89.97,-130,130,137.5,137.5,87.5,90,92.5,92.5,152.5,157.5,-165,157.5,387.5,,
13,Hawkins Williams,M,SBD,MR-C,93,Raw,1999,,TX,89,100,105,110,110,60,62.5,65,65,100,145,155,155,330,,
DQ,Shawn Eldred,M,SBD,MR-C,93,Raw,1999,Matador Powerlifting,TX,84.5,185,190,-192.5,190,-115,-122.5,-122.5,,227.5,235,-250,235,,,
1,Joshua Brown,M,SBD,MR-C,105,Raw,1998,,TX,102.8,262.5,275,282.5,282.5,170,177.5,182.5,182.5,280,290,-295,290,755,,
2,Caleb Smith #4,M,SBD,MR-C,105,Raw,1998,Texas A&M Powerlifting,TX,99.5,225,232.5,240,240,130,140,145,145,280,290,297.5,297.5,682.5,,
3,David Garza,M,SBD,MR-C,105,Raw,1998,UTSA Roadrunner Powerlifting,TX,102.1,247.5,260,277.5,277.5,107.5,112.5,120,120,227.5,240,252.5,252.5,650,,
4,Tristan Watson,M,SBD,MR-C,105,Raw,1997,,TX,100.8,217.5,227.5,235,235,150,160,-165,160,242.5,250,-257.5,250,645,,
5,Brant Kobersky,M,SBD,MR-C,105,Raw,1998,Sam Houston State University Powerlifting Club,TX,103.7,220,232.5,240,240,152.5,160,-167.5,160,227.5,240,-252.5,240,640,,
6,Tucker Smith,M,SBD,MR-C,105,Raw,1997,Texas A&M Powerlifting,TX,95.3,200,212.5,225,225,140,145,155,155,225,235,245,245,625,,
7,Raul Aguilera,M,SBD,MR-C,105,Raw,1997,,TX,102.4,185,195,202.5,202.5,135,142.5,-147.5,142.5,235,245,255,255,600,,
8,Eston Epton,M,SBD,MR-C,105,Raw,2000,Matador Powerlifting,TX,94.4,190,202.5,-212.5,202.5,137.5,145,150,150,205,220,230,230,582.5,,
9,Billy Asch,M,SBD,MR-C,105,Raw,1999,Texas A&M Powerlifting,TX,103.3,200,210,215,215,112.5,-117.5,-117.5,112.5,215,230,245,245,572.5,,
10,Lance Delago,M,SBD,MR-C,105,Raw,1998,,TX,104.2,185,195,200,200,115,122.5,127.5,127.5,227.5,237.5,245,245,572.5,,
11,Evan Bilicek,M,SBD,MR-C,105,Raw,1997,Texas A&M Powerlifting,TX,104.7,195,205,210,210,122.5,130,-132.5,130,215,,232.5,232.5,572.5,,
12,Aaron Villalobos,M,SBD,MR-C,105,Raw,2001,,TX,103.8,205,215,227.5,227.5,105,110,117.5,117.5,195,207.5,220,220,565,,
13,Yamir Flores,M,SBD,MR-C,105,Raw,1995,Texas A&M Powerlifting,TX,95.3,-205,205,220,220,107.5,115,-122.5,115,215,227.5,-237.5,227.5,562.5,,
14,Hunter York,M,SBD,MR-C,105,Raw,1999,,TX,104.9,185,195,-205,195,120,130,140,140,215,220,225,225,560,,
15,Alec Telles,M,SBD,MR-C,105,Raw,1997,Matador Powerlifting,CA,95.5,205,-215,-215,205,112.5,117.5,-122.5,117.5,200,215,230,230,552.5,,
16,Brandon Kim,M,SBD,MR-C,105,Raw,2000,Matador Powerlifting,TX,98,187.5,197.5,207.5,207.5,130,-137.5,-137.5,130,187.5,200,212.5,212.5,550,,
17,Christian Mathews,M,SBD,MR-C,105,Raw,1997,Matador Powerlifting,TX,103.6,185,197.5,-210,197.5,120,127.5,132.5,132.5,207.5,-220,220,220,550,,
DQ,Keaton Kaulfus,M,SBD,MR-C,105,Raw,2001,,TX,93.3,-192.5,192.5,-197.5,192.5,-137.5,-137.5,-137.5,,,,,,,,
1,Dakoda Trull,M,SBD,MR-C,120,Raw,2000,Matador Powerlifting,TX,117.6,297.5,312.5,322.5,322.5,165,177.5,-182.5,177.5,275,290,-300,290,790,,
2,Dalton Cyr,M,SBD,MR-C,120,Raw,1998,,TX,118,245,257.5,265,265,152.5,157.5,,157.5,275,-287.5,-292.5,275,697.5,,
3,Hector Rangel,M,SBD,MR-C,120,Raw,1994,,TX,116.2,227.5,237.5,,237.5,177.5,182.5,-187.5,182.5,250,255,262.5,262.5,682.5,,
4,Joseph Stornello,M,SBD,MR-C,120,Raw,2000,,TX,115.6,207.5,220,230,230,147.5,152.5,160,160,205,215,230,230,620,,
5,Austin Culver,M,SBD,MR-C,120,Raw,2000,,TX,118.7,195,205,210,210,137.5,147.5,-155,147.5,215,237.5,-250,237.5,595,,
6,Adam Silva,M,SBD,MR-C,120,Raw,1996,,TX,118.8,180,200,220,220,112.5,-122.5,-130,112.5,150,170,190,190,522.5,,
7,Alexander Cao,M,SBD,MR-C,120,Raw,1997,,TX,108.2,192.5,200,207.5,207.5,97.5,102.5,-107.5,102.5,197.5,207.5,-210,207.5,517.5,,
DQ,Astin Carr,M,SBD,MR-C,120,Raw,2000,,TX,117.6,205,227.5,-240,227.5,-160,-160,-160,,-185,,,,,,
1,Joseph Peña #1,M,SBD,MR-C,120+,Raw,1998,,TX,172.8,385,395,410,410,205,212.5,222.5,222.5,295,310,-325,310,942.5,,
2,Travis Shouse,M,SBD,MR-C,120+,Raw,1998,,TX,142.7,290,305,320,320,165,175,182.5,182.5,295,310,-325,310,812.5,,
3,Carter Wheat,M,SBD,MR-C,120+,Raw,1998,,TX,155.2,275,290,302.5,302.5,165,175,182.5,182.5,275,287.5,300,300,785,,
4,Sean Cowans,M,SBD,MR-C,120+,Raw,1996,,TX,124.8,260,280,-290,280,195,-207.5,-207.5,195,300,-315,-315,300,775,,
5,Andres Soto,M,SBD,MR-C,120+,Raw,1998,,TX,133.7,250,265,-275,265,137.5,145,150,150,235,-242.5,,235,650,,
6,Daniel Sánchez,M,SBD,MR-C,120+,Raw,1997,,TX,128,220,227.5,240,240,140,145,150,150,220,225,230,230,620,,
7,Sawyer Caldwell,M,SBD,MR-C,120+,Raw,1997,,TX,130.1,192.5,202.5,212.5,212.5,145,-150,-150,145,-202.5,202.5,-212.5,202.5,560,,
8,Gilbert Ibarra,M,SBD,MR-C,120+,Raw,1999,,TX,140,195,197.5,-200,197.5,107.5,112.5,-120,112.5,-210,210,215,215,525,,
1,Matthew Conner,M,SBD,MR-Jr,74,Raw,1996,,TX,73.4,232.5,240,247.5,247.5,132.5,140,-145,140,277.5,-292.5,292.5,292.5,680,,
2,Roman Ornelaz,M,SBD,MR-Jr,74,Raw,1999,,TX,70.9,175,182.5,-187.5,182.5,105,107.5,112.5,112.5,215,227.5,-232.5,227.5,522.5,,
3,Donovan Torres,M,SBD,MR-Jr,74,Raw,1998,,TX,72.4,142.5,-152.5,-152.5,142.5,-97.5,97.5,102.5,102.5,-167.5,167.5,-185,167.5,412.5,,
DQ,Phillip Wilson,M,SBD,MR-Jr,83,Raw,1998,,TX,77.9,242.5,-257.5,-257.5,242.5,-152.5,-152.5,-152.5,,-240,-240,-240,,,,
1,Brandon Davis,M,SBD,MR-Jr,93,Raw,1998,,TX,92.9,145,150,160,160,120,122.5,-130,122.5,220,225,235,235,517.5,,
1,Quinton Maynor,M,SBD,MR-Jr,105,Raw,1997,,TX,103.5,247.5,257.5,-275,257.5,140,142.5,145,145,265,285,-292.5,285,687.5,,
2,Reyes Lopez,M,SBD,MR-Jr,105,Raw,1998,,TX,103.6,-230,-230,230,230,155,162.5,170,170,252.5,262.5,272.5,272.5,672.5,,
3,John Manzano,M,SBD,MR-Jr,105,Raw,1998,,TX,102.3,165,175,182.5,182.5,122.5,127.5,-132.5,127.5,180,192.5,205,205,515,,
4,Ramiro Lopez,M,SBD,MR-Jr,105,Raw,1998,,TX,98.8,150,160,170,170,110,120,-125,120,175,190,200,200,490,,
1,Jacob Garcia,M,SBD,MR-Jr,120,Raw,1999,,TX,108.2,-152.5,-152.5,152.5,152.5,142.5,150,155,155,157.5,-165,-167.5,157.5,465,,
1,Allen Alvarez Jr,M,SBD,MR-Jr,120+,Raw,1999,,TX,125,227.5,235,245,245,150,155,-160,155,245,-260,-260,245,645,,
2,Ricardo Tanguma Jr,M,SBD,MR-Jr,120+,Raw,1998,,TX,134,-185,185,-195,185,85,90,100,100,145,150,-185,150,435,,
1,Martin Hill,M,SBD,MR-M1a,120+,Raw,1976,,TX,120.9,175,182.5,187.5,187.5,115,127.5,-135,127.5,205,215,227.5,227.5,542.5,,
1,Alfonso Alvarez,M,SBD,MR-M1b,93,Raw,1971,,TX,91.9,190,-200,200,200,130,140,-142.5,140,190,197.5,210,210,550,,
2,Robert Gamble,M,SBD,MR-M1b,93,Raw,1973,,TX,90.7,155,162.5,170,170,112.5,117.5,-122.5,117.5,180,192.5,-200,192.5,480,,
1,Paul Whitaker,M,SBD,MR-M1b,120+,Raw,1971,,ND,122.8,205,-215,225,225,125,135,137.5,137.5,200,205,215,215,577.5,,
1,Allen Alvarez,M,SBD,MR-M2a,120,Raw,1969,,TX,107.3,147.5,160,182.5,182.5,102.5,110,-122.5,110,182.5,202.5,-212.5,202.5,495,,
1,Paul Gates,M,B,MR-M2b,120,Raw,1961,,TX,114.7,,,,,147.5,155,-157.5,155,,,,,155,,
DQ,Jamie Billings,M,SBD,MR-M3a,120,Raw,1958,,TX,109.9,-180,-180,-180,,115,120,-130,120,185,195,-205,195,,,
1,Joe Lucio,M,SBD,MR-M4a,93,Raw,1947,,TX,89.6,117.5,127.5,132.5,132.5,77.5,82.5,87.5,87.5,142.5,152.5,160,160,380,,
1,David Berube,M,SBD,MR-O,59,Raw,1991,,TX,55.9,75,82.5,-87.5,82.5,55,-60,60,60,100,110,-130,110,252.5,,
DQ,Jose Bautista #1,M,SBD,MR-O,59,Raw,1999,,TX,58.9,-190,190,200,200,-125,-125,-125,,-230,-230,-230,,,,
1,Brando Caballero,M,SBD,MR-O,74,Raw,1994,,TX,73.7,172.5,182.5,190,190,122.5,130,-132.5,130,202.5,215,225,225,545,,
1,Max Eremin,M,SBD,MR-O,83,Raw,1982,,TX,82.1,240,252.5,257.5,257.5,125,132.5,137.5,137.5,250,262.5,270,270,665,,
2,Christian Scogna,M,SBD,MR-O,83,Raw,1992,,TX,80,190,200,207.5,207.5,120,130,-135,130,230,240,252.5,252.5,590,,
3,Blake Lander,M,SBD,MR-O,83,Raw,1992,,TX,82.3,185,192.5,-205,192.5,112.5,117.5,120,120,205,217.5,227.5,227.5,540,,
4,Rocky Trejo,M,SBD,MR-O,83,Raw,1995,,TX,82.3,167.5,175,-182.5,175,105,107.5,-117.5,107.5,177.5,190,195,195,477.5,,
5,Benjamin Coates,M,SBD,MR-O,83,Raw,1993,Oppose Gravity,TX,80.5,100,107.5,112.5,112.5,85,90,-92.5,90,125,132.5,137.5,137.5,340,,
DQ,Phillip Wilson,M,SBD,MR-O,83,Raw,1998,,TX,77.9,242.5,-257.5,-257.5,242.5,-152.5,-152.5,-152.5,,-240,-240,-240,,,,
1,Dylan Vogt,M,SBD,MR-O,93,Raw,2000,,TX,91.2,220,237.5,250,250,140,150,-160,150,-245,267.5,272.5,272.5,672.5,,
2,Zachary Burkhalter,M,SBD,MR-O,93,Raw,1994,,TX,92.4,217.5,225,-235,225,132.5,142.5,150,150,240,-265,-265,240,615,,
3,Gilbert Valadez,M,SBD,MR-O,93,Raw,1999,,TX,91.7,220,-222.5,-255,220,120,-127.5,-127.5,120,-260,272.5,-295,272.5,612.5,,
4,Ethan Valdes,M,SBD,MR-O,93,Raw,1992,,TX,92.7,175,185,192.5,192.5,130,135,142.5,142.5,210,227.5,240,240,575,,
5,Tucker Walters,M,SBD,MR-O,93,Raw,2001,,TX,92.4,-180,180,190,190,105,110,120,120,230,240,-265,240,550,,
6,Kaleb Huckeba,M,SBD,MR-O,93,Raw,1995,,TX,92,142.5,150,157.5,157.5,105,112.5,-120,112.5,165,177.5,187.5,187.5,457.5,,
DQ,Adam Harper,M,SBD,MR-O,93,Raw,1989,,NM,90.9,-232.5,-232.5,-232.5,,-157.5,-157.5,-157.5,,240,260,-272.5,260,,,
DQ,Garry Mendez,M,SBD,MR-O,93,Raw,1985,,TX,92.7,257.5,270,277.5,277.5,152.5,162.5,-167.5,162.5,-300,-300,-300,,,,
1,Quinton Maynor,M,SBD,MR-O,105,Raw,1997,,TX,103.5,247.5,257.5,-275,257.5,140,142.5,145,145,265,285,-292.5,285,687.5,,
2,Jaime Castillo,M,SBD,MR-O,105,Raw,1980,,TX,103.4,235,242.5,-250,242.5,142.5,155,-157.5,155,260,270,-280,270,667.5,,
3,John Gutierrez,M,SBD,MR-O,105,Raw,1988,,TX,99.8,-210,215,222.5,222.5,-187.5,187.5,190,190,230,245,252.5,252.5,665,,
4,Nathanael Dominguez,M,SBD,MR-O,105,Raw,1987,,TX,98.4,185,192.5,202.5,202.5,135,142.5,147.5,147.5,225,237.5,247.5,247.5,597.5,,
5,Steven Tassin,M,SBD,MR-O,105,Raw,1991,,TX,100.5,210,220,-227.5,220,125,132.5,-137.5,132.5,220,227.5,237.5,237.5,590,,
1,Marcos Alfaro,M,SBD,MR-O,120,Raw,1995,,TX,117.9,260,277.5,290,290,150,160,165,165,275,282.5,297.5,297.5,752.5,,
2,William Goode,M,SBD,MR-O,120,Raw,1995,,TX,118.7,265,280,,280,172.5,-180,180,180,275,-287.5,287.5,287.5,747.5,,
3,Rhode Rodriguez,M,SBD,MR-O,120,Raw,1987,,TX,107.7,200,210,222.5,222.5,140,145,-150,145,242.5,255,260,260,627.5,,
4,Nathaniel Goode,M,SBD,MR-O,120,Raw,1993,,TX,115.1,215,225,-235,225,165,-175,-175,165,-225,225,-232.5,225,615,,
5,Wiley Tisdale,M,SBD,MR-O,120,Raw,1991,,TX,113.1,185,202.5,-207.5,202.5,137.5,-142.5,-142.5,137.5,230,245,-255,245,585,,
6,Dylan Billings,M,SBD,MR-O,120,Raw,1992,,TX,118.9,-207.5,207.5,-220,207.5,137.5,140,-142.5,140,215,-225,225,225,572.5,,
7,Robert Harbaugh,M,SBD,MR-O,120,Raw,1988,,TX,105.5,145,-180,-180,145,135,-140,-140,135,200,210,215,215,495,,
1,John Bell,M,SBD,MR-O,120+,Raw,1986,Oppose Gravity,TX,130.5,255,272.5,-277.5,272.5,155,165,175,175,287.5,295,-300,295,742.5,,
2,Kyle Franke #1,M,SBD,MR-O,120+,Raw,1991,,TX,169.2,240,247.5,255,255,150,157.5,162.5,162.5,270,277.5,-282.5,277.5,695,,
3,Michael Murphy,M,SBD,MR-O,120+,Raw,1993,,TX,125.5,235,245,-252.5,245,175,-182.5,-182.5,175,240,-250,-250,240,660,,
DQ,Adam Rath,M,SBD,MR-O,120+,Raw,1990,,TX,143.5,230,245,255,255,137.5,145,150,150,-207.5,-207.5,-207.5,,,,
1,David Berube,M,SBD,MR-SO,59,Raw,1991,,TX,55.9,75,82.5,-87.5,82.5,55,-60,60,60,100,110,-130,110,252.5,,
1,Joseph Songco,M,SBD,MR-SO,66,Raw,1991,,TX,63.8,-85,85,-92.5,85,82.5,-87.5,87.5,87.5,127.5,142.5,-157.5,142.5,315,,
2,Michael Joyce,M,SBD,MR-SO,66,Raw,1992,,TX,61.8,-32.5,32.5,37.5,37.5,42.5,50,55,55,75,85,92.5,92.5,185,,
DQ,Leeon Grullon,M,SBD,MR-SO,83,Raw,1996,,TX,80.5,20,30,35,35,-20,-20,-25,,40,50,55,55,,,
1,Tristen Bresnahan,M,SBD,MR-SO,93,Raw,1999,,TX,87.5,175,182.5,185,185,107.5,112.5,-115,112.5,190,200,202.5,202.5,500,,
2,Caleb Casburn,M,SBD,MR-SO,93,Raw,2003,,TX,86,-47.5,57.5,62.5,62.5,42.5,-57.5,57.5,57.5,75,97.5,107.5,107.5,227.5,,
1,Gabriel Driscoll,M,SBD,MR-T1,66,Raw,2004,,TX,62.3,137.5,-140,-140,137.5,67.5,-72.5,72.5,72.5,150,152.5,155,155,365,,
1,Edward Soefje,M,SBD,MR-T1,105,Raw,2005,,TX,101.1,175,187.5,200,200,110,117.5,-125,117.5,147.5,157.5,167.5,167.5,485,,
1,Ryan Arenz,M,SBD,MR-T2,74,Raw,2002,,TX,66.8,112.5,125,132.5,132.5,80,85,87.5,87.5,145,152.5,162.5,162.5,382.5,,
1,Paul Whitaker,M,SBD,MR-T2,83,Raw,2002,,ND,74.4,110,125,-135,125,55,-62.5,-65,55,110,125,137.5,137.5,317.5,,
1,Dominic Davis,M,SBD,MR-T2,105,Raw,2002,,TX,101.4,-167.5,180,190,190,92.5,97.5,102.5,102.5,180,190,202.5,202.5,495,,
1,Dylan Vogt,M,SBD,MR-T3,93,Raw,2000,,TX,91.2,220,237.5,250,250,140,150,-160,150,-245,267.5,272.5,272.5,672.5,,
2,Gilbert Valadez,M,SBD,MR-T3,93,Raw,1999,,TX,91.7,220,-222.5,-255,220,120,-127.5,-127.5,120,-260,272.5,-295,272.5,612.5,,
3,Brandon Duenas,M,SBD,MR-T3,93,Raw,2001,,TX,83.8,-200,200,217.5,217.5,112.5,-125,125,125,210,227.5,-230,227.5,570,,
DQ,Ty Denges,M,SBD,MR-Y3,83,Raw,2006,,TX,76,90,95,-102.5,95,47.5,55,-57.5,55,97.5,117.5,-137.5,117.5,,,
1,Keegan Garcia,M,SBD,MR-Y3,120,Raw,2006,,TX,118.7,140,152.5,157.5,157.5,65,75,77.5,77.5,157.5,175,185,185,420,,
1,Harrison Gaenzel,M,SBD,M-T1,74,Single-ply,2004,,TX,67.3,167.5,175,185,185,-92.5,92.5,95,95,155,170,177.5,177.5,457.5,,
1,Oscar Mercado,M,SBD,M-T2,66,Single-ply,2003,,TX,64.9,170,182.5,-185,182.5,-102.5,102.5,112.5,112.5,170,-185,-185,170,465,,
1,Mario Cabrera,M,SBD,M-T2,74,Single-ply,2002,,TX,73.7,-215,215,-235,215,127.5,132.5,-137.5,132.5,215,230,-235,230,577.5,,
1,Paul Whitaker,M,BD,MR-M,120+,Raw,1971,,ND,122.8,,,,,125,135,137.5,137.5,200,205,215,215,352.5,,
DQ,Adam Harper,M,BD,MR-O,93,Raw,1989,,NM,90.9,,,,,-157.5,-157.5,-157.5,,240,260,-272.5,260,,,
1,James Rac,M,BD,MR-O,105,Raw,1988,,TX,103.8,,,,,90,100,-105,100,165,180,190,190,290,,
1,Paul Whitaker,M,BD,MR-T2,83,Raw,2002,,ND,74.4,,,,,55,-62.5,-65,55,110,125,137.5,137.5,192.5,,
DQ,Ty Denges,M,BD,MR-Y3,83,Raw,2006,,TX,76,,,,,47.5,55,-57.5,55,97.5,117.5,-137.5,117.5,,,
