Division,WeightClassKg,Place,Name,Team,BodyweightKg,Best3SquatKg,Best3BenchKg,Best3DeadliftKg,TotalKg,Equipment,Event,Sex
Boys,51.71,1,Braden Fears,White Oak,51.53,129.27,79.38,142.88,351.53,Single-ply,SBD,M
Boys,51.71,2,Coleman Hardin,Frankston,51.35,131.54,56.7,138.35,326.59,Single-ply,SBD,M
Boys,51.71,3,Landon Warren,Bullard,47.9,88.45,56.7,102.06,247.21,Single-ply,SBD,M
Boys,51.71,4,Bailey McGill,Texarkana Pleasant Grove,45.9,79.38,34.02,95.25,208.65,Single-ply,SBD,M
Boys,51.71,5,Brandon Stidham,Gladewater Sabine,45.72,115.67,65.77,,181.44,Single-ply,SB,M
Boys,55.79,1,Grayson Bathke,Laird Hill Leveretts Chapel,54.98,113.4,61.23,133.81,308.44,Single-ply,SBD,M
Boys,59.87,1,JJ Beckfield,Frankston,59.51,142.88,70.31,145.15,358.34,Single-ply,SBD,M
Boys,59.87,2,Noble Giles,Frankston,58.06,120.2,63.5,145.15,328.85,Single-ply,SBD,M
Boys,59.87,3,Walter Jones,Laird Hill Leveretts Chapel,58.97,113.4,68.04,115.67,297.1,Single-ply,SBD,M
Boys,59.87,4,Kalib Kerns,White Oak,57.7,97.52,65.77,122.47,285.76,Single-ply,SBD,M
Boys,67.13,1,Mauro Gallegos,Gladewater Sabine,66.04,185.97,104.33,174.63,464.93,Single-ply,SBD,M
Boys,67.13,2,Josh Williams,Troup,66.68,158.76,74.84,183.7,417.3,Single-ply,SBD,M
Boys,67.13,3,Chadd Cole,Troup,62.69,140.61,97.52,151.95,390.09,Single-ply,SBD,M
Boys,67.13,4,Josh Mascola,Bullard,65.41,154.22,88.45,147.42,390.09,Single-ply,SBD,M
Boys,67.13,5,James Jacobs #3,Gladewater Sabine,62.41,140.61,79.38,165.56,385.55,Single-ply,SBD,M
Boys,67.13,6,Malik Cannon,Jefferson,64.32,133.81,74.84,151.95,360.61,Single-ply,SBD,M
Boys,67.13,7,Caleb Smith #8,Troup,63.32,138.35,81.65,136.08,356.07,Single-ply,SBD,M
Boys,67.13,8,Clayton Carnes,Frankston,65.14,113.4,68.04,142.88,324.32,Single-ply,SBD,M
Boys,67.13,9,Ben Workman,Frankston,63.23,115.67,65.77,138.35,319.78,Single-ply,SBD,M
Boys,67.13,10,Akec Morris,Gladewater Sabine,60.96,102.06,79.38,124.74,306.17,Single-ply,SBD,M
Boys,67.13,11,Christian Ifuku,Winnsboro,66.41,115.67,74.84,111.13,301.64,Single-ply,SBD,M
Boys,67.13,12,Daniel Williamson,White Oak,62.6,104.33,58.97,122.47,285.76,Single-ply,SBD,M
Boys,67.13,13,Dakota Simmons,Bullard,66.04,90.72,63.5,108.86,263.08,Single-ply,SBD,M
Boys,67.13,14,Jacarveious Horton,Center,65.32,86.18,54.43,99.79,240.4,Single-ply,SBD,M
Boys,74.84,1,Toby Thatcher,Bullard,72.85,244.94,149.69,222.26,616.89,Single-ply,SBD,M
Boys,74.84,2,Jonathan Spurlin,Winnsboro,74.84,183.7,129.27,183.7,496.68,Single-ply,SBD,M
Boys,74.84,3,Jacobi Jackson,Shelbyville,68.49,145.15,95.25,158.76,399.16,Single-ply,SBD,M
Boys,74.84,4,Garrett Young,Ore City,74.39,142.88,113.4,142.88,399.16,Single-ply,SBD,M
Boys,74.84,5,Christian Lee,Center,71.76,149.69,90.72,156.49,396.89,Single-ply,SBD,M
Boys,74.84,6,Jose Gaspar,Winnsboro,72.21,133.81,97.52,122.47,353.8,Single-ply,SBD,M
Boys,74.84,7,Cade Hollingsworth,Bullard,74.75,124.74,79.38,149.69,353.8,Single-ply,SBD,M
Boys,74.84,8,Anthony Horton,Center,69.76,113.4,83.91,113.4,310.71,Single-ply,SBD,M
Boys,74.84,9,Todd Flannigan,Mount Enterprise,70.94,97.52,72.57,113.4,283.5,Single-ply,SBD,M
Boys,74.84,10,Reuben Infante,Winnsboro,67.68,106.59,70.31,102.06,278.96,Single-ply,SBD,M
Boys,74.84,11,Aaren Webb,Gladewater Sabine,70.85,90.72,56.7,111.13,258.55,Single-ply,SBD,M
Boys,74.84,12,Dawson Blear,Laird Hill Leveretts Chapel,72.39,99.79,58.97,90.72,249.48,Single-ply,SBD,M
Boys,74.84,13,Corey White,Jefferson,67.31,61.23,45.36,97.52,204.12,Single-ply,SBD,M
Boys,74.84,14,Michael Zuniga,Troup,71.12,161.03,,,161.03,Single-ply,S,M
Boys,74.84,15,Daniel Wood,Gladewater Sabine,73.03,147.42,,,147.42,Single-ply,S,M
Boys,82.1,1,JaCarlos Hall,Center,77.11,238.14,124.74,204.12,566.99,Single-ply,SBD,M
Boys,82.1,2,Ramiro Martinez,Troup,78.83,204.12,140.61,219.99,564.72,Single-ply,SBD,M
Boys,82.1,3,Kolby Brown,Winnsboro,78.38,183.7,129.27,183.7,496.68,Single-ply,SBD,M
Boys,82.1,4,Caleb Hampton,White Oak,76.2,181.44,120.2,163.29,464.93,Single-ply,SBD,M
Boys,82.1,5,Dylan Denby,Center,77.47,204.12,104.33,151.95,460.4,Single-ply,SBD,M
Boys,82.1,6,Tristan Clark,Troup,80.74,158.76,113.4,188.24,460.4,Single-ply,SBD,M
Boys,82.1,7,Cole Hobbs,Gladewater Sabine,81.74,170.1,111.13,170.1,451.32,Single-ply,SBD,M
Boys,82.1,8,Adrian Snyder,White Oak,79.29,140.61,97.52,172.37,410.5,Single-ply,SBD,M
Boys,82.1,9,Justin Ortiz,Frankston,81.19,142.88,81.65,158.76,383.29,Single-ply,SBD,M
Boys,82.1,10,Jordan Williams #1,Shelbyville,79.2,136.08,79.38,154.22,369.68,Single-ply,SBD,M
Boys,82.1,11,Kaden Loebig,Frankston,77.29,136.08,77.11,145.15,358.34,Single-ply,SBD,M
Boys,82.1,12,Scott Davis,Mount Enterprise,77.93,102.06,79.38,142.88,324.32,Single-ply,SBD,M
Boys,82.1,13,Cash Steck,Ore City,75.02,104.33,56.7,136.08,297.1,Single-ply,SBD,M
Boys,82.1,14,Jordan Randle,Jefferson,81.74,183.7,,,183.7,Single-ply,S,M
Boys,82.1,DQ,Adam Caudle,Gladewater Sabine,78.47,,,,,Single-ply,SBD,M
Boys,82.1,DQ,Austin Davis,Bullard,77.84,229.06,142.88,,,Single-ply,SBD,M
Boys,89.81,1,Witt Dockens,Center,85.64,238.14,136.08,215.46,589.67,Single-ply,SBD,M
Boys,89.81,2,Logan Jefferson,Shelbyville,88.99,181.44,124.74,181.44,487.61,Single-ply,SBD,M
Boys,89.81,3,Mack Weaver,Troup,88.45,192.78,113.4,172.37,478.54,Single-ply,SBD,M
Boys,89.81,4,Cheyenne Compton,Gladewater Sabine,87.63,176.9,88.45,188.24,453.59,Single-ply,SBD,M
Boys,89.81,5,Patrick Martinez,White Oak,86.09,158.76,97.52,190.51,446.79,Single-ply,SBD,M
Boys,89.81,6,Zach Maly,White Oak,88.72,154.22,111.13,158.76,424.11,Single-ply,SBD,M
Boys,89.81,7,Caleb Porchia,Texarkana Pleasant Grove,89.18,183.7,97.52,136.08,417.3,Single-ply,SBD,M
Boys,89.81,8,Cameron Bridges,Bullard,87.82,142.88,95.25,124.74,362.87,Single-ply,SBD,M
Boys,89.81,9,Hunter Casey #1,Shelbyville,85.73,104.33,81.65,147.42,333.39,Single-ply,SBD,M
Boys,89.81,10,Tyler Cardenas,Ore City,88.99,136.08,74.84,111.13,322.05,Single-ply,SBD,M
Boys,89.81,DQ,Hunter Minor,Ore City,84.37,,,,,Single-ply,SBD,M
Boys,89.81,DQ,David Allen,Troup,89.81,,,,,Single-ply,SBD,M
Boys,99.79,1,Trent Allen,Troup,95.8,254.01,158.76,226.8,639.57,Single-ply,SBD,M
Boys,99.79,2,Damian Hines,Jefferson,96.8,238.14,129.27,272.16,639.57,Single-ply,SBD,M
Boys,99.79,3,Thomas Brooks,Bullard,91.26,204.12,158.76,204.12,566.99,Single-ply,SBD,M
Boys,99.79,4,Jesse Owen,Frankston,99.7,226.8,113.4,204.12,544.31,Single-ply,SBD,M
Boys,99.79,5,Logan Holloway,Center,97.52,174.63,97.52,181.44,453.59,Single-ply,SBD,M
Boys,99.79,6,Keith Ritter,Ore City,90.81,158.76,102.06,158.76,419.57,Single-ply,SBD,M
Boys,99.79,7,Brendon Mooney,Hawkins,95.35,147.42,88.45,151.95,387.82,Single-ply,SBD,M
Boys,109.77,1,Reece Clark,Troup,105.96,272.16,158.76,251.74,682.66,Single-ply,SBD,M
Boys,109.77,2,Alijuan Rice,Jefferson,107.5,222.26,142.88,190.51,555.65,Single-ply,SBD,M
Boys,109.77,3,Scotty Van Schoyk,Ore City,108.41,208.65,124.74,181.44,514.83,Single-ply,SBD,M
Boys,109.77,4,William Kliewer,Texarkana Pleasant Grove,100.43,170.1,111.13,183.7,464.93,Single-ply,SBD,M
Boys,109.77,5,Chad Batie,Laird Hill Leveretts Chapel,108.5,165.56,115.67,176.9,458.13,Single-ply,SBD,M
Boys,109.77,6,Grant Newton,Winnsboro,108.23,179.17,111.13,156.49,446.79,Single-ply,SBD,M
Boys,109.77,7,Sanjay Pokhrel,Texarkana Pleasant Grove,106.32,170.1,90.72,170.1,430.91,Single-ply,SBD,M
Boys,109.77,8,Josh Caruso,Hawkins,100.7,149.69,95.25,172.37,417.3,Single-ply,SBD,M
Boys,109.77,9,Cole Slade,Texarkana Pleasant Grove,103.06,161.03,99.79,151.95,412.77,Single-ply,SBD,M
Boys,109.77,10,Dalton Greenlee,Texarkana Pleasant Grove,103.51,124.74,106.59,147.42,378.75,Single-ply,SBD,M
Boys,109.77,11,Aj Leyva,Ore City,104.6,140.61,68.04,145.15,353.8,Single-ply,SBD,M
Boys,109.77,12,Blanton Miles,Laird Hill Leveretts Chapel,104.05,127.01,68.04,145.15,340.19,Single-ply,SBD,M
Boys,109.77,13,David Hart,Ore City,105.23,181.44,113.4,,294.84,Single-ply,SB,M
Boys,124.74,1,Kawon McCowin,Shelbyville,115.21,215.46,136.08,204.12,555.65,Single-ply,SBD,M
Boys,124.74,2,Zach Wrinkle,Texarkana Pleasant Grove,113.67,172.37,102.06,165.56,439.98,Single-ply,SBD,M
Boys,124.74+,1,Malik Gilliam,Troup,158.76,283.5,149.69,226.8,659.98,Single-ply,SBD,M
Boys,124.74+,2,Carter Wheat,White Oak,131.63,254.01,142.88,222.26,619.15,Single-ply,SBD,M
Boys,124.74+,3,Nick Gavriel,Texarkana Pleasant Grove,137.89,197.31,136.08,183.7,517.1,Single-ply,SBD,M
Boys,124.74+,4,John McCurdy,Winnsboro,135.17,174.63,138.35,165.56,478.54,Single-ply,SBD,M
Boys,124.74+,5,Devin Lewis,Bullard,147.69,185.97,111.13,174.63,471.74,Single-ply,SBD,M
Boys,124.74+,6,Jason Boone,Hawkins,159.21,151.95,102.06,181.44,435.45,Single-ply,SBD,M
