Division,WeightClassKg,Place,Name,Team,BodyweightKg,Best3SquatKg,Best3BenchKg,Best3DeadliftKg,TotalKg,Equipment,Event,Sex
Boys,51.71,1,Jaime Flores,Mount Pleasant,50.89,95.25,74.84,111.13,281.23,Single-ply,SBD,M
Boys,51.71,2,Hogan Goodson,Pattonville Prairiland,50.58,74.84,52.16,113.4,240.4,Single-ply,SBD,M
Boys,51.71,4,Wade Simpson,Maud,46.27,83.91,38.56,104.33,226.8,Single-ply,SBD,M
Boys,51.71,5,Pablo Gutierrez #1,Mount Pleasant,46.49,83.91,52.16,90.72,226.8,Single-ply,SBD,M
Boys,51.71,6,Cody Brock,Detroit,49.8,52.16,,86.18,138.35,Single-ply,SD,M
Boys,51.71,7,Billy Dy,Ore City,50.53,,52.16,61.23,113.4,Single-ply,BD,M
Boys,55.79,1,Ryan Fincher,Queen City,54.88,142.88,72.57,136.08,351.53,Single-ply,SBD,M
Boys,55.79,3,Isaiha Peters,Paris Chisum,53.98,115.67,61.23,113.4,290.3,Single-ply,SBD,M
Boys,55.79,4,Markaile Barnatt,Honey Grove,55.34,90.72,45.36,113.4,249.48,Single-ply,SBD,M
Boys,55.79,5,Landon Willis,Wolfe City,53.07,63.5,61.23,83.91,208.65,Single-ply,SBD,M
Boys,59.87,1,Ryder Brock,Detroit,58.83,147.42,74.84,165.56,387.82,Single-ply,SBD,M
Boys,59.87,3,Jacori Denmark,Hughes Springs,56.7,120.2,65.77,136.08,322.05,Single-ply,SBD,M
Boys,67.13,4,Ethan Wagner,Texarkana Pleasant Grove,59.92,120.2,72.57,127.01,319.78,Single-ply,SBD,M
Boys,59.87,5,Josh Rodriguez,Honey Grove,57.83,90.72,63.5,124.74,278.96,Single-ply,SBD,M
Boys,59.87,6,Bryan Soto,Wolfe City,56.7,124.74,,138.35,263.08,Single-ply,SD,M
Boys,59.87,7,Eric Cox,Texarkana Pleasant Grove,59.06,90.72,54.43,117.93,263.08,Single-ply,SBD,M
Boys,59.87,DQ,Matt Hahn,Texarkana Pleasant Grove,59.65,138.35,,,,Single-ply,SBD,M
Boys,67.13,1,Kolton Morgan,Queen City,64.86,174.63,104.33,170.1,449.06,Single-ply,SBD,M
Boys,67.13,2,Daniel Broyles,Quinlan Boles,66.59,197.31,113.4,136.08,446.79,Single-ply,SBD,M
Boys,74.84,3,Brandon Gillen,Paris Chisum,67.36,165.56,97.52,172.37,435.45,Single-ply,SBD,M
Boys,67.13,4,Dylan Gibson,Maud,63.59,181.44,81.65,158.76,421.84,Single-ply,SBD,M
Boys,67.13,5,Wesley McCrary,Wolfe City,66.9,156.49,111.13,149.69,417.3,Single-ply,SBD,M
Boys,74.84,6,Keitron Reed,Paris North Lamar,67.31,163.29,86.18,167.83,417.3,Single-ply,SBD,M
Boys,67.13,7,Hoss McElroy,Honey Grove,66.95,147.42,83.91,174.63,405.97,Single-ply,SBD,M
Boys,67.13,8,Austin Wright,Maud,63.96,170.1,70.31,158.76,399.16,Single-ply,SBD,M
Boys,67.13,10,Ty Everett,Texarkana Pleasant Grove,66.22,145.15,88.45,158.76,392.36,Single-ply,SBD,M
Boys,67.13,11,Jared Scott #2,Texarkana Pleasant Grove,64.18,154.22,77.11,158.76,390.09,Single-ply,SBD,M
Boys,67.13,12,Joshua Martinez,Mount Pleasant,64.18,122.47,99.79,149.69,371.95,Single-ply,SBD,M
Boys,67.13,13,Levi Bettes,Honey Grove,65.23,145.15,77.11,147.42,369.68,Single-ply,SBD,M
Boys,67.13,14,Ethan Flippen,Paris Chisum,63.5,95.25,83.91,147.42,326.59,Single-ply,SBD,M
Boys,67.13,15,Nick Noble,Paris North Lamar,66.63,113.4,68.04,136.08,317.51,Single-ply,SBD,M
Boys,67.13,16,Koal Milner,Mount Pleasant,63.87,127.01,74.84,113.4,315.25,Single-ply,SBD,M
Boys,67.13,18,Mason Chrisman,Paris North Lamar,66.63,99.79,63.5,140.61,303.91,Single-ply,SBD,M
Boys,67.13,19,Dustin Ritter,Ore City,66.86,104.33,68.04,129.27,301.64,Single-ply,SBD,M
Boys,67.13,20,Dustin Ervin,Detroit,66.72,113.4,65.77,115.67,294.84,Single-ply,SBD,M
Boys,67.13,21,Austin Cunningham,Paris North Lamar,63,95.25,56.7,124.74,276.69,Single-ply,SBD,M
Boys,67.13,22,Xavier McDonald,Clarksville,64.46,,83.91,183.7,267.62,Single-ply,BD,M
Boys,67.13,23,Dakota Vanderburg,Paris Chisum,66.9,102.06,74.84,,176.9,Single-ply,SB,M
Boys,67.13,DQ,Davis Jaramillo,Honey Grove,61.33,113.4,,,,Single-ply,SB,M
Boys,67.13,DQ,Johnny Amaro,Wolfe City,62.37,136.08,,,,Single-ply,SB,M
Boys,74.84,1,Greg Morgan,Hughes Springs,70.9,181.44,113.4,165.56,460.4,Single-ply,SBD,M
Boys,74.84,2,Dyllan Retos,Paris Chisum,73.62,158.76,106.59,195.04,460.4,Single-ply,SBD,M
Boys,74.84,3,Carson Craytor,Texarkana Pleasant Grove,72.94,163.29,90.72,183.7,437.72,Single-ply,SBD,M
Boys,74.84,4,Chase Perry,Paris North Lamar,70.81,163.29,99.79,163.29,426.38,Single-ply,SBD,M
Boys,74.84,5,Cody Ball,Queen City,72.57,161.03,90.72,163.29,415.04,Single-ply,SBD,M
Boys,74.84,6,Parker Termin,Paris Chisum,70.76,142.88,95.25,163.29,401.43,Single-ply,SBD,M
Boys,74.84,7,Uriel De La Riva,Mount Pleasant,72.8,167.83,79.38,149.69,396.89,Single-ply,SBD,M
Boys,74.84,8,Brent Taylor,Detroit,74.25,133.81,79.38,165.56,378.75,Single-ply,SBD,M
Boys,74.84,9,Dustin Coleman,Ore City,71.49,140.61,77.11,120.2,337.93,Single-ply,SBD,M
Boys,74.84,10,Dakota Patterson,Maud,74.39,83.91,65.77,124.74,274.42,Single-ply,SBD,M
Boys,82.1,1,Brad Meadows,Texarkana Pleasant Grove,78.29,219.99,136.08,210.92,566.99,Single-ply,SBD,M
Boys,82.1,2,Hunter Hatfield,Texarkana Pleasant Grove,80.6,204.12,108.86,199.58,512.56,Single-ply,SBD,M
Boys,82.1,4,Dakota Moore,Paris North Lamar,78.29,181.44,117.93,195.04,494.42,Single-ply,SBD,M
Boys,82.1,5,Taylor Young #4,Ore City,78.29,195.04,113.4,181.44,489.88,Single-ply,SBD,M
Boys,82.1,6,Joe Winton,Paris Chisum,80.15,170.1,113.4,190.51,474,Single-ply,SBD,M
Boys,82.1,7,Gabriel DuBose,Hughes Springs,75.84,167.83,115.67,158.76,442.25,Single-ply,SBD,M
Boys,82.1,8,Kory Ray,Quinlan Boles,78.83,147.42,86.18,156.49,390.09,Single-ply,SBD,M
Boys,82.1,9,Casey Harper,Paris North Lamar,81.56,147.42,97.52,140.61,385.55,Single-ply,SBD,M
Boys,82.1,10,Trevor McCoin,Detroit,80.56,138.35,77.11,163.29,378.75,Single-ply,SBD,M
Boys,82.1,11,Nicky Goens,Ore City,78.06,129.27,83.91,156.49,369.68,Single-ply,SBD,M
Boys,82.1,12,Dakota Hembree,Paris North Lamar,75.75,136.08,70.31,151.95,358.34,Single-ply,SBD,M
Boys,82.1,13,Hunter McQuatters,Honey Grove,79.29,124.74,52.16,117.93,294.84,Single-ply,SBD,M
Boys,82.1,14,Allen Dudley,Pattonville Prairiland,78.02,,92.99,165.56,258.55,Single-ply,BD,M
Boys,82.1,15,Logan Wright,Ore City,77.29,83.91,61.23,90.72,235.87,Single-ply,SBD,M
Boys,89.81,1,Cody Brantley,Mount Pleasant,87.77,217.72,142.88,192.78,553.38,Single-ply,SBD,M
Boys,89.81,2,Andrew Johnson #6,Paris North Lamar,88.68,190.51,113.4,215.46,519.36,Single-ply,SBD,M
Boys,89.81,4,Jarmaine Finney,Honey Grove,87.23,181.44,124.74,181.44,487.61,Single-ply,SBD,M
Boys,89.81,5,Parker Hailey,Queen City,84.37,158.76,104.33,185.97,449.06,Single-ply,SBD,M
Boys,89.81,7,Easton Droddy,Queen City,84.46,163.29,92.99,156.49,412.77,Single-ply,SBD,M
Boys,89.81,8,Andrew Turner,Mount Pleasant,85.96,142.88,97.52,158.76,399.16,Single-ply,SBD,M
Boys,89.81,9,Chris Davis,Maud,88.9,142.88,83.91,113.4,340.19,Single-ply,SBD,M
Boys,89.81,DQ,Alexander Sumrall,Quinlan Boles,83.91,,,,,Single-ply,SBD,M
Boys,99.79,1,Zack McGuire,Ore City,97.61,199.58,129.27,208.65,537.51,Single-ply,SBD,M
Boys,99.79,2,Seth Lemley,Texarkana Pleasant Grove,94.53,208.65,124.74,192.78,526.17,Single-ply,SBD,M
Boys,99.79,3,Tim Carr,Maud,96.39,204.12,106.59,188.24,498.95,Single-ply,SBD,M
Boys,99.79,4,Parker Hartcraft,Queen City,96.84,215.46,102.06,174.63,492.15,Single-ply,SBD,M
Boys,99.79,5,William Johnson,Ore City,93.49,163.29,108.86,181.44,453.59,Single-ply,SBD,M
Boys,99.79,6,Brandon Erickson #2,Detroit,98.52,170.1,127.01,156.49,453.59,Single-ply,SBD,M
Boys,99.79,7,Cody Berry,Paris North Lamar,97.52,158.76,106.59,176.9,442.25,Single-ply,SBD,M
Boys,99.79,8,Juan Dorantes,Hughes Springs,91.99,172.37,97.52,165.56,435.45,Single-ply,SBD,M
Boys,99.79,9,Brandon Holliday,Paris North Lamar,98.66,154.22,102.06,167.83,424.11,Single-ply,SBD,M
Boys,99.79,11,Erik Sykes,Paris Chisum,91.85,133.81,,170.1,303.91,Single-ply,SD,M
Boys,99.79,12,Doran Hutchison,Paris North Lamar,97.52,124.74,72.57,104.33,301.64,Single-ply,SBD,M
Boys,99.79,13,Ian Throckmorten,Ore City,90.45,127.01,,136.08,263.08,Single-ply,SD,M
Boys,99.79,DQ,Shay Cregg,Paris Chisum,93.44,108.86,65.77,,,Single-ply,SBD,M
Boys,109.77,1,Gary Alexander,Maud,109.68,240.4,115.67,226.8,582.87,Single-ply,SBD,M
Boys,109.77,3,Tyler Carter,Paris North Lamar,107.46,199.58,151.95,201.85,553.38,Single-ply,SBD,M
Boys,109.77,5,Tyler Ballard,Bogata Rivercrest,101.38,158.76,95.25,124.74,378.75,Single-ply,SBD,M
Boys,109.77,6,Ryan Forbes,Texarkana Pleasant Grove,105.51,127.01,81.65,136.08,344.73,Single-ply,SBD,M
Boys,109.77,7,Xza Epps,Honey Grove,105.23,124.74,79.38,117.93,322.05,Single-ply,SBD,M
Boys,109.77,8,Tucker Hardin,Detroit,103.46,108.86,72.57,113.4,294.84,Single-ply,SBD,M
Boys,109.77,DQ,Tyler Collier,Pattonville Prairiland,101.15,,,,,Single-ply,SBD,M
Boys,109.77,DQ,Zach Simons,Wolfe City,103.42,172.37,90.72,158.76,,Single-ply,SBD,M
Boys,124.74,1,Drew Davis,Texarkana Pleasant Grove,122.97,249.48,161.03,226.8,637.3,Single-ply,SBD,M
Boys,124.74,2,Jermaine Emmers,Clarksville,123.83,215.46,136.08,226.8,578.33,Single-ply,SBD,M
Boys,124.74,3,Dalton Benson,Celeste,114.76,204.12,140.61,210.92,555.65,Single-ply,SBD,M
Boys,124.74,4,Noah Palmertree,Hughes Springs,123.06,215.46,122.47,188.24,526.17,Single-ply,SBD,M
Boys,124.74,5,Aaron Burris,Pattonville Prairiland,120.16,208.65,104.33,183.7,496.68,Single-ply,SBD,M
Boys,124.74,6,Stetson Henderson,Paris North Lamar,119.98,163.29,102.06,172.37,437.72,Single-ply,SBD,M
Boys,124.74,7,Trey Potter,Ore City,115.48,158.76,117.93,158.76,435.45,Single-ply,SBD,M
Boys,124.74,8,Colton Tigert,Hughes Springs,114.76,147.42,102.06,142.88,392.36,Single-ply,SBD,M
Boys,124.74,9,Ben Grissom,Mount Pleasant,117.25,129.27,68.04,102.06,299.37,Single-ply,SBD,M
Boys,124.74+,1,Shakeim Woodberry,Clarksville,134.9,272.16,136.08,226.8,635.03,Single-ply,SBD,M
Boys,124.74+,2,Jackie Berry,Paris North Lamar,132,226.8,122.47,240.4,589.67,Single-ply,SBD,M
Boys,124.74+,3,William Wright #2,Mount Pleasant,163.29,231.33,151.95,185.97,569.26,Single-ply,SBD,M
Boys,124.74+,4,Lane Allen,Detroit,139.25,238.14,129.27,197.31,564.72,Single-ply,SBD,M
Boys,124.74+,5,Avelino Garcia,Hughes Springs,138.48,233.6,115.67,188.24,537.51,Single-ply,SBD,M
Boys,124.74+,6,Franciso Morales,Mount Pleasant,130.18,215.46,111.13,204.12,530.7,Single-ply,SBD,M
Boys,124.74+,7,Garrett McClesky,Paris Chisum,133.81,183.7,90.72,192.78,467.2,Single-ply,SBD,M
Boys,124.74+,8,Zach Watson,Ore City,137.89,185.97,92.99,174.63,453.59,Single-ply,SBD,M
Boys,124.74+,9,Jalen Brown #1,Mount Pleasant,136.08,154.22,120.2,176.9,451.32,Single-ply,SBD,M
Boys,124.74+,10,Blake Shaw,Honey Grove,156.49,149.69,113.4,183.7,446.79,Single-ply,SBD,M
Boys,124.74+,11,Jonathan Clark #5,Honey Grove,141.07,195.04,83.91,158.76,437.72,Single-ply,SBD,M
Boys,124.74+,12,Caleb Johnson,Mount Pleasant,127.23,165.56,83.91,142.88,392.36,Single-ply,SBD,M
Boys,124.74+,13,Daniel Smith,Quinlan Boles,132,106.59,65.77,113.4,285.76,Single-ply,SBD,M
