Division,WeightClassKg,Place,Name,Team,BodyweightKg,Best3SquatKg,Best3BenchKg,Best3DeadliftKg,TotalKg,Equipment,Event,Sex,BirthDate
Boys,51.71,1,Jaime Rios #2,Big Lake Reagan County,49.62,140.61,79.38,151.95,371.95,Single-ply,SBD,M,
Boys,51.71,2,Lane Smith,Ozona,51.26,127.01,74.84,127.01,328.85,Single-ply,SBD,M,
Boys,55.79,1,Zaniel Florez,Kermit,54.61,161.03,74.84,161.03,396.89,Single-ply,SBD,M,
Boys,55.79,2,Tommy Purcell,Christoval,53.8,124.74,68.04,156.49,349.27,Single-ply,SBD,M,
Boys,55.79,3,Oliver Cervantez,Crane,52.89,124.74,65.77,124.74,315.25,Single-ply,SBD,M,
Boys,55.79,4,Kaleb Lozano,Odessa,52.62,106.59,52.16,131.54,290.3,Single-ply,SBD,M,
Boys,55.79,5,Pablo Giovani,San Angelo Lake View,55.7,99.79,58.97,111.13,269.89,Single-ply,SBD,M,
Boys,55.79,6,Xaden Badillo,Ozona,52.8,97.52,47.63,102.06,247.21,Single-ply,SBD,M,
Boys,59.87,1,Tony Ortiz,Big Lake Reagan County,59.33,151.95,102.06,165.56,419.57,Single-ply,SBD,M,
Boys,59.87,2,Ethan Rodriguez,Midland Lee,58.51,142.88,113.4,161.03,417.3,Single-ply,SBD,M,
Boys,59.87,3,Brian Lopez,Big Lake Reagan County,59.69,163.29,95.25,151.95,410.5,Single-ply,SBD,M,
Boys,59.87,4,Sergio Gonzalez,Big Lake Reagan County,59.69,147.42,90.72,165.56,403.7,Single-ply,SBD,M,
Boys,59.87,5,Pablo Ramirez,Midland Lee,59.42,142.88,88.45,154.22,385.55,Single-ply,SBD,M,
Boys,59.87,6,Aidan Villanueva #1,Sonora,58.33,117.93,79.38,127.01,324.32,Single-ply,SBD,M,
Boys,59.87,7,Denys Stokes,Midland,59.6,108.86,74.84,124.74,308.44,Single-ply,SBD,M,
Boys,59.87,8,Julian Dominguez,Ozona,59.87,106.59,61.23,136.08,303.91,Single-ply,SBD,M,
Boys,59.87,9,Ariel Salazar,Sonora,59.06,111.13,52.16,127.01,290.3,Single-ply,SBD,M,
Boys,59.87,10,Aaron Gamboa,Odessa,57.42,95.25,70.31,111.13,276.69,Single-ply,SBD,M,
Boys,59.87,11,Ethan Gomez,Kermit,56.52,95.25,52.16,106.59,254.01,Single-ply,SBD,M,
Boys,67.13,1,Devin Mora,Andrews,67.13,199.58,117.93,195.04,512.56,Single-ply,SBD,M,
Boys,67.13,2,Isaac Estrada,Odessa,63.96,188.24,117.93,179.17,485.34,Single-ply,SBD,M,
Boys,67.13,3,Junie Gonzales,Midland Greenwood,62.6,170.1,90.72,170.1,430.91,Single-ply,SBD,M,
Boys,67.13,4,Dravon Valenzuela,Big Lake Reagan County,66.95,165.56,81.65,163.29,410.5,Single-ply,SBD,M,
Boys,67.13,5,Slade Edwards,Seminole,65.23,161.03,92.99,154.22,408.23,Single-ply,SBD,M,
Boys,67.13,6,Josiah Valdez,Crane,65.86,147.42,70.31,183.7,401.43,Single-ply,SBD,M,
Boys,67.13,7,Isaias Sanchez,Crane,66.5,140.61,74.84,156.49,371.95,Single-ply,SBD,M,
Boys,67.13,8,Juan Ruiz,Sonora,60.42,142.88,77.11,149.69,369.68,Single-ply,SBD,M,
Boys,67.13,9,Duarte Vasquez,Sonora,62.69,145.15,74.84,149.69,369.68,Single-ply,SBD,M,
Boys,67.13,10,Eduardo Gutierrez,Crane,61.78,136.08,74.84,133.81,344.73,Single-ply,SBD,M,
Boys,67.13,11,Roman Rivero,Big Lake Reagan County,66.63,138.35,65.77,136.08,340.19,Single-ply,SBD,M,
Boys,67.13,12,Teagan Marlowe,Midland,62.14,131.54,65.77,138.35,335.66,Single-ply,SBD,M,
Boys,67.13,13,Tanner Jones,Monahans,67.04,117.93,68.04,133.81,319.78,Single-ply,SBD,M,
Boys,67.13,14,Aragorn Guerrero,Andrews,64,106.59,52.16,136.08,294.84,Single-ply,SBD,M,
Boys,67.13,15,Rene Orona,Monahans,64.77,95.25,70.31,129.27,294.84,Single-ply,SBD,M,
Boys,67.13,DQ,Jordan Purcell,Monahans,60.78,92.99,,,,Single-ply,SBD,M,
Boys,67.13,DQ,Alex Aguilar #2,Big Lake Reagan County,60.78,149.69,81.65,,,Single-ply,SBD,M,
Boys,74.84,1,Raymond Flores,Andrews,72.39,213.19,129.27,213.19,555.65,Single-ply,SBD,M,
Boys,74.84,2,David Guerrero,Big Lake Reagan County,69.49,226.8,129.27,179.17,535.24,Single-ply,SBD,M,
Boys,74.84,3,Eric Cuellar,Andrews,73.03,192.78,88.45,224.53,505.76,Single-ply,SBD,M,
Boys,74.84,4,Devin Doerksen,Seminole,74.03,199.58,106.59,199.58,505.76,Single-ply,SBD,M,
Boys,74.84,5,Aaron Salazar,Seminole,73.57,176.9,108.86,167.83,453.59,Single-ply,SBD,M,
Boys,74.84,6,Gabriel Zubiate,Seminole,71.94,183.7,90.72,170.1,444.52,Single-ply,SBD,M,
Boys,74.84,7,Jimmy Vasquez,Midland Greenwood,72.21,185.97,83.91,163.29,433.18,Single-ply,SBD,M,
Boys,74.84,8,Arnold Vallez,Crane,72.39,174.63,61.23,190.51,426.38,Single-ply,SBD,M,
Boys,74.84,9,Isaiah Perez,Big Lake Reagan County,74.75,149.69,81.65,188.24,419.57,Single-ply,SBD,M,
Boys,74.84,10,Jeren McDonald,Crane,69.76,170.1,88.45,158.76,417.3,Single-ply,SBD,M,
Boys,74.84,11,Alejandro Diaz,Odessa,73.48,154.22,92.99,167.83,415.04,Single-ply,SBD,M,
Boys,74.84,12,Bradley Peralta,Kermit,71.12,156.49,99.79,154.22,410.5,Single-ply,SBD,M,
Boys,74.84,13,Joel Garcia,Kermit,72.76,161.03,92.99,151.95,405.97,Single-ply,SBD,M,
Boys,74.84,14,Ezekeil Davila,San Angelo Lake View,71.21,151.95,77.11,167.83,396.89,Single-ply,SBD,M,
Boys,74.84,15,Ramiro Lopez,Andrews,72.57,158.76,99.79,138.35,396.89,Single-ply,SBD,M,
Boys,74.84,16,Adam Sanchez,Sonora,69.67,136.08,88.45,138.35,362.87,Single-ply,SBD,M,
Boys,74.84,17,Jack Oliveira,Mertzon Irion County,74.66,136.08,86.18,140.61,362.87,Single-ply,SBD,M,
Boys,74.84,18,Aaron Noriega,Sonora,73.03,136.08,74.84,142.88,353.8,Single-ply,SBD,M,
Boys,74.84,19,Nick Wright #3,Iraan,74.84,92.99,70.31,142.88,306.17,Single-ply,SBD,M,
Boys,74.84,20,Anthony McDowell,Kermit,71.21,88.45,79.38,136.08,303.91,Single-ply,SBD,M,
Boys,74.84,21,Jacob Guy,Andrews,73.48,115.67,63.5,120.2,299.37,Single-ply,SBD,M,
Boys,74.84,22,Gage Piwetz,Mertzon Irion County,74.84,106.59,61.23,120.2,288.03,Single-ply,SBD,M,
Boys,74.84,23,Oscar Ariza,Seminole,69.49,90.72,92.99,83.91,267.62,Single-ply,SBD,M,
Boys,74.84,24,Alexander Miranda,Monahans,71.03,88.45,54.43,124.74,267.62,Single-ply,SBD,M,
Boys,74.84,25,Mike Martinez,Ozona,74.39,61.23,47.63,70.31,179.17,Single-ply,SBD,M,
Boys,82.1,1,Christian DeLuna,Big Lake Reagan County,80.83,235.87,122.47,183.7,542.04,Single-ply,SBD,M,
Boys,82.1,2,Tim Avila,Odessa,78.11,201.85,127.01,190.51,519.36,Single-ply,SBD,M,
Boys,82.1,3,Carter Christensen,San Angelo Lake View,81.92,174.63,138.35,195.04,508.02,Single-ply,SBD,M,
Boys,82.1,4,Zion Ward,Midland,81.37,204.12,86.18,185.97,476.27,Single-ply,SBD,M,
Boys,82.1,5,Peyton Polk,Christoval,76.29,170.1,115.67,181.44,467.2,Single-ply,SBD,M,
Boys,82.1,6,Laramie Vires,Odessa,76.38,165.56,115.67,170.1,451.32,Single-ply,SBD,M,
Boys,82.1,7,Hunter Manning,Andrews,80.01,170.1,83.91,179.17,433.18,Single-ply,SBD,M,
Boys,82.1,8,Zach Kidd,Midland Greenwood,76.66,149.69,97.52,170.1,417.3,Single-ply,SBD,M,
Boys,82.1,9,Jackson Talley,Midland,80.74,170.1,72.57,161.03,403.7,Single-ply,SBD,M,
Boys,82.1,10,Jaden Rodriguez,Midland Lee,78.02,142.88,99.79,158.76,401.43,Single-ply,SBD,M,
Boys,82.1,11,Enrique Calzada,Mertzon Irion County,80.38,142.88,79.38,147.42,369.68,Single-ply,SBD,M,
Boys,82.1,12,Anthony Ramirez,San Angelo Lake View,79.38,131.54,63.5,149.69,344.73,Single-ply,SBD,M,
Boys,82.1,DQ,Juan Saucedo,Big Lake Reagan County,80.56,204.12,142.88,,,Single-ply,SBD,M,
Boys,82.1,DQ,Blake Aparicio,Midland,75.48,156.49,86.18,,,Single-ply,SBD,M,
Boys,82.1,DQ,Jezreel Sanchez-Juarez,Odessa,82.1,229.06,,,,Single-ply,SBD,M,
Boys,82.1,DQ,Aiden Fuentes,Ozona,82.1,226.8,102.06,,,Single-ply,SBD,M,
Boys,89.81,1,Esau Flores,Andrews,88.27,235.87,145.15,242.67,623.69,Single-ply,SBD,M,
Boys,89.81,2,Justin Gonzales,Andrews,89.09,226.8,145.15,208.65,580.6,Single-ply,SBD,M,
Boys,89.81,3,Kevin Zepeda-Giron,Odessa,84.19,201.85,145.15,183.7,530.7,Single-ply,SBD,M,
Boys,89.81,4,Damon Casarez,Seminole,87.45,215.46,108.86,201.85,526.17,Single-ply,SBD,M,
Boys,89.81,5,Fernando Zapata,Midland Greenwood,85.37,208.65,129.27,185.97,523.9,Single-ply,SBD,M,
Boys,89.81,6,Issahia Valenzuela,Big Lake Reagan County,86.41,208.65,104.33,210.92,523.9,Single-ply,SBD,M,
Boys,89.81,7,Austin Damian,Ozona,87.63,197.31,117.93,188.24,503.49,Single-ply,SBD,M,
Boys,89.81,8,Kyelar Connally,Midland Lee,88.81,174.63,113.4,210.92,498.95,Single-ply,SBD,M,
Boys,89.81,9,Alex Wooten,Seminole,86.27,170.1,102.06,167.83,439.98,Single-ply,SBD,M,
Boys,89.81,10,Eli Herandez,Big Lake Reagan County,89.54,161.03,99.79,154.22,415.04,Single-ply,SBD,M,
Boys,89.81,11,Eli Velarde,Crane,89.81,165.56,102.06,142.88,410.5,Single-ply,SBD,M,
Boys,89.81,12,Jett Glass,Midland,82.64,151.95,61.23,181.44,394.63,Single-ply,SBD,M,
Boys,89.81,13,Brock Aparicio,Midland,82.83,142.88,83.91,149.69,376.48,Single-ply,SBD,M,
Boys,89.81,DQ,Caleb Dye,Christoval,89.36,156.49,,,,Single-ply,SBD,M,
Boys,89.81,DQ,Ethen Moore,Crane,84.01,,,,,Single-ply,SBD,M,
Boys,99.79,1,Paul Walker #2,Crane,98.25,251.74,124.74,217.72,594.21,Single-ply,SBD,M,
Boys,99.79,2,Aaron Olivas,Andrews,92.9,244.94,124.74,206.38,576.06,Single-ply,SBD,M,
Boys,99.79,3,Mikial Burrola,Kermit,93.71,210.92,133.81,204.12,548.85,Single-ply,SBD,M,
Boys,99.79,4,Irvin Delgado,Seminole,97.34,199.58,111.13,195.04,505.76,Single-ply,SBD,M,
Boys,99.79,5,Noel Perez,Big Lake Reagan County,91.72,197.31,111.13,174.63,483.08,Single-ply,SBD,M,
Boys,99.79,6,Mikel Delgado,Midland,97.07,170.1,111.13,174.63,455.86,Single-ply,SBD,M,
Boys,99.79,7,Jaxon Washington,Seminole,93.8,156.49,102.06,167.83,426.38,Single-ply,SBD,M,
Boys,99.79,8,Isaias Ramirez,Midland Lee,93.35,154.22,83.91,183.7,421.84,Single-ply,SBD,M,
Boys,99.79,9,Javier Hernandez,Iraan,99.79,170.1,77.11,170.1,417.3,Single-ply,SBD,M,
Boys,99.79,10,Damien Herrera,Monahans,98.43,129.27,92.99,185.97,408.23,Single-ply,SBD,M,
Boys,99.79,11,Jeremiah Talamantes,Seminole,94.53,181.44,79.38,138.35,399.16,Single-ply,SBD,M,
Boys,99.79,12,Alex Alcantar,San Angelo Lake View,94.44,127.01,124.74,140.61,392.36,Single-ply,SBD,M,
Boys,99.79,13,Manuel Davila,Big Lake Reagan County,94.17,140.61,86.18,145.15,371.95,Single-ply,SBD,M,
Boys,99.79,14,Robert Burrow,Monahans,93.26,122.47,72.57,124.74,319.78,Single-ply,SBD,M,
Boys,99.79,DQ,Josh Lackey,Monahans,90.54,,,,,Single-ply,SBD,M,
Boys,99.79,DQ,Jon Parks,Mertzon Irion County,92.71,,,,,Single-ply,SBD,M,
Boys,109.77,1,Christian Bell,Midland Greenwood,105.78,256.28,165.56,244.94,666.78,Single-ply,SBD,M,
Boys,109.77,2,Connor McDonald,Midland Greenwood,104.14,272.16,161.03,190.51,623.69,Single-ply,SBD,M,
Boys,109.77,3,Logan Sanders,San Angelo Lake View,101.79,204.12,129.27,235.87,569.26,Single-ply,SBD,M,
Boys,109.77,4,Jadyn Lehde,Crane,108.95,247.21,133.81,188.24,569.26,Single-ply,SBD,M,
Boys,109.77,5,Deven Butler,Crane,109.13,226.8,136.08,165.56,528.44,Single-ply,SBD,M,
Boys,109.77,6,Ryan Blain,Midland Lee,105.87,181.44,131.54,183.7,496.68,Single-ply,SBD,M,
Boys,109.77,7,Rikter Connally,Seminole,,151.95,97.52,156.49,405.97,Single-ply,SBD,M,
Boys,109.77,8,Eliseo Bonilla,Kermit,104.33,156.49,92.99,151.95,401.43,Single-ply,SBD,M,
Boys,109.77,9,John Cepeda,San Angelo Lake View,106.68,111.13,72.57,117.93,301.64,Single-ply,SBD,M,
Boys,109.77,DQ,John De Hoyos,Midland Lee,104.51,,,,,Single-ply,SBD,M,
Boys,109.77,DQ,Xavier Salinas,Midland Lee,102.33,222.26,,,,Single-ply,SBD,M,
Boys,109.77,DQ,Kenneth Ramsey,Monahans,101.15,,,,,Single-ply,SBD,M,
Boys,109.77,DQ,Anngel Rodriguez,Odessa,106.59,224.53,151.95,,,Single-ply,SBD,M,
Boys,124.74,1,Darius Pando,Kermit,115.48,251.74,145.15,226.8,623.69,Single-ply,SBD,M,
Boys,124.74,2,Caleb Alexander,Seminole,114.58,219.99,111.13,199.58,530.7,Single-ply,SBD,M,
Boys,124.74,3,Cody High,San Angelo Lake View,124.01,197.31,106.59,208.65,512.56,Single-ply,SBD,M,
Boys,124.74,4,Juan Ortiz,San Angelo Lake View,121.38,172.37,117.93,197.31,487.61,Single-ply,SBD,M,
Boys,124.74,DQ,Octavio Caballero,Andrews,110.36,163.29,86.18,,,Single-ply,SBD,M,
Boys,124.74,DQ,Josiah Flores,Andrews,121.56,,,,,Single-ply,SBD,M,
Boys,124.74+,1,Kwinton Jennings,Seminole,136.35,267.62,136.08,222.26,625.96,Single-ply,SBD,M,
Boys,124.74+,2,Emilio Dominguez,Odessa,136.44,254.01,167.83,204.12,625.96,Single-ply,SBD,M,
Boys,124.74+,3,Keano Perez,Ozona,134.08,240.4,129.27,208.65,578.33,Single-ply,SBD,M,
Boys,124.74+,4,Ethan Sanchez,San Angelo Lake View,141.79,204.12,158.76,197.31,560.19,Single-ply,SBD,M,
Boys,124.74+,5,John Martinez-Guedry,Midland,152.86,201.85,108.86,170.1,480.81,Single-ply,SBD,M,
Boys,124.74+,6,Antonio Ronquillo,San Angelo Lake View,147.05,176.9,129.27,147.42,453.59,Single-ply,SBD,M,
Boys,124.74+,7,Carlo Garcia,Midland Lee,151.95,192.78,115.67,136.08,444.52,Single-ply,SBD,M,
Boys,124.74+,DQ,Jacob Payne,Monahans,131.45,,,,,Single-ply,SBD,M,
Boys,124.74+,DQ,Miguel Jauregui,Monahans,182.8,136.08,81.65,,,Single-ply,SBD,M,
Boys,,NS,Juan Carreon,Odessa,,,,,,Single-ply,SBD,M,
Boys,,NS,Eric Cisneros,Midland Lee,,,,,,Single-ply,SBD,M,
Boys,,NS,Elyin Lopez,Midland,,,,,,Single-ply,SBD,M,
Boys,,NS,Tate Craig,Midland,,,,,,Single-ply,SBD,M,
Boys,,NS,Charlie Galliton,Sonora,,,,,,Single-ply,SBD,M,
Boys,,NS,Marcos Villalobos,Sonora,,,,,,Single-ply,SBD,M,
Boys,,NS,Albert Garcia,Midland Lee,,,,,,Single-ply,SBD,M,
Boys,,NS,Jalen Smith,Monahans,,,,,,Single-ply,SBD,M,
Boys,,NS,Jerry Perez,Kermit,,,,,,Single-ply,SBD,M,
Boys,,NS,Edrick Armaendariz,Kermit,,,,,,Single-ply,SBD,M,
Boys,,NS,Alejandro Leyva,Kermit,,,,,,Single-ply,SBD,M,
Boys,,NS,Payton Langhor,Iraan,,,,,,Single-ply,SBD,M,
