Place,Name,CyrillicName,Sex,BodyweightKg,Squat1Kg,Squat2Kg,Squat3Kg,Best3SquatKg,Squat4Kg,Bench1Kg,Bench2Kg,Bench3Kg,Best3BenchKg,Bench4Kg,Deadlift1Kg,Deadlift2Kg,Deadlift3Kg,Best3DeadliftKg,Deadlift4Kg,TotalKg,WeightClassKg,Event,Equipment,Tested,Division,Age,BirthDate
1,Anastasiya Oreshkina,Анастасия Орешкина,F,48,62.5,70,77.5,77.5,,37.5,42.5,45,45,,110,117.5,125,125,,247.5,48,SBD,Raw,Yes,Open,33,1983-09-08
2,Elena Zemerova,Елена Земерова,F,47.3,80,-85,-87.5,80,,40,-42.5,-42.5,40,,110,120,125,125,,245,48,SBD,Raw,Yes,Open,37,1980-01-01
1,Natalya Konchakova,Наталья Кончакова,F,51.7,105,112.5,-117.5,112.5,,57.5,-62.5,62.5,62.5,,130,140,-150,140,,315,52,SBD,Raw,Yes,Open,39,1977-08-14
2,Irina Chizhova,Ирина Чижова,F,52,-115,115,-120,115,,57.5,60,-62.5,60,,115,122.5,127.5,127.5,,302.5,52,SBD,Raw,Yes,Open,24,1993-03-14
3,Veronika Tyuleneva,Вероника Тюленева,F,51.2,82.5,87.5,90,90,,55,57.5,60,60,,105,107.5,110,110,,260,52,SBD,Raw,Yes,Open,24,1992-11-25
4,Yuliya Anisimova,Юлия Анисимова,F,51.5,90,-95,95,95,,40,45,-50,45,,100,110,-120,110,,250,52,SBD,Raw,Yes,Open,25,1991-09-20
5,Darya Bryantseva,Дарья Брянцева,F,50,87.5,90,-92.5,90,,52.5,-55,-55,52.5,,97.5,102.5,-107.5,102.5,,245,52,SBD,Raw,Yes,Open,27,1990-03-06
6,Tatyana Budkina,Татьяна Будкина,F,51.2,-70,75,80,80,,47.5,-52.5,-52.5,47.5,,95,102.5,112.5,112.5,,240,52,SBD,Raw,Yes,Open,38,1979-04-02
1,Aleksandra Vedeneeva,Александра Веденеева,F,54.6,85,-90,90,90,,62.5,67.5,-72.5,67.5,,100,110,120,120,,277.5,56,SBD,Raw,Yes,Open,32,1985-02-25
2,Anastasiya Strashnova,Анастасия Страшнова,F,55.3,80,85,-90,85,,55,-57.5,-57.5,55,,105,110,,110,,250,56,SBD,Raw,Yes,Open,26,1990-12-13
3,Olga Streltsova,Ольга Стрельцова,F,55.4,82.5,90,95,95,,45,-50,-50,45,,90,-97.5,97.5,97.5,,237.5,56,SBD,Raw,Yes,Open,30,1986-07-20
4,Elena Yudina,Елена Юдина,F,53.3,70,-75,-75,70,,40,45,-47.5,45,,72.5,77.5,80,80,,195,56,SBD,Raw,Yes,Open,31,1985-05-03
1,Anastasiya Pozhogina,Анастасия Пожогина,F,59.9,100,107.5,-110,107.5,,-67.5,67.5,-70,67.5,,120,130,140,140,,315,60,SBD,Raw,Yes,Juniors 20-23,23,1994-04-01
1,Elena Suzdaltseva,Елена Суздальцева,F,59.9,120,-122.5,-122.5,120,,-55,-55,55,55,,110,-122.5,-122.5,110,,285,60,SBD,Raw,Yes,Open,28,1988-11-13
1,Anna Khozhaynova,Анна Хожайнова,F,65.8,70,75,-77.5,75,,37.5,-40,40,40,,80,87.5,92.5,92.5,97.5,207.5,67.5,SBD,Raw,Yes,Teen 18-19,18,1999-04-01
1,Viktiriya Epikhina,Виктирия Епихина,F,62,-110,115,-120,115,,70,-75,77.5,77.5,,135,145,152.5,152.5,,345,67.5,SBD,Raw,Yes,Open,26,1991-04-18
2,Yuliya Nefedova,Юлия Нефедова,F,65.8,90,95,100,100,,65,67.5,70,70,,-145,145,-150,145,,315,67.5,SBD,Raw,Yes,Open,31,1985-10-21
3,Ekaterina Amirova,Екатерина Амирова,F,65.6,75,82.5,90,90,,-55,57.5,62.5,62.5,,80,-87.5,-87.5,80,,232.5,67.5,SBD,Raw,Yes,Open,25,1991-08-15
1,Natalya Cherkasova,Наталья Черкасова,F,65.9,-112.5,112.5,117.5,117.5,,-60,60,-65,60,,130,137.5,-140,137.5,,315,67.5,SBD,Raw,Yes,Masters 40-44,40,1976-05-30
1,Svetlana Buryan,Светлана Бурьян,F,81.5,100,-110,-110,100,,47.5,-52.5,-52.5,47.5,,130,140,145,145,,292.5,82.5,SBD,Raw,Yes,Masters 45-49,46,1970-12-21
1,Aleksey Korostelyov,Алексей Коростелёв,M,63,90,100,105,105,,75,-85,-85,75,,110,120,130,130,,310,67.5,SBD,Raw,Yes,Teen 18-19,18,1999-02-22
2,Ilya Leonov,Илья Леонов,M,60.4,60,67.5,72.5,72.5,,-55,57.5,-62.5,57.5,,85,95,102.5,102.5,,232.5,67.5,SBD,Raw,Yes,Teen 13-15,15,2001-07-13
1,Dmitriy Sidorkin,Дмитрий Сидоркин,M,66.9,155,-165,165,165,,125,130,135,135,,180,190,-195,190,,490,67.5,SBD,Raw,Yes,Open,24,1993-02-04
DQ,Anton Grafov,Антон Графов,M,67.3,200,-210,-215,200,,160,165,170,170,,-250,-250,-250,,,,67.5,SBD,Raw,Yes,Open,20,1997-03-13
1,Nikita Mizonov,Никита Мизонов,M,73.8,145,155,-160,155,,90,-95,97.5,97.5,,150,162.5,170,170,,422.5,75,SBD,Raw,Yes,Teen 16-17,17,1999-05-22
1,Mikhail Kafash,Михаил Кафаш,M,73.6,-155,155,165,165,,115,-120,120,120,,180,-195,-195,180,,465,75,SBD,Raw,Yes,Juniors 20-23,21,1996-02-25
1,Aleksey German,Алексей Герман,M,73.3,-185,190,-202.5,190,,110,120,-122.5,120,,190,200,207.5,207.5,,517.5,75,SBD,Raw,Yes,Open,27,1989-10-12
2,Evgeniy Karpov,Евгений Карпов,M,71,170,180,185,185,,132.5,137.5,-140,137.5,,180,187.5,-195,187.5,,510,75,SBD,Raw,Yes,Open,37,1979-10-26
3,Evgeniy Tikhonov,Евгений Тихонов,M,74.5,142.5,-150,-155,142.5,,115,117.5,120,120,,185,190,200,200,,462.5,75,SBD,Raw,Yes,Open,27,1990-01-17
4,Ivan Yarilin,Иван Ярилин,M,72.9,135,145,155,155,,-120,120,-125,120,,170,-175,-175,170,,445,75,SBD,Raw,Yes,Open,23,1993-12-07
5,Evgeniy Shirokov,Евгений Широков,M,74.6,150,160,165,165,,85,95,100,100,,160,170,175,175,,440,75,SBD,Raw,Yes,Open,28,1988-12-03
1,Pavel Patykin,Павел Патыкин,M,76.6,135,145,-160,145,,100,102.5,-105,102.5,,160,175,185,185,,432.5,82.5,SBD,Raw,Yes,Teen 16-17,17,1999-10-26
2,Stepan Manukhov,Степан Манухов,M,79,-120,-125,125,125,,70,-75,-80,70,,-120,125,132.5,132.5,,327.5,82.5,SBD,Raw,Yes,Teen 16-17,16,2000-09-21
1,Vadim Loyko,Вадим Лойко,M,82,-200,200,220,220,,140,150,-155,150,,265,-280,-285,265,,635,82.5,SBD,Raw,Yes,Juniors 20-23,23,1994-04-16
1,Vadim Loyko,Вадим Лойко,M,82,-200,200,220,220,,140,150,-155,150,,265,-280,-285,265,,635,82.5,SBD,Raw,Yes,Open,23,1994-04-16
2,Denis Saenko,Денис Саенко,M,80.4,-170,-170,180,180,,130,-135,,130,,-200,200,220,220,,530,82.5,SBD,Raw,Yes,Open,36,1980-09-04
3,Ilya Rogachev,Илья Рогачев,M,80.4,145,152.5,-157.5,152.5,,117.5,-122.5,-122.5,117.5,,-160,160,-170,160,,430,82.5,SBD,Raw,Yes,Open,34,1983-02-25
1,German Barabanov,Герман Барабанов,M,82,-130,130,-140,130,,115,125,-127.5,125,,160,170,175,175,180,430,82.5,SBD,Raw,Yes,Masters 75-79,77,1940-01-28
1,Bogdan Zukhayriev,Богдан Зухайриев,M,88.7,160,180,-200,180,,145,155,160,160,,160,190,205,205,,545,90,SBD,Raw,Yes,Teen 18-19,19,1998-03-16
1,Aleksandr Churzin,Александр Чурзин,M,88.5,140,145,150,150,,-120,120,-125,120,,190,200,212.5,212.5,,482.5,90,SBD,Raw,Yes,Juniors 20-23,21,1995-08-22
2,Sergey Krasheninnikov,Сергей Крашенинников,M,89.1,150,-160,165,165,,137.5,142.5,-145,142.5,,175,,,175,,482.5,90,SBD,Raw,Yes,Juniors 20-23,22,1994-05-20
3,Egor Dudin,Егор Дудин,M,85.7,130,140,150,150,,115,122.5,-130,122.5,,185,195,207.5,207.5,,480,90,SBD,Raw,Yes,Juniors 20-23,21,1995-07-27
4,Vitaliy Aborkin,Виталий Аборкин,M,85.4,135,145,-150,145,,-92.5,100,-105,100,,165,175,185,185,,430,90,SBD,Raw,Yes,Juniors 20-23,21,1995-09-25
1,Aleksey Sheykin,Алексей Шейкин,M,89.3,220,230,240,240,,160,-170,170,170,-175,270,280,282.5,282.5,,692.5,90,SBD,Raw,Yes,Open,29,1988-03-24
2,Evgeniy Simon,Евгений Симон,M,88.3,222.5,232.5,242.5,242.5,,155,160,165,165,,262.5,270,282.5,282.5,,690,90,SBD,Raw,Yes,Open,34,1983-03-24
3,Egor Opichenok,Егор Опиченок,M,87.9,200,207.5,,207.5,,155,165,-170,165,,255,-265,-265,255,,627.5,90,SBD,Raw,Yes,Open,35,1981-09-25
4,Nikolay Zabelin,Николай Забелин,M,88.9,190,200,-205,200,,150,-155,155,155,,250,-260,-260,250,,605,90,SBD,Raw,Yes,Open,31,1985-05-23
5,Evgeniy Vladimirov,Евгений Владимиров,M,87.8,215,225,230,230,,-130,130,-135,130,,225,-230,-230,225,,585,90,SBD,Raw,Yes,Open,52,1964-08-22
6,Yuriy Bubentsov,Юрий Бубенцов,M,88,165,175,182.5,182.5,,120,130,-137.5,130,,-215,230,-235,230,,542.5,90,SBD,Raw,Yes,Open,28,1988-07-28
7,Dmitriy Suprunov,Дмитрий Супрунов,M,88,150,162.5,175,175,,125,130,-135,130,,170,180,190,190,,495,90,SBD,Raw,Yes,Open,27,1989-06-08
8,Nikolay Kozin,Николай Козин,M,86.8,-140,-140,140,140,,120,-130,-130,120,,-170,180,190,190,,450,90,SBD,Raw,Yes,Open,26,1990-05-20
9,Ildar Khafizov,Ильдар Хафизов,M,83.6,130,140,150,150,,85,90,95,95,,170,175,180,180,,425,90,SBD,Raw,Yes,Open,25,1991-12-23
DQ,Ivan Bekhtold,Иван Бехтольд,M,86.2,-170,-170,-170,,,132.5,137.5,-142.5,137.5,,190,207.5,-212.5,207.5,,,90,SBD,Raw,Yes,Open,28,1988-08-12
1,Arsen Akopyan,Арсен Акопян,M,89.1,160,-170,175,175,,125,-130,-130,125,,200,210,-212.5,210,,510,90,SBD,Raw,Yes,Masters 45-49,46,1970-06-23
1,Evgeniy Vladimirov,Евгений Владимиров,M,87.8,215,225,230,230,,-130,130,-135,130,,225,-230,-230,225,,585,90,SBD,Raw,Yes,Masters 50-54,52,1964-08-22
1,Pavel Koltsov,Павел Кольцов,M,99.6,190,200,-210,200,,140,150,155,155,,240,250,255,255,,610,100,SBD,Raw,Yes,Juniors 20-23,23,1993-08-11
2,Boris Ilin,Борис Ильин,M,95.7,-165,175,-190,175,,155,162.5,170,170,,200,220,240,240,,585,100,SBD,Raw,Yes,Juniors 20-23,22,1994-09-15
1,Yuriy Gubanov,Юрий Губанов,M,94.8,215,230,240,240,,152.5,162.5,167.5,167.5,,240,255,270,270,,677.5,100,SBD,Raw,Yes,Open,30,1987-03-06
2,Andrey Andreev,Андрей Андреев,M,97,190,200,210,210,,170,-180,180,180,,220,235,-245,235,,625,100,SBD,Raw,Yes,Open,38,1979-03-08
3,Sergey Durandin,Сергей Дурандин,M,98.2,200,210,215,215,,150,155,-160,155,,230,240,-245,240,,610,100,SBD,Raw,Yes,Open,42,1974-05-04
4,Sergey Viktorov,Сергей Викторов,M,98.3,185,195,-205,195,,135,-142.5,-145,135,,-190,200,210,210,220,540,100,SBD,Raw,Yes,Open,27,1989-12-31
1,Ilya Nefedov,Илья Нефедов,M,99.3,220,225,230,230,,140,150,-152.5,150,,240,250,255,255,,635,100,SBD,Raw,Yes,Masters 40-44,44,1972-05-25
2,Sergey Durandin,Сергей Дурандин,M,98.2,200,210,215,215,,150,155,-160,155,,230,240,-245,240,,610,100,SBD,Raw,Yes,Masters 40-44,42,1974-05-04
3,Ivan Rak,Иван Рак,M,99.4,190,200,210,210,,135,142.5,150,150,,225,235,-245,235,,595,100,SBD,Raw,Yes,Masters 40-44,42,1974-08-27
1,Boris Kozhin,Борис Кожин,M,96.7,135,145,-162.5,145,,120,125,132.5,132.5,,-150,150,172.5,172.5,,450,100,SBD,Raw,Yes,Masters 55-59,56,1960-05-03
1,Anton Bukhman,Антон Бухман,M,109.8,250,270,-280,270,,175,185,195,195,,260,280,287.5,287.5,,752.5,110,SBD,Raw,Yes,Open,28,1988-08-22
2,Artem Bezpalenko,Артем Безпаленко,M,105,170,185,200,200,,170,-180,180,180,,240,260,-270,260,,640,110,SBD,Raw,Yes,Open,27,1990-03-21
1,Mikhail Lyubarskiy,Михаил Любарский,M,118.1,150,160,170,170,,125,130,132.5,132.5,,180,-200,200,200,,502.5,125,SBD,Raw,Yes,Teen 13-15,14,2002-11-03
1,Artashes Sudzhyan,Арташес Суджян,M,124.8,260,270,280,280,,190,197.5,205,205,,280,-290,290,290,,775,125,SBD,Raw,Yes,Open,29,1987-11-04
2,Aleksey Lebed,Алексей Лебедь,M,115,210,225,-235,225,,195,,,195,,-210,220,230,230,,650,125,SBD,Raw,Yes,Open,27,1989-07-28
3,Dmitriy Efimenko,Дмитрий Ефименко,M,122,200,210,220,220,,145,160,-165,160,,230,250,260,260,,640,125,SBD,Raw,Yes,Open,26,1990-12-11
1,Vladimir Chernyshov,Владимир Чернышов,M,123,242.5,250,,250,,-145,145,152.5,152.5,,245,252.5,255,255,,657.5,125,SBD,Raw,Yes,Masters 65-69,68,1948-09-06
1,Oleg Demchenko,Олег Демченко,M,130.4,250,260,265,265,,170,175,180,180,,310,330,345,345,,790,140,SBD,Raw,Yes,Open,39,1977-08-11
1,Mariya Zakrevskaya,Мария Закревская,F,52.3,50,60,-65,60,,-30,-30,30,30,,,65,70,70,,160,56,SBD,Wraps,Yes,Teen 13-15,13,2003-09-28
1,Polina Marinova,Полина Маринова,F,55.8,80,82.5,85,85,,50,52.5,55,55,,-110,110,115,115,,255,56,SBD,Wraps,Yes,Juniors 20-23,20,1996-10-31
1,Anna Vishnyak,Анна Вишняк,F,55,-122.5,122.5,-135,122.5,,77.5,82.5,-85,82.5,,147.5,-157.5,157.5,157.5,,362.5,56,SBD,Wraps,Yes,Open,32,1984-12-12
1,Yana Petelova,Яна Петелова,F,56.3,130,-137.5,137.5,137.5,,57.5,60,62.5,62.5,,110,117.5,123,123,,323,60,SBD,Wraps,Yes,Open,27,1990-04-12
2,Kristina Dobrya,Кристина Добря,F,56.2,107.5,115,117.5,117.5,,60,-65,-65,60,,-142.5,145,-150,145,,322.5,60,SBD,Wraps,Yes,Open,28,1989-04-20
1,Anastasiya Shiryaeva,Анастасия Ширяева,F,67.5,-110,110,-120,110,,40,-45,-47.5,40,,110,-120,-120,110,,260,67.5,SBD,Wraps,Yes,Teen 18-19,18,1998-08-30
DQ,Oksana Veredina,Оксана Вередина,F,66.4,-120,-120,-120,,,,,,,,,,,,,,67.5,SBD,Wraps,Yes,Open,29,1987-11-23
1,Elena Yakovleva,Елена Яковлева,F,74.2,95,105,-112.5,105,,60,62.5,-67.5,62.5,,125,-130,130,130,137.5,297.5,75,SBD,Wraps,Yes,Open,26,1991-04-01
2,Olga Klimas,Ольга Климась,F,68.8,95,-110,-115,95,,45,-50,-55,45,,115,-125,130,130,,270,75,SBD,Wraps,Yes,Open,41,1975-09-24
1,Olga Klimas,Ольга Климась,F,68.8,95,-110,-115,95,,45,-50,-55,45,,115,-125,130,130,,270,75,SBD,Wraps,Yes,Masters 40-44,41,1975-09-24
1,Semyon Tkachyov,Семён Ткачёв,M,67.3,190,197.5,202.5,202.5,,92.5,95,97.5,97.5,,180,190,-192.5,190,,490,67.5,SBD,Wraps,Yes,Juniors 20-23,22,1994-09-18
1,Nikita Davydov,Никита Давыдов,M,73,160,-170,-170,160,,120,125,-130,125,,-170,180,-195,180,,465,75,SBD,Wraps,Yes,Juniors 20-23,22,1995-02-14
1,Egor Selikhov,Егор Селихов,M,80.6,250,260,270,270,,130,-140,-140,130,,210,230,-240,230,,630,82.5,SBD,Wraps,Yes,Teen 18-19,19,1997-04-29
1,Egor Selikhov,Егор Селихов,M,80.6,250,260,270,270,,130,-140,-140,130,,210,230,-240,230,,630,82.5,SBD,Wraps,Yes,Open,19,1997-04-29
2,Denis Babiev,Денис Бабиев,M,81.1,200,215,-230,215,,125,130,-135,130,,185,-195,200,200,,545,82.5,SBD,Wraps,Yes,Open,27,1990-03-27
1,Artyom Riznik,Артём Ризник,M,89.2,210,227.5,-240,227.5,,150,157.5,162.5,162.5,,210,230,,230,,620,90,SBD,Wraps,Yes,Juniors 20-23,22,1994-05-04
2,Mikhail Luchits,Михаил Лучиц,M,88.1,200,210,220,220,,120,130,-140,130,,-220,240,262.5,262.5,,612.5,90,SBD,Wraps,Yes,Juniors 20-23,21,1995-05-17
1,Artak Kazaryan,Артак Казарян,M,84.7,210,-225,225,225,,115,122.5,127.5,127.5,,205,-215,215,215,,567.5,90,SBD,Wraps,Yes,Open,16,2000-05-25
2,Andrey Mikhaylov,Андрей Михайлов,M,89.4,150,175,185,185,,140,-155,-155,140,,180,210,220,220,,545,90,SBD,Wraps,Yes,Open,33,1983-07-18
3,Vladimir Presnyakov,Владимир Пресняков,M,87.4,180,-190,-197.5,180,,120,-125,-125,120,,220,230,-237.5,230,,530,90,SBD,Wraps,Yes,Open,27,1989-04-29
1,Mikhail Kalmykov,Михаил Калмыков,M,98.2,250,262.5,-270,262.5,,180,-190,-190,180,,250,260,272.5,272.5,-280,715,100,SBD,Wraps,Yes,Teen 18-19,19,1998-02-10
1,Denis Sapozhkov,Денис Сапожков,M,98.6,200,-212.5,215,215,,130,140,-145,140,,215,227.5,240,240,,595,100,SBD,Wraps,Yes,Open,38,1979-02-06
2,Gleb Zubakov,Глеб Зубаков,M,94.5,160,180,-200,180,,110,120,-132.5,120,,190,210,230,230,,530,100,SBD,Wraps,Yes,Open,25,1991-06-06
1,Mikhail Kulakov,Михаил Кулаков,M,107,125,130,135,135,,70,-75,-75,70,,150,-160,-160,150,,355,110,SBD,Wraps,Yes,Open,30,1986-05-01
1,Maksim Mezheritskiy,Максим Межерицкий,M,117.8,-200,200,230,230,,-150,150,-160,150,,190,-200,-205,190,,570,125,SBD,Wraps,Yes,Open,30,1987-03-31
1,Konstantin Askhabov,Константин Асхабов,M,130.7,225,,,225,,100,125,140,140,,200,245,275,275,,640,140,SBD,Wraps,Yes,Masters 40-44,42,1975-01-31
1,Mariya Ivanova,Мария Иванова,F,53.2,120,130,-140,130,,60,-65,,60,,120,127.5,135,135,,325,56,SBD,Single-ply,Yes,Teen 18-19,18,1998-09-17
1,Anastasiya Tomilova,Анастасия Томилова,F,70.8,175,190,-200,190,,90,102.5,-110,102.5,,162.5,172.5,180,180,-190,472.5,75,SBD,Single-ply,Yes,Teen 16-17,17,1999-04-27
1,Anastasiya Tomilova,Анастасия Томилова,F,70.8,175,190,-200,190,,90,102.5,-110,102.5,,162.5,172.5,180,180,-190,472.5,75,SBD,Single-ply,Yes,Open,17,1999-04-27
1,Egor Filatov,Егор Филатов,M,67.7,160,-167.5,167.5,167.5,,105,110,115,115,,160,-167.5,170,170,,452.5,75,SBD,Single-ply,Yes,Juniors 20-23,23,1993-04-22
1,Roman Durnov,Роман Дурнов,M,74.2,250,-277.5,277.5,277.5,,110,-117.5,-160,110,,190,212.5,-225,212.5,,600,75,SBD,Single-ply,Yes,Open,30,1986-09-03
1,Viktor Yashin,Виктор Яшин,M,78.5,165,177.5,-190,177.5,,110,115,122.5,122.5,,172.5,177.5,185,185,,485,82.5,SBD,Single-ply,Yes,Open,27,1989-10-29
1,Aleksey Sheykin,Алексей Шейкин,M,89.3,220,230,240,240,,180,190,,190,,270,280,282.5,282.5,,712.5,90,SBD,Single-ply,Yes,Open,29,1988-03-24
1,Timur Akhmetov,Тимур Ахметов,M,98.7,250,260,265,265,,190,-200,-200,190,,245,255,265,265,,720,100,SBD,Single-ply,Yes,Open,30,1986-11-17
1,Mikhail Antsiferov,Михаил Анциферов,M,107.2,260,280,290,290,,240,250,-265,250,,230,240,-250,240,,780,110,SBD,Single-ply,Yes,Open,35,1981-07-02
2,Andrey Grigorev,Андрей Григорьев,M,106.2,220,-230,235,235,,170,180,-185,180,,220,230,-235,230,,645,110,SBD,Single-ply,Yes,Open,52,1965-03-25
1,Nikolay Emtsev,Николай Емцев,M,105.4,245,255,,255,,165,175,,175,,245,255,,255,,685,110,SBD,Single-ply,Yes,Masters 45-49,49,1967-05-23
1,Andrey Grigorev,Андрей Григорьев,M,106.2,220,-230,235,235,,170,180,-185,180,,220,230,-235,230,,645,110,SBD,Single-ply,Yes,Masters 50-54,52,1965-03-25
1,Elena Tikhaya,Елена Тихая,F,46.5,60,70,75,75,,35,40,-42.5,40,,75,80,85,85,,200,48,SBD,Raw,No,Open,34,1982-09-28
1,Mariya Pyrina,Мария Пырина,F,49.5,60,65,67.5,67.5,,30,35,37.5,37.5,,75,80,82.5,82.5,,187.5,52,SBD,Raw,No,Teen 18-19,19,1997-08-28
1,Olesya Fisun,Олеся Фисун,F,53.4,52.5,62.5,67.5,67.5,,35,42.5,-45,42.5,,85,95,-105.5,95,,205,56,SBD,Raw,No,Teen 13-15,15,2001-05-31
1,Mariya Klintsova,Мария Клинцова,F,73,110,120,-130,120,,65,-70,-70,65,,132.5,142.5,150,150,,335,75,SBD,Raw,No,Open,30,1987-01-31
1,Tatyana Filimonova,Татьяна Филимонова,F,74,95,100,-105,100,,60,62.5,-65,62.5,,110,120,,120,,282.5,75,SBD,Raw,No,Masters 45-49,48,1969-03-07
1,Vladimir Motkov,Владимир Мотков,M,67.3,195,,,195,,145,-156.5,-156.5,145,,230,240,-248,240,,580,67.5,SBD,Raw,No,Teen 18-19,19,1997-10-14
1,Vladimir Motkov,Владимир Мотков,M,67.3,195,,,195,,145,-156.5,-156.5,145,,230,240,-248,240,,580,67.5,SBD,Raw,No,Open,19,1997-10-14
2,Anton Salin,Антон Салин,M,66.8,90,100,105,105,,80,85,-90,85,,150,160,165,165,,355,67.5,SBD,Raw,No,Open,29,1987-06-13
1,Denis Khokhlov,Денис Хохлов,M,74.9,120,135,-140,135,,85,-87.5,87.5,87.5,,140,150,155,155,,377.5,75,SBD,Raw,No,Teen 16-17,16,2000-07-29
1,Aleksey Synkov,Алексей Сынков,M,73.4,-210,210,-220,210,,120,-130,135,135,,205,-215,-222.5,205,,550,75,SBD,Raw,No,Open,24,1993-01-15
DQ,Pavel Sheff,Павел Шефф,M,79.5,195,205,215,215,,145,150,155,155,,-240,-240,-240,,,,82.5,SBD,Raw,No,Juniors 20-23,23,1993-07-09
1,Pavel Zubkov,Павел Зубков,M,82.4,210,220,232.5,232.5,,145,152.5,155,155,,275,285,295,295,,682.5,82.5,SBD,Raw,No,Open,31,1985-12-22
2,Nikolay Zhiltsov,Николай Жильцов,M,80.6,200,210,-220,210,,140,145,-150,145,,220,230,240,240,,595,82.5,SBD,Raw,No,Open,29,1987-09-09
DQ,Pavel Sheff,Павел Шефф,M,79.5,195,205,215,215,,145,150,155,155,,-240,-240,-240,,,,82.5,SBD,Raw,No,Open,23,1993-07-09
1,Marat Sagitov,Марат Сагитов,M,80.9,195,205,-212.5,205,,130,137.5,-145,137.5,,200,210,215,215,,557.5,82.5,SBD,Raw,No,Masters 45-49,46,1971-03-05
1,Sergey Onishchenko,Сергей Онищенко,M,87,200,210,220,220,,-120,120,-127.5,120,,220,232.5,-242.5,232.5,,572.5,90,SBD,Raw,No,Juniors 20-23,22,1994-11-25
DQ,Maksim Vasin,Максим Васин,M,84.2,-210,215,-220,215,,-120,-120,-120,,,,,,,,,90,SBD,Raw,No,Juniors 20-23,20,1997-02-15
1,Sergey Maksimov,Сергей Максимов,M,89.8,230,245,260,260,,170,180,185,185,,265,280,290,290,,735,90,SBD,Raw,No,Open,27,1989-07-26
2,Aleksey Sheykin,Алексей Шейкин,M,89.3,220,230,240,240,,160,-170,170,170,-175,270,280,282.5,282.5,,692.5,90,SBD,Raw,No,Open,29,1988-03-24
3,Dmitriy Melikhov,Дмитрий Мелихов,M,88,200,215,220,220,,140,147.5,-152.5,147.5,,225,-232.5,232.5,232.5,,600,90,SBD,Raw,No,Open,37,1979-09-19
1,Oleg Ksenchuk,Олег Ксенчук,M,85.9,130,-140,-145,130,,100,-110,112.5,112.5,,140,160,170,170,,412.5,90,SBD,Raw,No,Masters 45-49,47,1970-01-25
1,Aleksandr Burin,Александр Бурин,M,96.2,-225,225,237.5,237.5,,170,175,177.5,177.5,,240,257.5,-262.5,257.5,,672.5,100,SBD,Raw,No,Juniors 20-23,23,1994-01-01
2,Nikolay Pogorelyy,Николай Погорелый,M,93.8,-220,225,240,240,,130,145,-155,145,,260,277.5,-285,277.5,,662.5,100,SBD,Raw,No,Juniors 20-23,23,1993-10-01
1,Roman Paltsev,Роман Пальцев,M,100,270,290,300,300,,210,-220,-220,210,,310,330,340,340,,850,100,SBD,Raw,No,Open,31,1985-04-26
2,Aleksandr Aksenin,Александр Аксенин,M,99.5,250,265,-275,265,,160,170,-180,170,,-250,-250,250,250,,685,100,SBD,Raw,No,Open,24,1993-04-05
3,Nikolay Zamp,Николай Замп,M,98.9,210,-222.5,225,225,,140,-150,150,150,,230,-245,-250,230,,605,100,SBD,Raw,No,Open,27,1990-03-02
4,Sergey Kiselev,Сергей Киселев,M,100,160,170,185,185,,-130,-145,145,145,,235,250,265,265,,595,100,SBD,Raw,No,Open,26,1990-06-20
DQ,Igor Kirsanov,Игорь Кирсанов,M,97.8,-170,-170,-180,,,105,112.5,-120,112.5,,195,205,215,215,,,100,SBD,Raw,No,Open,34,1983-01-03
1,Aleksandr Saraykin,Александр Сарайкин,M,98.3,180,190,,190,,-125,130,135,135,,205,215,-220,215,,540,100,SBD,Raw,No,Masters 40-44,40,1977-01-15
1,Ivan Pezikov,Иван Пезиков,M,106.6,260,265,-270.5,265,,165,172.5,-177.5,172.5,,265,-270,,265,,702.5,110,SBD,Raw,No,Juniors 20-23,22,1994-04-24
1,Pavel Chukhnov,Павел Чухнов,M,108.9,300,315,-325,315,,170,180,-185,180,,280,-290,-290,280,,775,110,SBD,Raw,No,Open,28,1989-03-05
2,Denis Degtyar,Денис Дегтярь,M,105.7,250,265,275,275,,170,180,-190,180,,-305,315,-325,315,,770,110,SBD,Raw,No,Open,35,1981-06-24
3,Sergey Kudryavtsev,Сергей Кудрявцев,M,100.6,240,-260,-260,240,,155,160,-170,160,,260,-265,,260,,660,110,SBD,Raw,No,Open,33,1983-06-03
1,Ilya Ushkov,Илья Ушков,M,103.6,257.5,265,,265,,172.5,177.5,-182.5,177.5,,200,230,260,260,,702.5,110,SBD,Raw,No,Masters 40-44,40,1976-06-21
1,Igor Sharapov,Игорь Шарапов,M,109.8,240,250,257.5,257.5,,182.5,192.5,-195,192.5,,265,275,-280,275,,725,110,SBD,Raw,No,Masters 45-49,45,1971-10-30
1,Roman Kuznetsov #1,Роман Кузнецов,M,116.9,235,245,-250,245,,170,-180,-180,170,,275,290,-295,290,,705,125,SBD,Raw,No,Open,35,1981-07-15
1,Sergey Sventitskiy,Сергей Свентицкий,M,136.8,240,250,255,255,,195,200,-205,200,,300,-310,-310,300,,755,140,SBD,Raw,No,Juniors 20-23,23,1994-02-06
1,Dmitriy Pys,Дмитрий Пысь,M,127.4,300,320,330,330,,200,220,-230,220,,300,320,330,330,,880,140,SBD,Raw,No,Open,30,1986-05-04
1,Yana Petelova,Яна Петелова,F,56.3,130,-137.5,137.5,137.5,,57.5,60,62.5,62.5,,110,117.5,123,123,,323,60,SBD,Wraps,No,Open,27,1990-04-12
1,Anastasiya Shabanova,Анастасия Шабанова,F,65,112.5,125,137.5,137.5,,52.5,57.5,62.5,62.5,,110,125,135,135,,335,67.5,SBD,Wraps,No,Teen 16-17,16,2000-07-23
1,Valentina Kharina,Валентина Харина,F,65.3,130,140,150,150,,100,107.5,110,110,,130,140,150,150,,410,67.5,SBD,Wraps,No,Open,39,1977-12-10
1,Ekaterina Pogula,Екатерина Погула,F,66.4,70,-75,-75,70,,-35,35,-37.5,35,,65,72.5,77.5,77.5,,182.5,67.5,SBD,Wraps,No,Masters 40-44,44,1972-04-28
1,Mariya Panferova,Мария Панферова,F,71.6,230,240,250,250,,127.5,135,-140,135,,195,207.5,215,215,220,600,75,SBD,Wraps,No,Open,39,1977-04-27
1,Anton Biryukov,Антон Бирюков,M,69.9,170,175,-200,175,,80,90,95,95,,150,160,170,170,,440,75,SBD,Wraps,No,Teen 18-19,19,1998-03-17
1,Artyom Medvedev,Артём Медведев,M,79.8,160,,,160,,115,,,115,,190,,,190,,465,82.5,SBD,Wraps,No,Teen 16-17,17,1999-05-04
1,Maksim Grekov,Максим Греков,M,79.6,240,255,-270,255,,170,-175,-175,170,,260,275,287.5,287.5,,712.5,82.5,SBD,Wraps,No,Open,31,1985-09-09
2,Sergey Mozhaev,Сергей Можаев,M,82.5,222.5,230,-235,230,,150,-155,-155,150,,230,-235,-235,230,,610,82.5,SBD,Wraps,No,Open,29,1988-04-16
3,Yuriy Valyaev,Юрий Валяев,M,81,210,-220,220,220,,150,160,170,170,,-210,215,-230,215,,605,82.5,SBD,Wraps,No,Open,36,1981-01-31
4,Artyom Medvedev,Артём Медведев,M,79.8,-160,160,-170,160,,115,-120,-120,115,,180,190,-200,190,,465,82.5,SBD,Wraps,No,Open,34,1982-09-19
1,Evgeniy Kolesnikov,Евгений Колесников,M,88.8,-230,230,250,250,,137.5,147.5,-155,147.5,,220,232.5,237.5,237.5,,635,90,SBD,Wraps,No,Open,32,1984-12-02
1,Igor Lipnik,Игорь Липник,M,90,200,210,220,220,,155,165,-175,165,,220,230,-240,230,,615,90,SBD,Wraps,No,Masters 40-44,42,1974-07-27
1,Yury Belkin,Юрий Белкин,M,99.5,360,-375,,360,,220,225,,225,,390,410,-415,410,,995,100,SBD,Wraps,No,Open,26,1990-12-05
2,Dmitriy Yakovlev,Дмитрий Яковлев,M,98.5,245,255,,255,,155,-165,,155,,280,-290,,280,,690,100,SBD,Wraps,No,Open,32,1984-08-20
3,Dmitriy Goryunov,Дмитрий Горюнов,M,99.6,230,240,245,245,,160,170,-180,170,,220,-230,-230,220,,635,100,SBD,Wraps,No,Open,27,1989-07-11
DQ,Dmitriy Ryakhovskiy,Дмитрий Ряховский,M,99.6,-280,-290,-290,,,,,,,,,,,,,,100,SBD,Wraps,No,Open,27,1989-09-05
1,Andrey Ivanov,Андрей Иванов,M,92.6,-190,190,-210,190,,110,120,130,130,,190,-210,210,210,,530,100,SBD,Wraps,No,Masters 45-49,46,1971-01-14
1,Vladimir Dergunov,Владимир Дергунов,M,105.5,290,305,315,315,,190,200,207.5,207.5,,315,335,350,350,,872.5,110,SBD,Wraps,No,Open,26,1991-03-09
2,Futit Dzheyns,Футит Джейнс,M,102.3,190,210,220,220,,170,180,185,185,,-245,245,-247.5,245,,650,110,SBD,Wraps,No,Open,33,1983-09-30
1,Sergey Ustinov,Сергей Устинов,M,122.5,290,310,330,330,,185,195,-205,195,,270,290,310,310,,835,125,SBD,Wraps,No,Open,28,1988-04-23
1,Darya Chernyak,Дарья Черняк,F,62.2,-150,150,-165,150,,85,95,102.5,102.5,,135,150,160,160,,412.5,67.5,SBD,Single-ply,No,Juniors 20-23,21,1996-01-09
DQ,Ilya Kokorev,Илья Кокорев,M,77.8,-270,-270,-270,,,,,,,,,,,,,,82.5,SBD,Single-ply,No,Open,44,1973-01-19
DQ,Ilya Kokorev,Илья Кокорев,M,77.8,-270,-270,-270,,,,,,,,,,,,,,82.5,SBD,Single-ply,No,Masters 40-44,44,1973-01-19
1,Kirill Anfinogenov,Кирилл Анфиногенов,M,99.7,280,290,300,300,,-205,205,-215,205,,-260,260,290,290,,795,100,SBD,Single-ply,No,Teen 18-19,19,1998-03-06
1,Viktor Voytsekhovskiy,Виктор Войцеховский,M,100,220,232.5,242.5,242.5,,160,-170,170,170,,210,220,235,235,,647.5,100,SBD,Single-ply,No,Juniors 20-23,22,1994-12-01
1,Ivan Chikin,Иван Чикин,M,104.3,210,230,-250,230,,100,-140,,100,,195,220,-230,220,,550,110,SBD,Single-ply,No,Juniors 20-23,22,1994-09-09
1,Aleksandr Muratkin,Александр Мураткин,M,108.8,310,320,330,330,,235,242.5,-247.5,242.5,,335,-355,-370,335,,907.5,110,SBD,Single-ply,No,Open,31,1985-08-29
2,Ravil Amirov,Равиль Амиров,M,103.3,275,290,300,300,,185,195,205,205,,265,-280,290,290,,795,110,SBD,Single-ply,No,Open,37,1979-09-01
1,Aleksandr Lugovoy,Александр Луговой,M,125,320,350,370,370,,245,260,270,270,,310,335,360,360,,1000,125,SBD,Single-ply,No,Juniors 20-23,21,1995-10-28
1,Artem Milashevskiy,Артем Милашевский,M,112.5,300,320,332.5,332.5,,220,-230,-230,220,,-280,280,290,290,,842.5,125,SBD,Single-ply,No,Open,34,1983-03-29
1,Vesta Leonova,Веста Леонова,F,48,-72.5,72.5,-77.5,72.5,,,,,,,,,,,,72.5,48,S,Raw,Yes,Open,26,1991-03-30
1,Irina Chizhova,Ирина Чижова,F,52,-115,115,-120,115,,,,,,,,,,,,115,52,S,Raw,Yes,Open,24,1993-03-14
1,Anna Shchekina,Анна Щекина,F,55.7,-82.5,82.5,90,90,,,,,,,,,,,,90,56,S,Raw,Yes,Open,28,1989-01-12
1,Evgeniy Simon,Евгений Симон,M,88.3,222.5,232.5,242.5,242.5,,,,,,,,,,,,242.5,90,S,Raw,Yes,Open,34,1983-03-24
2,Aleksey Sheykin,Алексей Шейкин,M,89.3,220,230,240,240,,,,,,,,,,,,240,90,S,Raw,Yes,Open,29,1988-03-24
1,Sergey Durandin,Сергей Дурандин,M,98.2,200,210,215,215,,,,,,,,,,,,215,100,S,Raw,Yes,Open,42,1974-05-04
1,Sergey Durandin,Сергей Дурандин,M,98.2,200,210,215,215,,,,,,,,,,,,215,100,S,Raw,Yes,Masters 40-44,42,1974-05-04
1,Andrey Kryuchkov,Андрей Крючков,M,119.7,250,262.5,-275,262.5,,,,,,,,,,,,262.5,125,S,Raw,Yes,Open,36,1980-11-20
2,Aleksey Lebed,Алексей Лебедь,M,115,210,225,-235,225,,,,,,,,,,,,225,125,S,Raw,Yes,Open,27,1989-07-28
1,Aleksey Synkov,Алексей Сынков,M,73.4,-210,210,-220,210,,,,,,,,,,,,210,75,S,Raw,No,Open,24,1993-01-15
1,Nikolay Zhiltsov,Николай Жильцов,M,80.6,200,210,-230,210,,,,,,,,,,,,210,82.5,S,Raw,No,Open,29,1987-09-09
1,Marat Sagitov,Марат Сагитов,M,80.9,195,205,-212.5,205,,,,,,,,,,,,205,82.5,S,Raw,No,Masters 45-49,46,1971-03-05
1,Sergey Maksimov,Сергей Максимов,M,89.8,230,245,260,260,,,,,,,,,,,,260,90,S,Raw,No,Open,27,1989-07-26
2,Aleksey Sheykin,Алексей Шейкин,M,89.3,220,230,240,240,,,,,,,,,,,,240,90,S,Raw,No,Open,29,1988-03-24
1,Aleksey Strulev,Алексей Струлев,M,98,160,170,-180,170,,,,,,,,,,,,170,100,S,Raw,No,Masters 45-49,46,1971-03-19
1,Vitaliy Gnatko,Виталий Гнатко,M,94.7,185,-195,200,200,,,,,,,,,,,,200,100,S,Raw,No,Masters 55-59,55,1961-07-30
1,Pavel Chukhnov,Павел Чухнов,M,108.9,300,315,-325,315,,,,,,,,,,,,315,110,S,Raw,No,Open,28,1989-03-05
2,Sergey Kudryavtsev,Сергей Кудрявцев,M,100.6,240,-260,-260,240,,,,,,,,,,,,240,110,S,Raw,No,Open,33,1983-06-03
1,Ilya Ushkov,Илья Ушков,M,103.6,257.5,265,,265,,,,,,,,,,,,265,110,S,Raw,No,Masters 40-44,40,1976-06-21
1,Anastasiya Shiryaeva,Анастасия Ширяева,F,67.5,-110,110,-120,110,,,,,,,,,,,,110,67.5,S,Wraps,Yes,Teen 18-19,18,1998-08-30
1,Egor Selikhov,Егор Селихов,M,80.6,250,260,270,270,,,,,,,,,,,,270,82.5,S,Wraps,Yes,Teen 18-19,19,1997-04-29
1,Igor Gridnev,Игорь Гриднев,M,80.4,160,-170,,160,,,,,,,,,,,,160,82.5,S,Wraps,Yes,Open,38,1978-08-19
1,Ivan Kiselev,Иван Киселев,M,86,140,-150,160,160,,,,,,,,,,,,160,90,S,Wraps,Yes,Masters 55-59,55,1961-10-17
1,Maksim Mezheritskiy,Максим Межерицкий,M,117.8,-200,200,230,230,,,,,,,,,,,,230,125,S,Wraps,Yes,Open,30,1987-03-31
1,Vladimir Sidnikhin,Владимир Сиднихин,M,87.7,250,-260,-260,250,,,,,,,,,,,,250,90,S,Wraps,No,Masters 40-44,44,1972-09-18
1,Evgeniy Bukhalko,Евгений Бухалко,M,99.6,160,170,-180,170,,,,,,,,,,,,170,100,S,Wraps,No,Open,32,1984-05-08
1,Aleksandr Bereznikov,Александр Березников,M,114.8,200,-210,220,220,,,,,,,,,,,,220,125,S,Wraps,No,Masters 50-54,53,1964-01-26
1,Roman Durnov,Роман Дурнов,M,74.2,250,-277.5,277.5,277.5,,,,,,,,,,,,277.5,75,S,Single-ply,Yes,Open,30,1986-09-03
1,Darya Chernyak,Дарья Черняк,F,62.2,-150,150,-165,150,,,,,,,,,,,,150,67.5,S,Single-ply,No,Juniors 20-23,21,1996-01-09
1,Yuliya Tikhomirova,Юлия Тихомирова,F,51,,,,,,45,50,-52.5,50,,90,95,100,100,,150,52,BD,Raw,Yes,Open,27,1989-09-12
1,Nikita Mizonov,Никита Мизонов,M,73.8,,,,,,90,-95,97.5,97.5,,150,162.5,170,170,,267.5,75,BD,Raw,Yes,Teen 16-17,17,1999-05-22
1,Nikolay Obukhov,Николай Обухов,M,73.6,,,,,,100,-105,105,105,-107.5,180,190,,190,,295,75,BD,Raw,Yes,Masters 60-64,64,1953-04-02
1,Igor Pashkov,Игорь Пашков,M,81,,,,,,130,132.5,135,135,,237.5,-245,,237.5,,372.5,82.5,BD,Raw,Yes,Open,30,1986-06-10
2,Sergey Sivak,Сергей Сивак,M,76.2,,,,,,135,140,145,145,,200,210,220,220,,365,82.5,BD,Raw,Yes,Open,37,1979-08-09
3,Anton Khristoforov,Антон Христофоров,M,79.8,,,,,,110,-115,117.5,117.5,,175,180,190,190,,307.5,82.5,BD,Raw,Yes,Open,24,1992-05-24
1,Maksim Matveyev,Максим Матвеев,M,86.6,,,,,,180,187.5,192.5,192.5,,270,280,-287.5,280,,472.5,90,BD,Raw,Yes,Open,35,1981-08-10
2,Aleksey Sheykin,Алексей Шейкин,M,89.3,,,,,,160,-170,170,170,-175,270,280,282.5,282.5,,452.5,90,BD,Raw,Yes,Open,29,1988-03-24
3,Evgeniy Simon,Евгений Симон,M,88.3,,,,,,155,160,165,165,,262.5,270,282.5,282.5,,447.5,90,BD,Raw,Yes,Open,34,1983-03-24
4,Danil Ilyasov,Данил Ильясов,M,84.9,,,,,,117.5,122.5,-125,122.5,,160,180,-190,180,,302.5,90,BD,Raw,Yes,Open,25,1992-03-08
1,Pavel Koltsov,Павел Кольцов,M,99.6,,,,,,140,150,155,155,,240,250,255,255,,410,100,BD,Raw,Yes,Open,23,1993-08-11
2,Denis Plenkin,Денис Пленкин,M,99.5,,,,,,140,150,152.5,152.5,,240,-250,,240,,392.5,100,BD,Raw,Yes,Open,42,1974-05-19
3,Georgiy Kotelnikov,Георгий Котельников,M,97.7,,,,,,-150,150,-155,150,,220,230,-235,230,,380,100,BD,Raw,Yes,Open,24,1992-06-04
1,Denis Plenkin,Денис Пленкин,M,99.5,,,,,,140,150,152.5,152.5,,240,-250,,240,,392.5,100,BD,Raw,Yes,Masters 40-44,42,1974-05-19
1,Evgeniy Petrov,Евгений Петров,M,117.7,,,,,,180,185,190,190,,275,287.5,290,290,-295,480,125,BD,Raw,Yes,Juniors 20-23,20,1996-09-14
1,Tabriz Nurutdinov,Табриз Нурутдинов,M,119.6,,,,,,165,175,-180,175,,260,275,285,285,,460,125,BD,Raw,Yes,Open,35,1981-07-31
2,Aleksey Lebed,Алексей Лебедь,M,115,,,,,,185,195,-200,195,,-210,220,230,230,,425,125,BD,Raw,Yes,Open,27,1989-07-28
1,Oleg Demchenko,Олег Демченко,M,130.4,,,,,,170,175,180,180,,310,330,345,345,,525,140,BD,Raw,Yes,Open,39,1977-08-11
1,Natalya Knyazeva,Наталья Князева,F,59.2,,,,,,-47.5,-47.5,47.5,47.5,,80,100,110,110,,157.5,60,BD,Raw,No,Open,46,1970-07-16
1,Evgeniy Tikhonov,Евгений Тихонов,M,74.5,,,,,,115,117.5,120,120,,185,190,200,200,,320,75,BD,Raw,No,Open,27,1990-01-17
1,Nikolay Zhiltsov,Николай Жильцов,M,80.6,,,,,,140,145,-150,145,,220,230,240,240,,385,82.5,BD,Raw,No,Open,29,1987-09-09
2,Igor Pashkov,Игорь Пашков,M,81,,,,,,130,132.5,135,135,,237.5,-245,,237.5,,372.5,82.5,BD,Raw,No,Open,30,1986-06-10
1,Maksim Popov #6,Максим Попов,M,88.5,,,,,,-175,175,180,180,,270,285,-292.5,285,,465,90,BD,Raw,No,Open,25,1991-05-18
2,Aleksey Sheykin,Алексей Шейкин,M,89.3,,,,,,160,-170,170,170,-175,270,280,282.5,282.5,,452.5,90,BD,Raw,No,Open,29,1988-03-24
1,Maksim Medvedev,Максим Медведев,M,97.2,,,,,,185,200,207.5,207.5,,275,295,310,310,,517.5,100,BD,Raw,No,Open,35,1981-05-16
1,Sergey Ukhanov,Сергей Уханов,M,98.8,,,,,,-190,190,-195,190,,-240,240,250,250,,440,100,BD,Raw,No,Masters 40-44,42,1974-05-23
1,Sergey Bulat,Сергей Булат,M,108.2,,,,,,150,-160,-160,150,,100,,,100,,250,110,BD,Raw,No,Juniors 20-23,22,1995-02-24
1,German Aleksandrov,Герман Александров,M,121.2,,,,,,160,167.5,175,175,,250,260,270,270,,445,125,BD,Raw,No,Juniors 20-23,21,1995-07-27
1,Aleksey Sheykin,Алексей Шейкин,M,89.3,,,,,,180,190,,190,,270,280,282.5,282.5,,472.5,90,BD,Raw,Yes,Open,29,1988-03-24
1,Mikhail Antsiferov,Михаил Анциферов,M,107.2,,,,,,240,250,-265,250,,230,240,-250,240,,490,110,BD,Raw,Yes,Open,35,1981-07-02
1,Aleksey Sheykin,Алексей Шейкин,M,89.3,,,,,,180,190,,190,,270,280,282.5,282.5,,472.5,90,BD,Raw,No,Open,29,1988-03-24
1,Aleksandr Yukhanov,Александр Юханов,M,103.9,,,,,,160,182.5,-190,182.5,,-290,290,-322.5,290,,472.5,110,BD,Raw,No,Open,31,1985-12-14
1,Anastasiya Oreshkina,Анастасия Орешкина,F,48,,,,,,,,,,,110,117.5,125,125,,125,48,D,Raw,Yes,Open,33,1983-09-08
1,Lyudmila Demidova,Людмила Демидова,F,50.9,,,,,,,,,,,90,97.5,102.5,102.5,-111,102.5,52,D,Raw,Yes,Juniors 20-23,21,1995-06-10
DQ,Darya Ermolaeva,Дарья Ермолаева,F,60,,,,,,,,,,,-140,-140,,,,,60,D,Raw,Yes,Open,24,1993-04-01
1,Yuliya Nefedova,Юлия Нефедова,F,65.8,,,,,,,,,,,-145,145,-150,145,,145,67.5,D,Raw,Yes,Open,31,1985-10-21
1,Svetlana Buryan,Светлана Бурьян,F,81.5,,,,,,,,,,,130,140,145,145,,145,82.5,D,Raw,Yes,Masters 45-49,46,1970-12-21
1,Roman Ratnikov,Роман Ратников,M,38,,,,,,,,,,,65,75,80,80,,80,52,D,Raw,Yes,Youth,10,2006-07-26
2,Artem Tikhoboev,Артем Тихобоев,M,31.3,,,,,,,,,,,-60,-60,60,60,,60,52,D,Raw,Yes,Youth,8,2008-08-24
1,Andrey Merkulov,Андрей Меркулов,M,67.3,,,,,,,,,,,200,205,-210,205,,205,67.5,D,Raw,Yes,Open,25,1992-03-02
1,Maksim Sukhobok,Максим Сухобок,M,65.7,,,,,,,,,,,222.5,-240,-240,222.5,,222.5,67.5,D,Raw,Yes,Masters 50-54,52,1965-01-01
1,Artem Novikov #2,Артем Новиков,M,74.1,,,,,,,,,,,-150,150,160,160,,160,75,D,Raw,Yes,Teen 18-19,18,1999-02-13
2,Viktor Piskunov #2,Виктор Пискунов,M,70.7,,,,,,,,,,,120,130,-140,130,,130,75,D,Raw,Yes,Teen 18-19,18,1999-03-27
1,Pavel Kochnikov,Павел Кочников,M,72.1,,,,,,,,,,,200,215,220,220,,220,75,D,Raw,Yes,Open,28,1988-09-30
2,Evgeniy Shirokov,Евгений Широков,M,74.6,,,,,,,,,,,160,170,175,175,,175,75,D,Raw,Yes,Open,28,1988-12-03
1,Aleksey Stolpovskiy,Алексей Столповский,M,74,,,,,,,,,,,105,115,-120,115,,115,75,D,Raw,Yes,Masters 40-44,41,1976-02-12
1,Nikolay Obukhov,Николай Обухов,M,73.6,,,,,,,,,,,180,190,,190,,190,75,D,Raw,Yes,Masters 60-64,64,1953-04-02
1,Aleksandr Pisarev,Александр Писарев,M,79.9,,,,,,,,,,,-265,-265,265,265,,265,82.5,D,Raw,Yes,Teen 18-19,18,1998-06-05
2,Vladislav Zolotukhin,Владислав Золотухин,M,82.2,,,,,,,,,,,-120,120,140,140,,140,82.5,D,Raw,Yes,Teen 13-15,15,2002-01-30
1,Maksim Karpov,Максим Карпов,M,81.8,,,,,,,,,,,-180,180,-182.5,180,,180,82.5,D,Raw,Yes,Juniors 20-23,20,1997-02-26
1,Vladislav Kuzmishchev,Владислав Кузьміщев,M,81.2,,,,,,,,,,,260,272.5,-287.5,272.5,,272.5,82.5,D,Raw,Yes,Open,33,1983-10-18
2,Aleksandr Pisarev,Александр Писарев,M,79.9,,,,,,,,,,,-265,-265,265,265,,265,82.5,D,Raw,Yes,Open,18,1998-06-05
3,Igor Pashkov,Игорь Пашков,M,81,,,,,,,,,,,237.5,245,,245,,245,82.5,D,Raw,Yes,Open,30,1986-06-10
4,Igor Shatilo,Игорь Шатило,M,82.2,,,,,,,,,,,240,-250,-250,240,,240,82.5,D,Raw,Yes,Open,28,1988-08-07
5,Andrey Ganichkin,Андрей Ганичкин,M,82.5,,,,,,,,,,,230,235,-240,235,,235,82.5,D,Raw,Yes,Open,32,1984-08-09
6,Denis Saenko,Денис Саенко,M,80.4,,,,,,,,,,,-200,200,220,220,,220,82.5,D,Raw,Yes,Open,36,1980-09-04
7,Vladimir Tarasov,Владимир Тарасов,M,80.9,,,,,,,,,,,-200,210,,210,,210,82.5,D,Raw,Yes,Open,35,1981-12-26
8,Evgeniy Kononov,Евгений Кононов,M,81.5,,,,,,,,,,,182.5,190,200,200,,200,82.5,D,Raw,Yes,Open,31,1986-01-10
9,Anton Khristoforov,Антон Христофоров,M,79.8,,,,,,,,,,,175,180,190,190,,190,82.5,D,Raw,Yes,Open,24,1992-05-24
DQ,Igor Pashkov,Игорь Пашков,M,81.6,,,,,,,,,,,-240,-240,,,,,82.5,D,Raw,Yes,Open,30,1986-06-10
1,Viktor Ovsyanyy,Виктор Овсяный,M,77.4,,,,,,,,,,,150,155,165,165,,165,82.5,D,Raw,Yes,Masters 55-59,59,1958-04-19
1,Petr Kireev,Петр Киреев,M,84.2,,,,,,,,,,,235,-245,-245,235,,235,90,D,Raw,Yes,Juniors 20-23,21,1996-02-05
1,Kirill Lomanov,Кирилл Ломанов,M,88.9,,,,,,,,,,,295,-305,-305,295,,295,90,D,Raw,Yes,Open,29,1987-07-15
2,Aleksey Boyarintsev,Алексей Бояринцев,M,87,,,,,,,,,,,262.5,272.5,282.5,282.5,,282.5,90,D,Raw,Yes,Open,28,1989-01-02
3,Evgeniy Simon,Евгений Симон,M,88.3,,,,,,,,,,,262.5,270,282.5,282.5,,282.5,90,D,Raw,Yes,Open,34,1983-03-24
4,Aleksey Sheykin,Алексей Шейкин,M,89.3,,,,,,,,,,,270,280,282.5,282.5,,282.5,90,D,Raw,Yes,Open,29,1988-03-24
5,Vladimir Presnyakov,Владимир Пресняков,M,87.4,,,,,,,,,,,220,230,-237.5,230,,230,90,D,Raw,Yes,Open,27,1989-04-29
6,Pavel Kapustkin,Павел Капусткин,M,87.5,,,,,,,,,,,215,230,-235,230,,230,90,D,Raw,Yes,Open,30,1986-07-20
7,Zhasurbek Umurzakov,Жасурбек Умурзаков,M,89.9,,,,,,,,,,,205,222.5,230,230,,230,90,D,Raw,Yes,Open,30,1987-03-17
1,Sergey Utkin,Сергей Уткин,M,89.4,,,,,,,,,,,215,230,240,240,,240,90,D,Raw,Yes,Masters 40-44,44,1972-08-21
1,Pavel Koltsov,Павел Кольцов,M,99.6,,,,,,,,,,,240,250,255,255,,255,100,D,Raw,Yes,Juniors 20-23,23,1993-08-11
1,Vasiliy Dovgoborets,Василий Довгоборец,M,99.4,,,,,,,,,,,275,285,,285,,285,100,D,Raw,Yes,Open,27,1990-01-25
2,Aleksandr Gostyaev,Александр Гостяев,M,97.7,,,,,,,,,,,240,250,-260,250,,250,100,D,Raw,Yes,Open,34,1982-12-02
3,Sergey Durandin,Сергей Дурандин,M,98.2,,,,,,,,,,,230,240,-245,240,,240,100,D,Raw,Yes,Open,42,1974-05-04
1,Pavel Bychkov,Павел Бычков,M,95.8,,,,,,,,,,,240,250,-252.5,250,,250,100,D,Raw,Yes,Masters 40-44,41,1975-08-19
2,Sergey Durandin,Сергей Дурандин,M,98.2,,,,,,,,,,,230,240,-245,240,,240,100,D,Raw,Yes,Masters 40-44,42,1974-05-04
1,Aleksandr Demichev,Александр Демичев,M,108.7,,,,,,,,,,,240,-250,-250,240,,240,110,D,Raw,Yes,Juniors 20-23,23,1993-09-26
1,Dmitriy Pavlovskiy,Дмитрий Павловский,M,108.6,,,,,,,,,,,280,-290,-290,280,,280,110,D,Raw,Yes,Open,29,1988-02-01
2,Igor Frolov,Игорь Фролов,M,107.3,,,,,,,,,,,215,230,245,245,,245,110,D,Raw,Yes,Open,24,1992-12-27
1,Sergey Lukyanov,Сергей Лукьянов,M,108.8,,,,,,,,,,,-160,-160,160,160,,160,110,D,Raw,Yes,Masters 60-64,61,1955-10-25
1,Sergey Tsurikov,Сергей Цуриков,M,124.2,,,,,,,,,,,300,310,-315,310,,310,125,D,Raw,Yes,Open,29,1987-06-10
2,Tabriz Nurutdinov,Табриз Нурутдинов,M,119.6,,,,,,,,,,,260,275,285,285,,285,125,D,Raw,Yes,Open,35,1981-07-31
3,Aleksey Lebed,Алексей Лебедь,M,115,,,,,,,,,,,-210,220,230,230,,230,125,D,Raw,Yes,Open,27,1989-07-28
1,Dmitriy Gadzhiev,Дмитрий Гаджиев,M,88.8,,,,,,,,,,,290,305,-320,305,,305,90,D,Raw,Yes,Teen 18-19,19,1997-08-28
1,Artem Bykhovets,Артем Быховец,M,87.9,,,,,,,,,,,-250,250,-285,250,,250,90,D,Raw,Yes,Open,33,1983-07-19
1,Aleksey Kartel,Алексей Картель,M,99.8,,,,,,,,,,,-310,-320,320,320,,320,100,D,Raw,Yes,Open,28,1988-08-29
1,Denis Plenkin,Денис Пленкин,M,99.5,,,,,,,,,,,240,-250,,240,,240,100,D,Raw,Yes,Masters 40-44,42,1974-05-19
1,Elena Astakhova,Елена Астахова,F,58.4,,,,,,,,,,,-130,140,150,150,,150,60,D,Raw,No,Open,35,1982-04-17
1,Aleksandr Likholai,Александр Лихолай,M,74.3,,,,,,,,,,,-110,-110,110,110,,110,75,D,Raw,No,Masters 75-79,78,1939-02-22
1,Natan Kaganovich,Натан Каганович,M,80.9,,,,,,,,,,,150,157.5,162.5,162.5,,162.5,82.5,D,Raw,No,Teen 16-17,16,2000-06-16
1,Vladislav Stroev,Владислав Строев,M,81.7,,,,,,,,,,,260,-287.5,-287.5,260,,260,82.5,D,Raw,No,Juniors 20-23,21,1995-05-31
1,Konstantin Azizmamadov,Константин Азизмамадов,M,82.2,,,,,,,,,,,230,250,-260,250,,250,82.5,D,Raw,No,Open,32,1985-03-17
2,Nikolay Zhiltsov,Николай Жильцов,M,80.6,,,,,,,,,,,220,230,240,240,,240,82.5,D,Raw,No,Open,29,1987-09-09
DQ,Igor Pashkov,Игорь Пашков,M,81.6,,,,,,,,,,,-240,-240,,,,,82.5,D,Raw,No,Open,30,1986-06-10
1,Marat Sagitov,Марат Сагитов,M,80.9,,,,,,,,,,,200,210,215,215,,215,82.5,D,Raw,No,Masters 45-49,46,1971-03-05
1,Viktor Skokin,Виктор Скокин,M,79.4,,,,,,,,,,,-180,180,190,190,,190,82.5,D,Raw,No,Masters 55-59,59,1957-06-20
1,Georgiy Lazaridi,Георгий Лазариди,M,81.3,,,,,,,,,,,-130,-135,135,135,140,135,82.5,D,Raw,No,Masters 80+,83,1933-08-18
1,Maksim Vasin,Максим Васин,M,84.5,,,,,,,,,,,250,260,-270,260,,260,90,D,Raw,No,Juniors 20-23,20,1997-02-15
1,Dmitriy Timofeev,Дмитрий Тимофеев,M,90,,,,,,,,,,,325,-335,-335,325,,325,90,D,Raw,No,Open,30,1987-02-21
2,Aleksandr Yushkov,Александр Юшков,M,88.4,,,,,,,,,,,275,290,-300,290,,290,90,D,Raw,No,Open,33,1983-04-24
3,Sergey Maksimov,Сергей Максимов,M,89.8,,,,,,,,,,,265,280,290,290,,290,90,D,Raw,No,Open,27,1989-07-26
4,Aleksey Sheykin,Алексей Шейкин,M,89.3,,,,,,,,,,,270,280,282.5,282.5,,282.5,90,D,Raw,No,Open,29,1988-03-24
1,Vladimir Fokin,Владимир Фокин,M,88.4,,,,,,,,,,,245,-260,-260,245,,245,90,D,Raw,No,Masters 50-54,51,1965-09-29
1,Nikolay Pogorelyy,Николай Погорелый,M,93.8,,,,,,,,,,,272.5,-280,280,280,285,280,100,D,Raw,No,Juniors 20-23,23,1993-10-01
2,Andrey Gromov,Андрей Громов,M,94,,,,,,,,,,,220,240,-250,240,,240,100,D,Raw,No,Juniors 20-23,22,1994-06-12
1,Maksim Medvedev,Максим Медведев,M,97.5,,,,,,,,,,,275,295,310,310,,310,100,D,Raw,No,Open,35,1981-05-16
2,Vitaliy Zheludev,Виталий Желудев,M,93.5,,,,,,,,,,,-285,285,295,295,,295,100,D,Raw,No,Open,32,1985-02-09
DQ,Pavel Kobelev,Павел Кобелев,M,90.7,,,,,,,,,,,-310,-310,-310,,,,100,D,Raw,No,Open,27,1989-08-04
DQ,Valentin Efremov,Валентин Ефремов,M,98.6,,,,,,,,,,,-272.5,-272.5,,,,,100,D,Raw,No,Open,31,1986-02-13
1,Sergey Ukhanov,Сергей Уханов,M,98.8,,,,,,,,,,,-240,240,250,250,,250,100,D,Raw,No,Masters 40-44,42,1974-05-23
1,Igor Luzin,Игорь Лузин,M,99.7,,,,,,,,,,,180,200,205,205,,205,100,D,Raw,No,Masters 45-49,47,1969-11-04
DQ,Yuliy Grakhov,Юлий Грахов,M,90.6,,,,,,,,,,,-175,,,,,,100,D,Raw,No,Masters 50-54,53,1963-08-17
1,Vitaliy Gnatko,Виталий Гнатко,M,94.7,,,,,,,,,,,220,235,245,245,,245,100,D,Raw,No,Masters 55-59,55,1961-07-30
1,Aleksandr Tsvetkov,Александр Цветков,M,94.7,,,,,,,,,,,200,225,240,240,,240,100,D,Raw,No,Masters 60-64,60,1957-04-10
1,Kirill Kazantsev,Кирилл Казанцев,M,105.5,,,,,,,,,,,261,275,281,281,-285,281,110,D,Raw,No,Teen 18-19,19,1997-05-28
1,Konstantin Morozov #1,Константин Морозов,M,109.3,,,,,,,,,,,390,-400,,390,,390,110,D,Raw,No,Open,32,1984-10-23
2,Denis Degtyar,Денис Дегтярь,M,105.7,,,,,,,,,,,-305,315,-325,315,,315,110,D,Raw,No,Open,35,1981-06-24
3,Ruslaan Novikov,Руслаан Новиков,M,100.5,,,,,,,,,,,225,235,245,245,,245,110,D,Raw,No,Open,29,1988-01-11
DQ,Sergey Kudryavtsev,Сергей Кудрявцев,M,100.6,,,,,,,,,,,-260,,,,,,110,D,Raw,No,Open,33,1983-06-03
1,Valeriy Sytnikov,Валерий Сытников,M,110,,,,,,,,,,,245,265,-282.5,265,,265,110,D,Raw,No,Masters 45-49,47,1970-02-28
1,Artur Borisov,Артур Борисов,M,117.7,,,,,,,,,,,270,290,300,300,,300,125,D,Raw,No,Teen 18-19,19,1997-12-29
1,Maksim Surovov,Максим Суровов,M,124.7,,,,,,,,,,,-235,235,245,245,,245,125,D,Raw,No,Juniors 20-23,21,1996-02-02
1,Vladimir Marchenko,Владимир Марченко,M,123.5,,,,,,,,,,,-360,360,-365,360,,360,125,D,Raw,No,Open,32,1984-10-19
2,Ivan Chesnokov,Иван Чесноков,M,122.4,,,,,,,,,,,330,-335,-335,330,,330,125,D,Raw,No,Open,26,1990-08-08
3,Viktor Krylov,Виктор Крылов,M,123.6,,,,,,,,,,,310,320,-325,320,,320,125,D,Raw,No,Open,31,1985-05-20
4,Roman Kuznetsov #1,Роман Кузнецов,M,116.9,,,,,,,,,,,275,290,-295,290,,290,125,D,Raw,No,Open,35,1981-07-15
1,Aleksandr Bereznikov,Александр Березников,M,114.8,,,,,,,,,,,260,-270,-270,260,,260,125,D,Raw,No,Masters 50-54,53,1964-01-26
1,Oleg Livshits,Олег Лившиц,M,136.2,,,,,,,,,,,340,360,-375,360,,360,140,D,Raw,No,Open,43,1973-10-03
1,Alena Fedulova,Алена Федулова,F,58.7,,,,,,,,,,,110,120,125,125,,125,60,D,Raw,No,Open,26,1990-10-13
1,Anton Doronin,Антон Доронин,M,66.9,,,,,,,,,,,160,172.5,-177.5,172.5,,172.5,67.5,D,Raw,No,Open,25,1991-07-19
1,Aleksey Nikolaev,Алексей Николаев,M,81.2,,,,,,,,,,,270,285,-290,285,,285,82.5,D,Raw,No,Open,32,1984-11-17
1,Aleksandr Muratkin,Александр Мураткин,M,108.8,,,,,,,,,,,335,-355,-370,335,,335,110,D,Raw,No,Open,31,1985-08-29
1,Evgeniya Gulyaeva,Евгения Гуляева,F,48,,,,,,32.5,37.5,42.5,42.5,,,,,,,42.5,48,B,Raw,No,Teen 18-19,19,1997-11-04
1,Eva Merzon,Ева Мерзон,F,48,,,,,,30,-45,-45,30,,,,,,,30,48,B,Raw,No,Open,25,1991-10-10
1,Svetlana Belikova,Светлана Беликова,F,58.8,,,,,,27.5,30,-32.5,30,,,,,,,30,60,B,Raw,No,Masters 45-49,49,1968-02-10
1,Lyubov Potapova,Любовь Потапова,F,58.1,,,,,,20,22.5,25,25,,,,,,,25,60,B,Raw,No,Masters 60-64,62,1954-12-25
1,Anastasiya Nosacheva,Анастасия Носачева,F,65.5,,,,,,35,40,45,45,,,,,,,45,67.5,B,Raw,No,Teen 16-17,16,2000-05-25
1,Valentina Semenyuk,Валентина Семенюк,F,81.9,,,,,,20,22.5,25,25,,,,,,,25,82.5,B,Raw,No,Masters 60-64,64,1952-05-20
1,Elena Lebedeva,Елена Лебедева,F,83.5,,,,,,25,30,32.5,32.5,,,,,,,32.5,90,B,Raw,No,Masters 50-54,53,1963-06-29
1,Grigoriy Loshchinin,Григорий Лощинин,M,59.9,,,,,,75,77.5,-82.5,77.5,,,,,,,77.5,60,B,Raw,No,Open,25,1991-05-05
2,Egor Avershin,Егор Авершин,M,57.7,,,,,,40,47.5,-55,47.5,,,,,,,47.5,60,B,Raw,No,Open,26,1990-07-22
1,Aleksandr Shalaev,Александр Шалаев,M,65,,,,,,115,120,-125,120,,,,,,,120,67.5,B,Raw,No,Teen 16-17,16,2001-01-23
2,Aleksandr Andreev,Александр Андреев,M,62.9,,,,,,70,75,-80,75,,,,,,,75,67.5,B,Raw,No,Teen 13-15,14,2002-12-09
1,Vasiliy Bezborodov,Василий Безбородов,M,62.3,,,,,,75,80,-82.5,80,,,,,,,80,67.5,B,Raw,No,Juniors 20-23,23,1993-09-04
1,Pavel Varavin,Павел Варавин,M,66.3,,,,,,90,95,100,100,,,,,,,100,67.5,B,Raw,No,Open,34,1982-07-11
1,Evgeniy Kosarev,Евгений Косарев,M,64.2,,,,,,87.5,90,92.5,92.5,,,,,,,92.5,67.5,B,Raw,No,Masters 55-59,56,1961-03-29
1,Nikita Konstantinov,Никита Константинов,M,71.9,,,,,,85,90,95,95,,,,,,,95,75,B,Raw,No,Juniors 20-23,20,1996-12-14
1,Yakov Pastukh,Яков Пастух,M,70.3,,,,,,115,125,135,135,,,,,,,135,75,B,Raw,No,Open,38,1979-02-26
2,Aleksey Pachin,Алексей Пачин,M,71.2,,,,,,50,55,57.5,57.5,,,,,,,57.5,75,B,Raw,No,Open,38,1979-03-02
1,Nikolay Kudryashov,Николай Кудряшов,M,73.3,,,,,,65,70,-75,70,,,,,,,70,75,B,Raw,No,Masters 50-54,52,1965-02-20
1,Dmitriy Abdalov,Дмитрий Абдалов,M,78.5,,,,,,80,82.5,90,90,,,,,,,90,82.5,B,Raw,No,Open,28,1989-02-28
1,Georgiy Gvozdev,Георгий Гвоздев,M,79.3,,,,,,110,115,120,120,,,,,,,120,82.5,B,Raw,No,Masters 55-59,57,1959-04-26
1,Vyacheslav Grunichev,Вячеслав Груничев,M,76.2,,,,,,20,25,30,30,,,,,,,30,82.5,B,Raw,No,Masters 75-79,78,1939-04-11
1,Sergey Dyubkin,Сергей Дюбкин,M,87.5,,,,,,135,140,145,145,,,,,,,145,90,B,Raw,No,Open,35,1982-03-03
2,Aleksandr Veselov,Александр Веселов,M,86,,,,,,65,70,75,75,,,,,,,75,90,B,Raw,No,Open,26,1990-10-05
1,Aleksandr Lednev #1,Александр Леднев,M,87,,,,,,90,95,100,100,,,,,,,100,90,B,Raw,No,Masters 40-44,43,1973-05-02
1,Vyacheslav Vasyutin,Вячеслав Васютин,M,86.2,,,,,,40,50,52.5,52.5,,,,,,,52.5,90,B,Raw,No,Masters 50-54,53,1963-10-11
1,Sergey Kovalev,Сергей Ковалев,M,97.6,,,,,,110,115,120,120,,,,,,,120,100,B,Raw,No,Masters 45-49,47,1969-05-22
1,Vladimir Kuznetsov,Владимир Кузнецов,M,97.4,,,,,,55,60,70,70,,,,,,,70,100,B,Raw,No,Masters 70-74,72,1945-03-04
1,Stanislav Goryachev,Станислав Горячев,M,129.6,,,,,,182.5,192.5,-197.5,192.5,,,,,,,192.5,140,B,Raw,No,Open,41,1975-06-05
1,Konstantin Bogdanov,Константин Богданов,M,136.8,,,,,,185,195,200,200,,,,,,,200,140,B,Raw,No,Masters 40-44,40,1976-05-14
1,Tatyana Kovaleva,Татьяна Ковалева,F,48,,,,,,65,-67.5,-67.5,65,,,,,,,65,48,B,Raw,Yes,Juniors 20-23,23,1994-03-11
1,Tatyana Maslova,Татьяна Маслова,F,50.5,,,,,,-67.5,67.5,70,70,,,,,,,70,52,B,Raw,Yes,Open,31,1985-05-04
2,Yuliya Degtyaryova,Юлия Дегтярёва,F,50.5,,,,,,57.5,60,-62.5,60,,,,,,,60,52,B,Raw,Yes,Open,26,1990-09-08
3,Yuliya Tikhomirova,Юлия Тихомирова,F,51,,,,,,45,50,-52.5,50,,,,,,,50,52,B,Raw,Yes,Open,27,1989-09-12
1,Liliya Akhmedova,Лилия Ахмедова,F,55.8,,,,,,-65,67.5,72.5,72.5,,,,,,,72.5,56,B,Raw,Yes,Teen 16-17,17,1999-06-26
2,Natalya Markushina,Наталья Маркушина,F,55.3,,,,,,57.5,60,62.5,62.5,,,,,,,62.5,56,B,Raw,Yes,Teen 16-17,17,1999-08-06
3,Kristina Shikina,Кристина Шикина,F,53.6,,,,,,52.5,-55,-55,52.5,,,,,,,52.5,56,B,Raw,Yes,Teen 16-17,17,1999-07-16
1,Aleksandra Vedeneeva,Александра Веденеева,F,54.6,,,,,,62.5,67.5,-72.5,67.5,,,,,,,67.5,56,B,Raw,Yes,Open,32,1985-02-25
2,Yuliya Lokhmotkina,Юлия Лохмоткина,F,54.2,,,,,,60,62.5,65,65,,,,,,,65,56,B,Raw,Yes,Open,29,1987-07-27
3,Kseniya Pekhtereva,Ксения Пехтерева,F,54.3,,,,,,55,-60,-60,55,,,,,,,55,56,B,Raw,Yes,Open,34,1983-01-16
DQ,Oksana Dovzhenko,Оксана Довженко,F,54.4,,,,,,-72.5,-72.5,-72.5,,,,,,,,,56,B,Raw,Yes,Open,21,1996-03-17
DQ,Lyubov Efimtseva,Любовь Ефимцева,F,54.8,,,,,,-57.5,-60,-60,,,,,,,,,56,B,Raw,Yes,Open,36,1980-11-01
1,Vladislava Dluzhnevskaya,Владислава Длужневская,F,59.7,,,,,,100,-102.5,,100,,,,,,,100,60,B,Raw,Yes,Teen 16-17,16,2000-06-10
1,Olesya Shishkina,Олеся Шишкина,F,59.4,,,,,,-80,80,82.5,82.5,,,,,,,82.5,60,B,Raw,Yes,Juniors 20-23,22,1994-10-15
2,Anastasiya Gordeeva,Анастасия Гордеева,F,59.5,,,,,,40,-45,-47.5,40,,,,,,,40,60,B,Raw,Yes,Juniors 20-23,22,1995-01-20
1,Vladislava Dluzhnevskaya,Владислава Длужневская,F,59.7,,,,,,100,-102.5,,100,,,,,,,100,60,B,Raw,Yes,Open,16,2000-06-10
2,Olesya Shishkina,Олеся Шишкина,F,59.4,,,,,,-80,80,82.5,82.5,,,,,,,82.5,60,B,Raw,Yes,Open,22,1994-10-15
3,Svetlana Grigoreva,Светлана Григорьева,F,60,,,,,,70,-75,75,75,,,,,,,75,60,B,Raw,Yes,Open,34,1982-07-15
4,Elena Luchenetskaya,Елена Лученецкая,F,59.1,,,,,,65,67.5,-70,67.5,,,,,,,67.5,60,B,Raw,Yes,Open,39,1978-02-18
5,Ekaterina Mashkova,Екатерина Машкова,F,59.2,,,,,,-52.5,52.5,-57.5,52.5,,,,,,,52.5,60,B,Raw,Yes,Open,31,1985-09-09
DQ,Aleksandra Vasileva,Александра Васильева,F,62.4,,,,,,-50,-50,-50,,,,,,,,,67.5,B,Raw,Yes,Teen 16-17,16,2000-05-16
1,Yuliya Kuznetsova,Юлия Кузнецова,F,63.7,,,,,,-100,-102.5,107.5,107.5,,,,,,,107.5,67.5,B,Raw,Yes,Open,43,1973-05-15
DQ,Ekaterina Zharova,Екатерина Жарова,F,66,,,,,,-50,-50,-50,,,,,,,,,67.5,B,Raw,Yes,Open,31,1985-09-19
1,Evgeniya Stebeneva,Евгения Стебенева,F,73.5,,,,,,67.5,70,-72.5,70,,,,,,,70,75,B,Raw,Yes,Open,38,1978-05-05
2,Elena Yakovleva,Елена Яковлева,F,74.2,,,,,,60,62.5,-67.5,62.5,,,,,,,62.5,75,B,Raw,Yes,Open,26,1991-04-01
1,Zhanna Bolotova,Жанна Болотова,F,88,,,,,,-75,75,-80,75,,,,,,,75,90,B,Raw,Yes,Masters 50-54,51,1965-06-20
1,Egor Migunov,Егор Мигунов,M,54.1,,,,,,90,-97.5,-97.5,90,,,,,,,90,56,B,Raw,Yes,Teen 13-15,14,2002-11-26
1,Yuriy Murzin,Юрий Мурзин,M,58.2,,,,,,105,110,112.5,112.5,,,,,,,112.5,60,B,Raw,Yes,Teen 16-17,16,2000-06-15
2,Kirill Kulikov,Кирилл Куликов,M,57,,,,,,52.5,57.5,-60,57.5,,,,,,,57.5,60,B,Raw,Yes,Teen 13-15,14,2002-08-17
1,Rishat Yusupov,Ришат Юсупов,M,59,,,,,,90,97.5,-100,97.5,,,,,,,97.5,60,B,Raw,Yes,Open,27,1989-12-01
DD,Anton Grafov,Антон Графов,M,67.3,,,,,,160,165,170,170,,,,,,,,67.5,B,Raw,Yes,Juniors 20-23,20,1997-03-13
1,Igor Kuchin,Игорь Кучин,M,66.5,,,,,,135,142.5,145,145,,,,,,,145,67.5,B,Raw,Yes,Open,49,1967-06-11
2,Yuriy Voronov,Юрий Воронов,M,67.3,,,,,,135,142.5,145,145,,,,,,,145,67.5,B,Raw,Yes,Open,23,1993-04-22
3,Dmitriy Sidorkin,Дмитрий Сидоркин,M,66.9,,,,,,125,130,135,135,,,,,,,135,67.5,B,Raw,Yes,Open,24,1993-02-04
4,Stanislav Babiev,Станислав Бабиев,M,64.8,,,,,,-125,125,-130,125,,,,,,,125,67.5,B,Raw,Yes,Open,28,1988-10-14
1,Sergey Piyalkin,Сергей Пиялкин,M,62.4,,,,,,100,107.5,110,110,,,,,,,110,67.5,B,Raw,Yes,Masters 45-49,47,1970-04-14
1,Vazgen Baloyan,Вазген Балоян,M,74.1,,,,,,130,135,-140,135,,,,,,,135,75,B,Raw,Yes,Teen 16-17,16,2000-08-13
2,Arseniy Seregin,Арсений Серегин,M,70,,,,,,85,90,95,95,,,,,,,95,75,B,Raw,Yes,Teen 13-15,15,2002-04-17
DQ,Nikolay Sergeev,Николай Сергеев,M,73.4,,,,,,-115,-115,-117.5,,,,,,,,,75,B,Raw,Yes,Teen 18-19,19,1997-07-16
1,Kirill Bogdanov,Кирилл Богданов,M,74.5,,,,,,135,137.5,140,140,,,,,,,140,75,B,Raw,Yes,Juniors 20-23,21,1996-02-24
1,Denis Sokov,Денис Соков,M,73.9,,,,,,162.5,165,170,170,,,,,,,170,75,B,Raw,Yes,Open,31,1985-12-06
2,Vadim Peskov,Вадим Песков,M,69.6,,,,,,150,155,160,160,,,,,,,160,75,B,Raw,Yes,Open,24,1992-06-29
3,Davit Khambabyan,Давит Хамбабян,M,74.3,,,,,,135,137.5,-140,137.5,,,,,,,137.5,75,B,Raw,Yes,Open,27,1989-08-01
4,Andrey Veldin,Андрей Вельдин,M,72,,,,,,105,110,-117.5,110,,,,,,,110,75,B,Raw,Yes,Open,24,1992-07-06
1,Roman Vasilev,Роман Васильев,M,73.5,,,,,,155,160,162.5,162.5,,,,,,,162.5,75,B,Raw,Yes,Masters 40-44,44,1973-02-10
1,Sergey Sidorovskiy,Сергей Сидоровский,M,74.4,,,,,,122.5,127.5,-132.5,127.5,,,,,,,127.5,75,B,Raw,Yes,Masters 45-49,45,1971-05-12
1,Nikolay Obukhov,Николай Обухов,M,73.6,,,,,,100,-105,105,105,-107.5,,,,,,105,75,B,Raw,Yes,Masters 60-64,64,1953-04-02
1,Andrey Vdovin,Андрей Вдовин,M,82.3,,,,,,155,162.5,-165,162.5,,,,,,,162.5,82.5,B,Raw,Yes,Teen 18-19,18,1998-12-13
2,Mikhail Chugunov,Михаил Чугунов,M,80.7,,,,,,60,62.5,-65,62.5,,,,,,,62.5,82.5,B,Raw,Yes,Teen 13-15,14,2003-04-18
1,Aleksandr Balyasnikov,Александр Балясников,M,81.3,,,,,,-145,150,-155,150,,,,,,,150,82.5,B,Raw,Yes,Juniors 20-23,23,1993-07-20
1,Ilya Pankratov,Илья Панкратов,M,80.4,,,,,,200,-207.5,-207.5,200,,,,,,,200,82.5,B,Raw,Yes,Open,30,1986-12-09
2,Igor Shatilo,Игорь Шатило,M,82.2,,,,,,-160,160,-167.5,160,,,,,,,160,82.5,B,Raw,Yes,Open,28,1988-08-07
3,Dmitriy Nechaev,Дмитрий Нечаев,M,81.3,,,,,,150,155,-160,155,,,,,,,155,82.5,B,Raw,Yes,Open,34,1983-03-18
4,Aleksandr Balyasnikov,Александр Балясников,M,81.3,,,,,,-145,150,-155,150,,,,,,,150,82.5,B,Raw,Yes,Open,23,1993-07-20
5,Igor Doronin,Игорь Доронин,M,79,,,,,,120,127.5,130,130,,,,,,,130,82.5,B,Raw,Yes,Open,25,1991-05-09
6,Aleksey Goloborodko,Алексей Голобородько,M,78.8,,,,,,-107.5,-107.5,107.5,107.5,,,,,,,107.5,82.5,B,Raw,Yes,Open,36,1981-03-19
DQ,Maksim Valuevich,Максим Валуевич,M,81.5,,,,,,-140,-140,-140,,,,,,,,,82.5,B,Raw,Yes,Open,34,1982-09-23
1,Vyacheslav Troshinskiy,Вячеслав Трошинский,M,81.4,,,,,,120,130,140,140,,,,,,,140,82.5,B,Raw,Yes,Masters 55-59,56,1960-05-10
1,Anton Shuvaev,Антон Шуваев,M,89.7,,,,,,130,140,-145,140,,,,,,,140,90,B,Raw,Yes,Teen 18-19,19,1997-08-19
2,Denis Bondarenko,Денис Бондаренко,M,85,,,,,,-132.5,-137.5,137.5,137.5,,,,,,,137.5,90,B,Raw,Yes,Teen 18-19,19,1998-01-25
1,Ivan Nevzorov,Иван Невзоров,M,85.9,,,,,,-125,125,132.5,132.5,,,,,,,132.5,90,B,Raw,Yes,Juniors 20-23,21,1995-12-16
1,Maksim Fedoryuk,Максим Федорюк,M,88.5,,,,,,157.5,-165,175,175,,,,,,,175,90,B,Raw,Yes,Open,32,1984-06-15
2,Aleksandr Shuralev,Александр Шуралев,M,89,,,,,,165,172.5,175,175,,,,,,,175,90,B,Raw,Yes,Open,41,1975-07-13
3,Aleksey Sheykin,Алексей Шейкин,M,89.3,,,,,,160,-170,170,170,-175,,,,,,170,90,B,Raw,Yes,Open,29,1988-03-24
4,Aleksandr Ivanov,Александр Иванов,M,88.6,,,,,,-152.5,-152.5,152.5,152.5,,,,,,,152.5,90,B,Raw,Yes,Open,28,1988-06-02
5,Andrey Mikhaylov,Андрей Михайлов,M,89.4,,,,,,140,-155,-155,140,,,,,,,140,90,B,Raw,Yes,Open,33,1983-07-18
6,Ilya Kapin,Илья Капин,M,84.4,,,,,,115,122.5,-130,122.5,,,,,,,122.5,90,B,Raw,Yes,Open,35,1981-12-31
DQ,Stefan Tafara,Стефан Тафара,M,89.6,,,,,,-140,-142.5,-142.5,,,,,,,,,90,B,Raw,Yes,Open,30,1986-08-21
1,Aleksandr Shuralev,Александр Шуралев,M,89,,,,,,165,172.5,175,175,,,,,,,175,90,B,Raw,Yes,Masters 40-44,41,1975-07-13
1,Aleksey Kondakov,Алексей Кондаков,M,89.5,,,,,,152.5,160,162.5,162.5,,,,,,,162.5,90,B,Raw,Yes,Masters 45-49,46,1970-07-22
1,Vladimir Vasin,Владимир Васин,M,89.5,,,,,,125,135,-145,135,,,,,,,135,90,B,Raw,Yes,Masters 55-59,58,1958-11-04
1,Ilya Korshunkov,Илья Коршунков,M,99.1,,,,,,150,155,-162.5,155,,,,,,,155,100,B,Raw,Yes,Teen 18-19,19,1997-06-13
1,Aleksandr Kalyagin,Александр Калягин,M,99.5,,,,,,195,200,-205,200,,,,,,,200,100,B,Raw,Yes,Open,33,1983-06-12
2,Evgeniy Shalaev,Евгений Шалаев,M,95.1,,,,,,180,185,187.5,187.5,,,,,,,187.5,100,B,Raw,Yes,Open,31,1986-01-25
3,Maksim Volkov,Максим Волков,M,96.4,,,,,,175,-185,-185,175,,,,,,,175,100,B,Raw,Yes,Open,28,1989-02-07
4,Vasiliy Zharkov,Василий Жарков,M,96.3,,,,,,162.5,167.5,172.5,172.5,,,,,,,172.5,100,B,Raw,Yes,Open,37,1979-05-01
5,Aleksandr Anosov,Александр Аносов,M,96,,,,,,-130,140,150,150,,,,,,,150,100,B,Raw,Yes,Open,27,1989-10-07
6,Denis Yudin,Денис Юдин,M,96.1,,,,,,125,-140,-140,125,,,,,,,125,100,B,Raw,Yes,Open,33,1983-07-08
1,Sergey Volkov,Сергей Волков,M,98,,,,,,150,-155,-155,150,,,,,,,150,100,B,Raw,Yes,Masters 40-44,43,1973-06-01
1,Andrey Makevnin,Андрей Макевнин,M,94.5,,,,,,145,150,160,160,,,,,,,160,100,B,Raw,Yes,Masters 55-59,55,1961-05-18
2,Sergey Mukhtarov,Сергей Мухтаров,M,98.6,,,,,,150,-157.5,-157.5,150,,,,,,,150,100,B,Raw,Yes,Masters 55-59,56,1961-02-17
3,Boris Kozhin,Борис Кожин,M,96.7,,,,,,120,125,132.5,132.5,,,,,,,132.5,100,B,Raw,Yes,Masters 55-59,56,1960-05-03
1,Vladimir Marinin,Владимир Маринин,M,98.7,,,,,,180,185,190,190,-192.5,,,,,,190,100,B,Raw,Yes,Masters 60-64,64,1952-08-30
1,Evgeniy Kozharinov,Евгений Кожаринов,M,98.8,,,,,,120,125,127.5,127.5,,,,,,,127.5,100,B,Raw,Yes,Masters 70-74,71,1945-11-04
1,Ilya Karpov,Илья Карпов,M,109.5,,,,,,187.5,197.5,200,200,,,,,,,200,110,B,Raw,Yes,Juniors 20-23,23,1993-06-29
2,Aleksandr Demichev,Александр Демичев,M,108.7,,,,,,162.5,-167.5,-167.5,162.5,,,,,,,162.5,110,B,Raw,Yes,Juniors 20-23,23,1993-09-26
1,Denis Malchikov,Денис Мальчиков,M,107,,,,,,215,225,-232.5,225,,,,,,,225,110,B,Raw,Yes,Open,36,1980-06-12
2,Artem Vorontsov,Артем Воронцов,M,109.8,,,,,,-205,205,-215,205,,,,,,,205,110,B,Raw,Yes,Open,40,1976-08-03
3,Anatoliy Ryzhkov,Анатолий Рыжков,M,108.9,,,,,,190,195,202.5,202.5,,,,,,,202.5,110,B,Raw,Yes,Open,32,1984-06-20
4,Ilya Karpov,Илья Карпов,M,109.5,,,,,,187.5,197.5,200,200,,,,,,,200,110,B,Raw,Yes,Open,23,1993-06-29
5,Mikhail Andreev,Михаил Андреев,M,107.5,,,,,,185,195,-202.5,195,,,,,,,195,110,B,Raw,Yes,Open,27,1989-04-21
6,Pavel Zhukov,Павел Жуков,M,101.1,,,,,,147.5,155,162.5,162.5,,,,,,,162.5,110,B,Raw,Yes,Open,35,1982-03-17
7,Igor Frolov,Игорь Фролов,M,107.3,,,,,,140,147.5,155,155,,,,,,,155,110,B,Raw,Yes,Open,24,1992-12-27
8,Nikolay Karasev,Николай Карасев,M,106.2,,,,,,-140,147.5,-155,147.5,,,,,,,147.5,110,B,Raw,Yes,Open,28,1989-03-14
1,Artem Vorontsov,Артем Воронцов,M,109.8,,,,,,-205,205,-215,205,,,,,,,205,110,B,Raw,Yes,Masters 40-44,40,1976-08-03
2,Sergey Korytko,Сергей Корытко,M,104.6,,,,,,180,185,192.5,192.5,,,,,,,192.5,110,B,Raw,Yes,Masters 40-44,44,1973-01-17
3,Nikolay Sorokin,Николай Сорокин,M,103.6,,,,,,162.5,165,-167.5,165,,,,,,,165,110,B,Raw,Yes,Masters 40-44,40,1976-08-18
1,Pavel Bukhantsev,Павел Буханцев,M,108,,,,,,167.5,175,-177.5,175,,,,,,,175,110,B,Raw,Yes,Masters 45-49,47,1969-08-02
2,Roman Maksimov,Роман Максимов,M,107.2,,,,,,150,160,167.5,167.5,,,,,,,167.5,110,B,Raw,Yes,Masters 45-49,47,1969-06-08
1,Igor Kurotchenko,Игорь Куротченко,M,108.6,,,,,,140,150,157.5,157.5,,,,,,,157.5,110,B,Raw,Yes,Masters 55-59,55,1962-03-20
1,Dmitriy Nenartovich,Дмитрий Ненартович,M,113,,,,,,190,200,-205,200,,,,,,,200,125,B,Raw,Yes,Open,29,1987-12-21
2,Aleksey Lebed,Алексей Лебедь,M,115,,,,,,195,,,195,,,,,,,195,125,B,Raw,Yes,Open,27,1989-07-28
3,Aleksey Shaubert,Алексей Шауберт,M,120.5,,,,,,135,152.5,-160,152.5,,,,,,,152.5,125,B,Raw,Yes,Open,33,1983-11-02
DQ,Nikolay Rudenko,Николай Руденко,M,119.9,,,,,,-202.5,-202.5,-202.5,,,,,,,,,125,B,Raw,Yes,Open,34,1982-10-27
1,Vladimir Chubarov,Владимир Чубаров,M,122.7,,,,,,165,172.5,-177.5,172.5,,,,,,,172.5,125,B,Raw,Yes,Masters 50-54,53,1964-04-03
1,Konstantin Bogdanov,Константин Богданов,M,136.8,,,,,,185,192.5,197.5,197.5,,,,,,,197.5,140,B,Raw,Yes,Masters 40-44,40,1976-05-14
1,Vladimir Popov,Владимир Попов,M,127.2,,,,,,165,170,172.5,172.5,,,,,,,172.5,140,B,Raw,Yes,Masters 60-64,61,1956-02-26
1,Sergey Kurakov,Сергей Кураков,M,146.6,,,,,,165,172.5,180,180,,,,,,,180,140+,B,Raw,Yes,Open,46,1971-04-16
1,Sergey Kurakov,Сергей Кураков,M,146.6,,,,,,165,172.5,180,180,,,,,,,180,140+,B,Raw,Yes,Masters 45-49,46,1971-04-16
DQ,Tatyana Lazukova,Татьяна Лазукова,F,55.6,,,,,,-60,,,,,,,,,,,56,B,Single-ply,Yes,Masters 50-54,53,1963-08-13
1,Anastasiya Sklyadneva,Анастасия Скляднева,F,58.1,,,,,,-70,70,72.5,72.5,,,,,,,72.5,60,B,Single-ply,Yes,Open,29,1988-03-12
1,Yuliya Kuznetsova,Юлия Кузнецова,F,63.7,,,,,,130,-137.5,-137.5,130,,,,,,,130,67.5,B,Single-ply,Yes,Open,43,1973-05-15
1,Igor Kuchin,Игорь Кучин,M,66.5,,,,,,-170,175,180,180,,,,,,,180,67.5,B,Single-ply,Yes,Open,49,1967-06-11
DD,Sergey Chugurov,Сергей Чугуров,M,75,,,,,,200,210,-220,210,,,,,,,,75,B,Single-ply,Yes,Open,23,1993-06-22
1,Vladimir Konchakov,Владимир Кончаков,M,89.9,,,,,,240,250,260,260,,,,,,,260,90,B,Single-ply,Yes,Open,43,1973-05-25
2,Vladislav Khadzhiev,Владислав Хаджиев,M,88.3,,,,,,235,245,-250,245,,,,,,,245,90,B,Single-ply,Yes,Open,25,1991-04-30
1,Vladimir Konchakov,Владимир Кончаков,M,89.9,,,,,,240,250,260,260,,,,,,,260,90,B,Single-ply,Yes,Masters 40-44,43,1973-05-25
1,Artur Cheremisin,Артур Черемисин,M,99.4,,,,,,220,230,240,240,242.5,,,,,,240,100,B,Single-ply,Yes,Open,27,1989-11-29
2,Timur Akhmetov,Тимур Ахметов,M,98.7,,,,,,190,-200,-200,190,,,,,,,190,100,B,Single-ply,Yes,Open,30,1986-11-17
1,Mikhail Antsiferov,Михаил Анциферов,M,107.2,,,,,,240,250,-265,250,,,,,,,250,110,B,Single-ply,Yes,Open,35,1981-07-02
1,Mikhail Gorelov,Михаил Горелов,M,108.7,,,,,,-230,240,-262.5,240,,,,,,,240,110,B,Single-ply,Yes,Masters 40-44,41,1976-02-03
1,Vladimir Popov,Владимир Попов,M,127.2,,,,,,190,-200,-200,190,,,,,,,190,140,B,Single-ply,Yes,Masters 60-64,61,1956-02-26
1,Olga Turkovskaya,Ольга Турковская,F,71.3,,,,,,45,50,-52.5,50,,,,,,,50,75,B,Raw,No,Masters 45-49,49,1967-06-05
1,Roman Belousov,Роман Белоусов,M,54.9,,,,,,155,160,-165,160,,,,,,,160,56,B,Raw,No,Open,25,1991-10-19
1,Aleksandr Yastrebov,Александр Ястребов,M,59.6,,,,,,52.5,57.5,62.5,62.5,,,,,,,62.5,60,B,Raw,No,Teen 13-15,14,2002-12-21
1,Vladimir Osipov,Владимир Осипов,M,59.6,,,,,,125,135,-140,135,,,,,,,135,60,B,Raw,No,Open,31,1985-10-27
1,Artur Belous,Артур Белоус,M,74.2,,,,,,205,210,-215,210,,,,,,,210,75,B,Raw,No,Open,31,1985-04-23
2,Maksim Bogdanov,Максим Богданов,M,73.9,,,,,,185,190,-195,190,,,,,,,190,75,B,Raw,No,Open,24,1992-10-12
1,Vladimir Bazarov,Владимир Базаров,M,68.3,,,,,,-110,115,-120,115,,,,,,,115,75,B,Raw,No,Masters 50-54,51,1965-06-22
1,Aleksandr Ilenko,Александр Ильенко,M,77,,,,,,145,152.5,160,160,,,,,,,160,82.5,B,Raw,No,Juniors 20-23,21,1996-03-23
1,Maksim Pytkin,Максим Пыткин,M,79.8,,,,,,180,-185,185,185,,,,,,,185,82.5,B,Raw,No,Open,25,1992-03-30
2,Artyom Vereshchagin,Артём Верещагин,M,81.6,,,,,,155,160,165,165,,,,,,,165,82.5,B,Raw,No,Open,28,1988-09-17
3,Konstantin Azizmamadov,Константин Азизмамадов,M,82.2,,,,,,150,-160,-160,150,,,,,,,150,82.5,B,Raw,No,Open,32,1985-03-17
1,Andrey Mitrochenko,Андрей Митроченко,M,81.2,,,,,,147.5,-155,155,155,,,,,,,155,82.5,B,Raw,No,Masters 40-44,40,1976-11-19
DQ,Vadim Kolodyazhnyy,Вадим Колодяжный,M,81.2,,,,,,-155,-160,-165,,,,,,,,,82.5,B,Raw,No,Masters 45-49,47,1969-06-05
1,Vyacheslav Dobrazhanskiy,Вячеслав Дображанский,M,79.3,,,,,,80,85,90,90,,,,,,,90,82.5,B,Raw,No,Masters 80+,83,1934-02-22
1,Aleksey Belov,Алексей Белов,M,87.3,,,,,,160,167.5,175,175,,,,,,,175,90,B,Raw,No,Juniors 20-23,22,1994-07-14
2,Maksim Shirkov,Максим Ширков,M,87.5,,,,,,165,170,-172.5,170,,,,,,,170,90,B,Raw,No,Juniors 20-23,23,1993-05-24
3,Timofey Savchenko,Тимофей Савченко,M,88.5,,,,,,-170,-170,170,170,,,,,,,170,90,B,Raw,No,Juniors 20-23,23,1993-10-13
4,Mikhail Sakaev,Михаил Сакаев,M,88.4,,,,,,145,150,-155,150,,,,,,,150,90,B,Raw,No,Juniors 20-23,23,1994-01-22
1,Andrey Sapozhonkov,Андрей Сапожонков,M,83.7,,,,,,240,245,-256,245,,,,,,,245,90,B,Raw,No,Open,29,1987-06-26
2,Aleksey Prokudin,Алексей Прокудин,M,88.1,,,,,,210,225,-235,225,,,,,,,225,90,B,Raw,No,Open,35,1981-11-05
3,Aleksandr Grunev,Александр Грунев,M,89,,,,,,175,185,-192.5,185,,,,,,,185,90,B,Raw,No,Open,27,1990-02-08
4,Sergey Maksimov,Сергей Максимов,M,89.8,,,,,,170,180,185,185,,,,,,,185,90,B,Raw,No,Open,27,1989-07-26
5,Maksim Shirkov,Максим Ширков,M,87.5,,,,,,165,170,-172.5,170,,,,,,,170,90,B,Raw,No,Open,23,1993-05-24
DQ,Konstantin Skobkin,Константин Скобкин,M,89.4,,,,,,-180,-185,-185,,,,,,,,,90,B,Raw,No,Open,34,1983-03-18
1,Vladislav Volchanov,Владислав Волчанов,M,88.3,,,,,,170,-180,180,180,,,,,,,180,90,B,Raw,No,Masters 40-44,41,1975-10-31
1,Sergey Bazanov,Сергей Базанов,M,86.9,,,,,,160,167.5,170,170,172.5,,,,,,170,90,B,Raw,No,Masters 50-54,54,1962-06-22
2,Sergey Petrushenko,Сергей Петрушенко,M,83.8,,,,,,130,135,-140,135,,,,,,,135,90,B,Raw,No,Masters 50-54,52,1965-01-28
1,Gennadiy Sorokin,Геннадий Сорокин,M,88.9,,,,,,135,140,147.5,147.5,,,,,,,147.5,90,B,Raw,No,Masters 55-59,57,1959-09-08
1,Maksim Medvedev,Максим Медведев,M,97.2,,,,,,185,200,207.5,207.5,,,,,,,207.5,100,B,Raw,No,Open,35,1981-05-16
2,Ilya Brusov,Илья Брусов,M,95.4,,,,,,170,-185,190,190,,,,,,,190,100,B,Raw,No,Open,38,1978-07-17
3,Ivan Solntsev,Иван Солнцев,M,98.6,,,,,,190,-200,-200,190,,,,,,,190,100,B,Raw,No,Open,43,1974-03-25
4,Artem Elfimov,Артем Елфимов,M,92.5,,,,,,177.5,185,-190,185,,,,,,,185,100,B,Raw,No,Open,24,1993-02-04
5,Dmitriy Lepekhov,Дмитрий Лепехов,M,98,,,,,,170,-185,-190,170,,,,,,,170,100,B,Raw,No,Open,28,1989-01-10
6,Kirill Emelyanov,Кирилл Емельянов,M,91.9,,,,,,140,155,-160,155,,,,,,,155,100,B,Raw,No,Open,31,1985-06-02
1,Aleksey Kovrigin,Алексей Ковригин,M,99.6,,,,,,190,195,197.5,197.5,,,,,,,197.5,100,B,Raw,No,Masters 40-44,41,1975-08-18
2,Ivan Solntsev,Иван Солнцев,M,98.6,,,,,,190,-200,-200,190,,,,,,,190,100,B,Raw,No,Masters 40-44,43,1974-03-25
3,Sergey Ukhanov,Сергей Уханов,M,98.8,,,,,,-190,190,-195,190,,,,,,,190,100,B,Raw,No,Masters 40-44,42,1974-05-23
4,Nodar Tsutskiridze,Нодар Цуцкиридзе,M,94.2,,,,,,150,155,-160,155,,,,,,,155,100,B,Raw,No,Masters 40-44,40,1976-09-14
5,Sergey Belyshev,Сергей Белышев,M,97.7,,,,,,-150,-150,150,150,,,,,,,150,100,B,Raw,No,Masters 40-44,41,1975-09-19
1,Aleksandr Shabalin,Александр Шабалин,M,97.7,,,,,,130,-140,140,140,,,,,,,140,100,B,Raw,No,Masters 45-49,45,1971-09-07
1,Igor Zavalnyuk,Игорь Завальнюк,M,94.1,,,,,,135,145,150,150,,,,,,,150,100,B,Raw,No,Masters 50-54,53,1964-03-21
1,Nikita Gubenskiy,Никита Губенский,M,108,,,,,,205,212.5,-220,212.5,,,,,,,212.5,110,B,Raw,No,Juniors 20-23,22,1995-04-06
2,Sergey Bulat,Сергей Булат,M,108.2,,,,,,150,-160,-160,150,,,,,,,150,110,B,Raw,No,Juniors 20-23,22,1995-02-24
1,Ibragim Ilkhasan,Ібрагім Ільхасан,M,107.5,,,,,,250,-260,260,260,-265,,,,,,260,110,B,Raw,No,Open,27,1989-06-21
2,Evgeniy Filatov,Евгений Филатов,M,107.8,,,,,,230,250,255,255,,,,,,,255,110,B,Raw,No,Open,35,1981-10-15
3,Andrey Nikonorov,Андрей Никоноров,M,108.6,,,,,,230,240,250,250,,,,,,,250,110,B,Raw,No,Open,41,1975-10-26
4,Aleksand Zhachenkov,Александ Жаченков,M,109.4,,,,,,235,245,-260,245,,,,,,,245,110,B,Raw,No,Open,35,1981-07-30
5,Evgeniy Bondarenko,Евгений Бондаренко,M,103.9,,,,,,-210,220,227.5,227.5,,,,,,,227.5,110,B,Raw,No,Open,31,1985-09-21
6,Evgeniy Efimov,Евгений Ефимов,M,104.3,,,,,,187.5,192.5,195,195,,,,,,,195,110,B,Raw,No,Open,29,1987-08-03
7,Nikita Taranin,Никита Таранин,M,104.5,,,,,,182.5,-192.5,192.5,192.5,,,,,,,192.5,110,B,Raw,No,Open,28,1989-04-05
8,Viktor Pavlov,Виктор Павлов,M,106.9,,,,,,192.5,-197.5,-197.5,192.5,,,,,,,192.5,110,B,Raw,No,Open,28,1988-04-25
1,Evgeniy Aleksandrov,Евгений Александров,M,108.8,,,,,,195,202.5,-205,202.5,,,,,,,202.5,110,B,Raw,No,Masters 40-44,42,1974-12-28
2,Denis Puzyrev,Денис Пузырев,M,109.3,,,,,,-187.5,190,-192.5,190,,,,,,,190,110,B,Raw,No,Masters 40-44,43,1974-03-31
1,Andrey Lukyanov,Андрей Лукьянов,M,109.9,,,,,,162.5,170,,170,,,,,,,170,110,B,Raw,No,Masters 45-49,48,1969-01-29
1,Igor Rybalchenko,Игорь Рыбальченко,M,105.9,,,,,,160,170,-175,170,,,,,,,170,110,B,Raw,No,Masters 50-54,51,1966-03-22
1,Dmitriy Kostin,Дмитрий Костин,M,123.9,,,,,,-235,235,-240,235,,,,,,,235,125,B,Raw,No,Open,31,1985-09-13
2,Dmitriy Bubnov,Дмитрий Бубнов,M,124.8,,,,,,200,215,-222.5,215,,,,,,,215,125,B,Raw,No,Open,43,1973-10-14
3,Andrey Zhukov,Андрей Жуков,M,122.6,,,,,,200,210,-215,210,,,,,,,210,125,B,Raw,No,Open,41,1976-03-02
1,Dmitriy Bubnov,Дмитрий Бубнов,M,124.8,,,,,,200,215,-222.5,215,,,,,,,215,125,B,Raw,No,Masters 40-44,43,1973-10-14
1,Andrey Vysotskiy,Андрей Высоцкий,M,128.2,,,,,,200,210,-215,210,,,,,,,210,140,B,Raw,No,Open,39,1977-11-19
1,Arif Makhmudov,Ариф Махмудов,M,132.8,,,,,,190,200,210,210,,,,,,,210,140,B,Raw,No,Masters 50-54,54,1962-07-31
1,Sergey Lazarev,Сергей Лазарев,M,154.1,,,,,,140,150,,150,,,,,,,150,140+,B,Raw,No,Open,57,1960-04-04
1,Sergey Lazarev,Сергей Лазарев,M,154.1,,,,,,140,150,,150,,,,,,,150,140+,B,Raw,No,Masters 55-59,57,1960-04-04
1,Oksana Kuznetsova,Оксана Кузнецова,F,55.8,,,,,,100,-107.5,-107.5,100,,,,,,,100,56,B,Single-ply,No,Open,26,1990-07-07
1,Roman Belousov,Роман Белоусов,M,54.9,,,,,,185,190,-195,190,,,,,,,190,56,B,Single-ply,No,Open,25,1991-10-19
1,Ilya Kokorev,Илья Кокорев,M,77.8,,,,,,210,-220,-240,210,,,,,,,210,82.5,B,Single-ply,No,Open,44,1973-01-19
2,Aleksandr Ilyukhin,Александр Илюхин,M,81.2,,,,,,125,135,-140,135,,,,,,,135,82.5,B,Single-ply,No,Open,30,1986-07-22
1,Ilya Kokorev,Илья Кокорев,M,77.8,,,,,,210,-220,-240,210,,,,,,,210,82.5,B,Single-ply,No,Masters 40-44,44,1973-01-19
1,Pavel Silushin,Павел Силушин,M,84.8,,,,,,245,255,265,265,,,,,,,265,90,B,Single-ply,No,Open,27,1989-09-17
1,Sergey Strilchuk,Сергей Стрильчук,M,97.6,,,,,,260,275,285,285,,,,,,,285,100,B,Single-ply,No,Open,30,1987-04-02
2,Ivan Solntsev,Иван Солнцев,M,98.6,,,,,,240,255,-265,255,,,,,,,255,100,B,Single-ply,No,Open,43,1974-03-25
1,Ivan Solntsev,Иван Солнцев,M,98.6,,,,,,240,255,-265,255,,,,,,,255,100,B,Single-ply,No,Masters 40-44,43,1974-03-25
1,Oleg Nagaytsev,Олег Нагайцев,M,103,,,,,,225,232.5,242.5,242.5,,,,,,,242.5,110,B,Single-ply,No,Open,30,1987-03-19
2,Aleksandr Muratkin,Александр Мураткин,M,108.8,,,,,,235,242.5,-247.5,242.5,,,,,,,242.5,110,B,Single-ply,No,Open,31,1985-08-29
3,Eduard Abdyushev,Эдуард Абдюшев,M,108.9,,,,,,-225,-225,225,225,,,,,,,225,110,B,Single-ply,No,Open,62,1955-03-02
1,Eduard Abdyushev,Эдуард Абдюшев,M,108.9,,,,,,-225,-225,225,225,,,,,,,225,110,B,Single-ply,No,Masters 60-64,62,1955-03-02
1,Aleksandr Lugovoy,Александр Луговой,M,122.5,,,,,,245,260,270,270,,,,,,,270,125,B,Single-ply,No,Juniors 20-23,21,1995-10-28
1,Vladimir Sibalakov,Владимир Сибалаков,M,116.3,,,,,,280,300,320,320,,,,,,,320,125,B,Single-ply,No,Open,35,1981-07-05
2,Aleksey Fedyaev,Алексей Федяев,M,112,,,,,,275,-280,-280,275,,,,,,,275,125,B,Single-ply,No,Open,40,1976-07-02
3,Konstantin Kryzhanovskiy,Константин Крыжановский,M,114.7,,,,,,260,-270,270,270,,,,,,,270,125,B,Single-ply,No,Open,42,1975-03-14
1,Aleksey Fedyaev,Алексей Федяев,M,112,,,,,,275,-280,-280,275,,,,,,,275,125,B,Single-ply,No,Masters 40-44,40,1976-07-02
2,Oleg Mordvintsev,Олег Мордвинцев,M,112.7,,,,,,215,225,-247.5,225,,,,,,,225,125,B,Single-ply,No,Masters 40-44,44,1973-03-21
1,Ekaterina Zaytseva,Екатерина Зайцева,F,76.2,,,,,,-165,175,185,185,-190,,,,,,185,82.5,B,Multi-ply,No,Open,30,1987-02-12
1,Ilya Kokorev,Илья Кокорев,M,77.8,,,,,,210,-220,-240,210,,,,,,,210,82.5,B,Multi-ply,No,Open,44,1973-01-19
1,Ilya Kokorev,Илья Кокорев,M,77.8,,,,,,210,-220,-240,210,,,,,,,210,82.5,B,Multi-ply,No,Masters 40-44,44,1973-01-19
1,Andrey Paley,Андрей Палей,M,99.8,,,,,,290,-300,-300,290,,,,,,,290,100,B,Multi-ply,No,Open,55,1961-10-11
1,Aleksandr Rystsov,Александр Рысцов,M,108.9,,,,,,265,-270,-270,265,,,,,,,265,110,B,Multi-ply,No,Open,37,1979-12-02
1,Ivan Polyakov,Иван Поляков,M,114.8,,,,,,-190,200,210,210,,,,,,,210,125,B,Multi-ply,No,Masters 40-44,42,1974-12-25
1,Natalya Knyazeva,Наталья Князева,F,59.2,,,,,,60,70,-77.5,70,,,,,,,70,60,B,Multi-ply,No,Masters 45-49,46,1970-07-16
1,Aleksandr Ilyukhin,Александр Илюхин,M,81.2,,,,,,125,140,152.5,152.5,,,,,,,152.5,82.5,B,Multi-ply,No,Open,30,1986-07-22
1,Mikhail Smorodin,Михаил Смородин,M,88.7,,,,,,230,-252.5,-252.5,230,,,,,,,230,90,B,Multi-ply,No,Open,36,1980-07-13
2,Rafael Babaev,Рафаэль Бабаев,M,89.4,,,,,,210,-230,-230,210,,,,,,,210,90,B,Multi-ply,No,Open,33,1983-09-02
3,Yulian Lymar,Юлиан Лымарь,M,89.8,,,,,,190,205,-212.5,205,,,,,,,205,90,B,Multi-ply,No,Open,33,1984-03-24
1,Viktor Garanin,Виктор Гаранин,M,92.4,,,,,,-212.5,-212.5,212.5,212.5,,,,,,,212.5,100,B,Multi-ply,No,Juniors 20-23,22,1994-07-15
1,Pavel Leonov,Павел Леонов,M,98.5,,,,,,380,392.5,-400,392.5,,,,,,,392.5,100,B,Multi-ply,No,Open,33,1983-11-08
2,Vladimir Petrov,Владимир Петров,M,99.7,,,,,,250,265,280,280,,,,,,,280,100,B,Multi-ply,No,Open,25,1991-08-01
3,Oleg Smirnov,Олег Смирнов,M,99.2,,,,,,240,250,260,260,,,,,,,260,100,B,Multi-ply,No,Open,31,1986-01-22
4,Aleksandr Zhiltsov,Александр Жильцов,M,99.6,,,,,,235,240,-245,240,,,,,,,240,100,B,Multi-ply,No,Open,32,1985-04-04
5,Sergey Muratov,Сергей Муратов,M,98.9,,,,,,-215,-215,215,215,,,,,,,215,100,B,Multi-ply,No,Open,34,1982-08-09
DQ,Aleksey Melnikov,Алексей Мельников,M,96.3,,,,,,-325,-325,,,,,,,,,,100,B,Multi-ply,No,Open,29,1987-10-22
1,Igor Zavalnyuk,Игорь Завальнюк,M,94.1,,,,,,200,-230,,200,,,,,,,200,100,B,Multi-ply,No,Masters 50-54,53,1964-03-21
1,Yuriy Molchanov,Юрий Молчанов,M,98.6,,,,,,120,-135,-140,120,,,,,,,120,100,B,Multi-ply,No,Masters 65-69,65,1951-12-08
1,Nikita Gubenskiy,Никита Губенский,M,108,,,,,,290,-305,,290,,,,,,,290,110,B,Multi-ply,No,Juniors 20-23,22,1995-04-06
1,Evgeniy Filatov,Евгений Филатов,M,107.8,,,,,,330,350,-355,350,,,,,,,350,110,B,Multi-ply,No,Open,35,1981-10-15
2,Dmitriy Vasilenko,Дмитрий Василенко,M,106.1,,,,,,310,332.5,340,340,-350,,,,,,340,110,B,Multi-ply,No,Open,41,1975-06-03
3,Mikhail Tsatsulin,Михаил Цацулин,M,108.3,,,,,,-300,312.5,332.5,332.5,,,,,,,332.5,110,B,Multi-ply,No,Open,29,1988-01-13
4,Andrey Imenev,Андрей Именьев,M,105.1,,,,,,250,270,-287.5,270,,,,,,,270,110,B,Multi-ply,No,Open,27,1989-07-02
DQ,Sergey Molchanov,Сергей Молчанов,M,107.3,,,,,,-315,-315,-332.5,,,,,,,,,110,B,Multi-ply,No,Open,44,1973-03-15
DQ,Evgeniy Spirkin,Евгений Спиркин,M,108.9,,,,,,-315,-315,,,,,,,,,,110,B,Multi-ply,No,Open,29,1987-11-14
1,Dmitriy Vasilenko,Дмитрий Василенко,M,106.3,,,,,,310,332.5,340,340,-350,,,,,,340,110,B,Multi-ply,No,Masters 40-44,41,1975-06-03
1,Artur Borisov,Артур Борисов,M,117.7,,,,,,240,-255,-255,240,,,,,,,240,125,B,Multi-ply,No,Teen 18-19,19,1997-12-29
1,Anton Begalko,Антон Бегалко,M,113.2,,,,,,340,-360,360,360,-380,,,,,,360,125,B,Multi-ply,No,Open,30,1986-11-06
2,Roman Yurasov,Роман Юрасов,M,118.2,,,,,,320,340,-352.5,340,,,,,,,340,125,B,Multi-ply,No,Open,41,1976-03-16
1,Viktor Fursov,Виктор Фурсов,M,121.3,,,,,,320,-340,352.5,352.5,,,,,,,352.5,125,B,Multi-ply,No,Masters 40-44,42,1974-05-09
2,Roman Yurasov,Роман Юрасов,M,118.2,,,,,,320,340,-352.5,340,,,,,,,340,125,B,Multi-ply,No,Masters 40-44,41,1976-03-16
3,Sharof Azimov,Шароф Азимов,M,120.4,,,,,,220,235,250,250,,,,,,,250,125,B,Multi-ply,No,Masters 40-44,44,1972-10-15
1,Sergey Nakonechnyy,Сергей Наконечный,M,128.5,,,,,,290,320,352.5,352.5,,,,,,,352.5,140,B,Multi-ply,No,Open,30,1986-11-04
2,Andrey Inyutin,Андрей Инютин,M,131,,,,,,290,300,-310,300,,,,,,,300,140,B,Multi-ply,No,Open,41,1975-05-18
1,Maksim Tsukanov,Максим Цуканов,M,146.8,,,,,,315,335,345,345,,,,,,,345,140+,B,Multi-ply,No,Open,36,1980-12-09
2,Sergey Lazarev,Сергей Лазарев,M,154.1,,,,,,190,210,-220,210,,,,,,,210,140+,B,Multi-ply,No,Open,57,1960-04-04
1,Sergey Lazarev,Сергей Лазарев,M,154.1,,,,,,190,210,-220,210,,,,,,,210,140+,B,Multi-ply,No,Masters 55-59,57,1960-04-04
1,Anna Vishnyak,Анна Вишняк,F,55,,,,,,-102.5,-107.5,107.5,107.5,,,,,,,107.5,56,B,Multi-ply,Yes,Open,32,1984-12-12
2,Irina Bryukhanova,Ирина Брюханова,F,54.2,,,,,,90,-100,100,100,,,,,,,100,56,B,Multi-ply,Yes,Open,32,1984-12-06
1,Yuliya Kupriyanova,Юлия Куприянова,F,59.3,,,,,,-70,70,80,80,,,,,,,80,60,B,Multi-ply,Yes,Open,24,1993-02-08
1,Irina Vasilenko,Ирина Василенко,F,66.3,,,,,,70,80,-90,80,,,,,,,80,67.5,B,Multi-ply,Yes,Open,34,1982-08-16
1,Svetlana Maletskaya,Светлана Малецкая,F,71.3,,,,,,120,125,-132.5,125,,,,,,,125,75,B,Multi-ply,Yes,Open,33,1983-06-04
2,Alina Drobysh,Алина Дробыш,F,72.4,,,,,,-85,85,-95,85,,,,,,,85,75,B,Multi-ply,Yes,Open,26,1990-09-24
1,Veronika Ukolova,Вероника Уколова,F,123.7,,,,,,115,-125,,115,,,,,,,115,90+,B,Multi-ply,Yes,Open,19,1997-06-17
1,Egor Kuzichev,Егор Кузичев,M,73.6,,,,,,-160,160,170,170,175,,,,,,170,75,B,Multi-ply,Yes,Juniors 20-23,21,1995-10-17
1,Ilya Varshavskiy,Илья Варшавский,M,74.2,,,,,,240,-250,250,250,,,,,,,250,75,B,Multi-ply,Yes,Open,25,1991-11-03
2,Maksim Pavlov,Максим Павлов,M,75,,,,,,185,212.5,-250,212.5,,,,,,,212.5,75,B,Multi-ply,Yes,Open,30,1986-04-26
1,Rinat Khuzin,Ринат Хузин,M,75,,,,,,185,195,215,215,-232.5,,,,,,215,75,B,Multi-ply,Yes,Masters 45-49,47,1969-06-14
2,Sergey Sidorovskiy,Сергей Сидоровский,M,74.4,,,,,,172.5,182.5,187.5,187.5,,,,,,,187.5,75,B,Multi-ply,Yes,Masters 45-49,45,1971-05-12
1,Konstantin Alekseychuk,Константин Алексейчук,M,82.2,,,,,,210,220,,220,,,,,,,220,82.5,B,Multi-ply,Yes,Open,28,1988-11-17
2,Mikhail Kiselev,Михаил Киселев,M,82.1,,,,,,-215,215,-230,215,,,,,,,215,82.5,B,Multi-ply,Yes,Open,24,1992-12-20
1,Sergey Korolyov,Сергей Королёв,M,79.8,,,,,,160,172.5,-185,172.5,,,,,,,172.5,82.5,B,Multi-ply,Yes,Masters 45-49,45,1972-04-03
1,Vyacheslav Troshinskiy,Вячеслав Трошинский,M,81.4,,,,,,-155,155,160,160,,,,,,,160,82.5,B,Multi-ply,Yes,Masters 55-59,56,1960-05-10
1,Artem Bykhovets,Артем Быховец,M,87.9,,,,,,215,232.5,-257.5,232.5,,,,,,,232.5,90,B,Multi-ply,Yes,Open,33,1983-07-19
2,Andrey Simkin,Андрей Симкин,M,90,,,,,,200,215,230,230,,,,,,,230,90,B,Multi-ply,Yes,Open,33,1983-05-27
3,Roman Shcherbakov,Роман Щербаков,M,87.3,,,,,,-200,200,215,215,,,,,,,215,90,B,Multi-ply,Yes,Open,38,1978-09-18
4,Dmitriy Borodikhin,Дмитрий Бородихин,M,87.2,,,,,,185,-200,200,200,,,,,,,200,90,B,Multi-ply,Yes,Open,29,1987-10-24
5,Vasiliy Novikov,Василий Новиков,M,87.7,,,,,,190,-205,-215,190,,,,,,,190,90,B,Multi-ply,Yes,Open,26,1991-01-30
1,Igor Klimanov,Игорь Климанов,M,89.8,,,,,,220,230,-240,230,,,,,,,230,90,B,Multi-ply,Yes,Masters 40-44,42,1974-07-30
1,Igor Rachkov,Игорь Рачков,M,87.6,,,,,,140,150,-155,150,,,,,,,150,90,B,Multi-ply,Yes,Masters 50-54,52,1965-03-06
1,Kirill Sukharev,Кирилл Сухарев,M,96.2,,,,,,240,-255,-255,240,,,,,,,240,100,B,Multi-ply,Yes,Juniors 20-23,23,1993-12-21
1,Andrey Sukharev,Андрей Сухарев,M,98.7,,,,,,290,305,-315,305,,,,,,,305,100,B,Multi-ply,Yes,Open,42,1974-07-22
2,Aleksey Makarov,Алексей Макаров,M,96.2,,,,,,200,210,-235,210,,,,,,,210,100,B,Multi-ply,Yes,Open,38,1978-10-09
1,Andrey Sukharev,Андрей Сухарев,M,98.7,,,,,,290,305,-315,305,,,,,,,305,100,B,Multi-ply,Yes,Masters 40-44,42,1974-07-22
1,Aleksey Fedorenko,Алексей Федоренко,M,107.3,,,,,,180,185,-190,185,,,,,,,185,110,B,Multi-ply,Yes,Juniors 20-23,20,1996-06-02
1,Mikhail Antsiferov,Михаил Анциферов,M,107.2,,,,,,282.5,300,,300,,,,,,,300,110,B,Multi-ply,Yes,Open,35,1981-07-02
2,Artem Vorontsov,Артем Воронцов,M,109.8,,,,,,-282.5,282.5,-300,282.5,,,,,,,282.5,110,B,Multi-ply,Yes,Open,40,1976-08-03
3,Konstantin Vorobev,Константин Воробьев,M,108,,,,,,170,-200,200,200,,,,,,,200,110,B,Multi-ply,Yes,Open,26,1991-02-02
4,Aleksey Fedorenko,Алексей Федоренко,M,107.3,,,,,,180,185,-190,185,,,,,,,185,110,B,Multi-ply,Yes,Open,20,1996-06-02
1,Artem Vorontsov,Артем Воронцов,M,109.8,,,,,,-282.5,282.5,-300,282.5,,,,,,,282.5,110,B,Multi-ply,Yes,Masters 40-44,40,1976-08-03
1,Denis Ogloblin,Денис Оглоблин,M,122.9,,,,,,240,250,255,255,-260,,,,,,255,125,B,Multi-ply,Yes,Open,49,1967-05-12
1,Denis Ogloblin,Денис Оглоблин,M,122.9,,,,,,240,250,255,255,-260,,,,,,255,125,B,Multi-ply,Yes,Masters 45-49,49,1967-05-12
