Division,WeightClassKg,Place,Name,Team,BodyweightKg,Best3SquatKg,Best3BenchKg,Best3DeadliftKg,TotalKg,Equipment,Event,Sex
Boys,51.71,1,Miguel Hernandez,Emory Rains,50.53,154.22,83.91,145.15,383.29,Single-ply,SBD,M
Boys,51.71,2,Austin Puetz,Paris,51.39,120.2,72.57,145.15,337.93,Single-ply,SBD,M
Boys,51.71,3,Rj Reynolds,Commerce,51.62,122.47,72.57,142.88,337.93,Single-ply,SBD,M
Boys,51.71,4,Trey Arras,Texarkana Liberty-Eylau,49.44,122.47,72.57,127.01,322.05,Single-ply,SBD,M
Boys,51.71,5,Keilinn Shelton,Carthage,50.26,108.86,65.77,102.06,276.69,Single-ply,SBD,M
Boys,51.71,6,Blake Dyer,Atlanta,49.17,79.38,58.97,106.59,244.94,Single-ply,SBD,M
Boys,51.71,7,Hogan Goodson,Pattonville Prairiland,51.17,61.23,52.16,106.59,219.99,Single-ply,SBD,M
Boys,51.71,8,Austin Siscoe,Commerce,49.62,81.65,45.36,90.72,217.72,Single-ply,SBD,M
Boys,55.79,1,Jesse Ortiz,Sulphur Springs,54.61,165.56,86.18,167.83,419.57,Single-ply,SBD,M
Boys,55.79,2,David Martin-Flores,Texarkana Pleasant Grove,55.07,147.42,90.72,154.22,392.36,Single-ply,SBD,M
Boys,59.87,3,Naire Gaines,Paris,55.88,147.42,77.11,158.76,383.29,Single-ply,SBD,M
Boys,55.79,4,Dylan Izzi,Sulphur Springs,55.25,136.08,86.18,149.69,371.95,Single-ply,SBD,M
Boys,55.79,5,Juan Salazar,Bonham,52.8,138.35,77.11,129.27,344.73,Single-ply,SBD,M
Boys,55.79,6,Cole Owens,Bonham,53.89,136.08,68.04,136.08,340.19,Single-ply,SBD,M
Boys,55.79,7,Isaiah Peters,Paris Chisum,54.43,120.2,61.23,124.74,306.17,Single-ply,SBD,M
Boys,55.79,8,Josh Balton,Paris North Lamar,55.16,117.93,58.97,129.27,306.17,Single-ply,SBD,M
Boys,59.87,9,Brayden Lopez,Commerce,56.02,113.4,61.23,122.47,297.1,Single-ply,SBD,M
Boys,55.79,10,Wes Culberson,Paris North Lamar,53.16,88.45,56.7,99.79,244.94,Single-ply,SBD,M
Boys,59.87,1,Matthew Soloman,Texarkana Liberty-Eylau,59.06,183.7,102.06,183.7,469.47,Single-ply,SBD,M
Boys,59.87,2,Rajuan Crabtree,Texarkana Liberty-Eylau,59.24,161.03,102.06,161.03,424.11,Single-ply,SBD,M
Boys,59.87,3,Matt Hahn,Texarkana Pleasant Grove,58.79,145.15,90.72,163.29,399.16,Single-ply,SBD,M
Boys,59.87,4,McKenzie Davis,Texarkana Liberty-Eylau,59.42,147.42,90.72,156.49,394.63,Single-ply,SBD,M
Boys,59.87,5,Juston Clough,Carthage,56.34,140.61,77.11,165.56,383.29,Single-ply,SBD,M
Boys,59.87,6,Ryder Brock,Detroit,59.24,154.22,65.77,158.76,378.75,Single-ply,SBD,M
Boys,67.13,7,Taylor Ibarra,Sulphur Springs,59.96,149.69,88.45,138.35,376.48,Single-ply,SBD,M
Boys,59.87,8,Colton Strode,Cooper,59.33,154.22,81.65,133.81,369.68,Single-ply,SBD,M
Boys,59.87,9,Cesar Colunga,Emory Rains,56.06,142.88,65.77,151.95,360.61,Single-ply,SBD,M
Boys,59.87,10,Josh Johnson,Paris North Lamar,59.51,136.08,72.57,147.42,356.07,Single-ply,SBD,M
Boys,59.87,11,Hunter Roberts,Atlanta,59.87,120.2,83.91,149.69,353.8,Single-ply,SBD,M
Boys,59.87,12,Scott Galarza,Sulphur Springs,59.15,120.2,79.38,145.15,344.73,Single-ply,SBD,M
Boys,59.87,13,Lane Simpson,Bonham,59.78,124.74,72.57,140.61,337.93,Single-ply,SBD,M
Boys,59.87,14,Scotty Johnson,Cooper,57.97,106.59,81.65,145.15,333.39,Single-ply,SBD,M
Boys,59.87,15,Cody Penny,Pattonville Prairiland,57.79,63.5,58.97,95.25,217.72,Single-ply,SBD,M
Boys,67.13,DQ,Zac Thompson,Big Sandy Harmony,60.06,142.88,,,,Single-ply,SBD,M
Boys,67.13,1,Jb Peltier,Commerce,66.04,197.31,115.67,188.24,501.22,Single-ply,SBD,M
Boys,74.84,2,Christian Allison,Carthage,67.36,190.51,108.86,192.78,492.15,Single-ply,SBD,M
Boys,67.13,3,Deontre Baker,Denison,66.04,181.44,90.72,204.12,476.27,Single-ply,SBD,M
Boys,67.13,4,Levi Roberts,Atlanta,66.5,181.44,111.13,183.7,476.27,Single-ply,SBD,M
Boys,67.13,5,X-Zavius Gray,Paris,64.68,165.56,97.52,181.44,444.52,Single-ply,SBD,M
Boys,67.13,6,Funzell Coleman,Atlanta,67.13,158.76,97.52,181.44,437.72,Single-ply,SBD,M
Boys,67.13,7,Gage Allen,Hallsville,66.68,167.83,99.79,158.76,426.38,Single-ply,SBD,M
Boys,67.13,8,Jared Scott #2,Texarkana Pleasant Grove,64.32,183.7,79.38,161.03,424.11,Single-ply,SBD,M
Boys,67.13,9,Ty Everett,Texarkana Pleasant Grove,65.86,147.42,90.72,181.44,419.57,Single-ply,SBD,M
Boys,67.13,10,Matt Collins #4,Emory Rains,67.04,142.88,106.59,165.56,415.04,Single-ply,SBD,M
Boys,67.13,11,Keitron Reed,Paris North Lamar,65.14,149.69,92.99,167.83,410.5,Single-ply,SBD,M
Boys,67.13,12,Jamar Sanders,Paris,64.41,163.29,79.38,165.56,408.23,Single-ply,SBD,M
Boys,67.13,13,Matt Rumbaugh,Commerce,62.41,165.56,83.91,147.42,396.89,Single-ply,SBD,M
Boys,67.13,14,Clayton Harris,Emory Rains,63.78,145.15,88.45,142.88,376.48,Single-ply,SBD,M
Boys,67.13,15,Naim Diego,Emory Rains,64.5,133.81,65.77,158.76,358.34,Single-ply,SBD,M
Boys,67.13,16,Dakota Vanderburg,Paris Chisum,65.86,124.74,74.84,129.27,328.85,Single-ply,SBD,M
Boys,67.13,17,Nick Nobel,Paris North Lamar,63.96,113.4,74.84,136.08,324.32,Single-ply,SBD,M
Boys,67.13,18,Mason Chrisman,Paris North Lamar,65.86,106.59,68.04,147.42,322.05,Single-ply,SBD,M
Boys,67.13,19,Austin Mesick,Pattonville Prairiland,66.68,106.59,61.23,129.27,297.1,Single-ply,SBD,M
Boys,67.13,20,Clay Hill,Paris Chisum,65.86,90.72,52.16,113.4,256.28,Single-ply,SBD,M
Boys,67.13,DQ,Jonathan Phillips,Pattonville Prairiland,62.87,124.74,70.31,,,Single-ply,SBD,M
Boys,67.13,DQ,Luis Gamez #1,Sulphur Springs,62.6,167.83,120.2,,,Single-ply,SBD,M
Boys,67.13,DQ,Austin Cunningham,Paris North Lamar,61.78,102.06,,,,Single-ply,SBD,M
Boys,67.13,DQ,Tristan Brooks,Detroit,66.77,,,,,Single-ply,SBD,M
Boys,67.13,DQ,Xavier McDonald,Clarksville,64.14,,,,,Single-ply,SBD,M
Boys,67.13,DQ,Josiah Dennis,Commerce,62.69,163.29,,,,Single-ply,SBD,M
Boys,67.13,DQ,Eric Arriaga,Big Sandy Harmony,67.04,,,,,Single-ply,SBD,M
Boys,67.13,DQ,Rod Howard,Texarkana Liberty-Eylau,61.96,,,,,Single-ply,SBD,M
Boys,74.84,1,Alvin Battle,Atlanta,74.75,229.06,136.08,226.8,591.94,Single-ply,SBD,M
Boys,74.84,2,Brad Meadows,Texarkana Pleasant Grove,74.66,213.19,151.95,219.99,585.13,Single-ply,SBD,M
Boys,74.84,3,Christian Darter,Emory Rains,74.3,208.65,138.35,210.92,557.92,Single-ply,SBD,M
Boys,74.84,4,Donelle Hoof,Texarkana Liberty-Eylau,72.3,188.24,117.93,197.31,503.49,Single-ply,SBD,M
Boys,82.1,5,Damien Lawson,Atlanta,75.02,183.7,108.86,204.12,496.68,Single-ply,SBD,M
Boys,74.84,6,Blair Fernandez,Hallsville,73.48,201.85,113.4,174.63,489.88,Single-ply,SBD,M
Boys,82.1,7,Zanoah Arnold,Texarkana Liberty-Eylau,74.93,172.37,113.4,199.58,485.34,Single-ply,SBD,M
Boys,74.84,8,Carson Craytor,Texarkana Pleasant Grove,72.21,176.9,92.99,199.58,469.47,Single-ply,SBD,M
Boys,74.84,9,Khalil Sneed,Hallsville,70.49,188.24,104.33,170.1,462.66,Single-ply,SBD,M
Boys,74.84,10,Brandon Gillen,Paris Chisum,71.94,181.44,102.06,174.63,458.13,Single-ply,SBD,M
Boys,82.1,11,Chase Perry,Paris North Lamar,75.07,176.9,111.13,165.56,453.59,Single-ply,SBD,M
Boys,82.1,12,Tanner Phifer,Cooper,74.93,161.03,97.52,192.78,451.32,Single-ply,SBD,M
Boys,74.84,13,David Sanchez #3,Denison,74.66,151.95,113.4,183.7,449.06,Single-ply,SBD,M
Boys,82.1,14,Ron Jasterzenski,Bonham,75.02,172.37,102.06,167.83,442.25,Single-ply,SBD,M
Boys,74.84,15,Kameron Levingston,Texarkana Liberty-Eylau,72.03,136.08,102.06,190.51,428.64,Single-ply,SBD,M
Boys,74.84,16,Randon Smith,Pattonville Prairiland,74.39,142.88,90.72,165.56,399.16,Single-ply,SBD,M
Boys,82.1,17,Clay Ingram,Cooper,75.07,161.03,81.65,142.88,385.55,Single-ply,SBD,M
Boys,74.84,18,Reece Miller,Bonham,70.49,138.35,77.11,127.01,342.46,Single-ply,SBD,M
Boys,74.84,19,Angel Aguillon,Big Sandy Harmony,73.84,122.47,68.04,129.27,319.78,Single-ply,SBD,M
Boys,82.1,20,Andre Periera,Big Sandy Harmony,74.93,117.93,77.11,122.47,317.51,Single-ply,SBD,M
Boys,74.84,DQ,Dyllan Retos,Paris Chisum,74.66,163.29,106.59,,,Single-ply,SBD,M
Boys,74.84,DQ,Chris Miles,Sulphur Springs,73.94,,,,,Single-ply,SBD,M
Boys,82.1,1,AJ Rose,Hallsville,80.83,204.12,158.76,188.24,551.11,Single-ply,SBD,M
Boys,82.1,2,Hunter Hatfield,Texarkana Pleasant Grove,81.83,208.65,117.93,201.85,528.44,Single-ply,SBD,M
Boys,82.1,3,Dakota Moore,Paris North Lamar,77.56,181.44,117.93,206.38,505.76,Single-ply,SBD,M
Boys,82.1,4,Nick Cooper,Atlanta,78.65,195.04,122.47,188.24,505.76,Single-ply,SBD,M
Boys,89.81,5,Jordan Sanders,Paris,82.33,183.7,104.33,204.12,492.15,Single-ply,SBD,M
Boys,82.1,6,Justin Blagburn,Emory Rains,80.29,183.7,113.4,190.51,487.61,Single-ply,SBD,M
Boys,82.1,7,Kyler Drake,Paris North Lamar,79.92,190.51,111.13,172.37,474,Single-ply,SBD,M
Boys,82.1,8,Herlin James,Texarkana Liberty-Eylau,76.84,181.44,111.13,172.37,464.93,Single-ply,SBD,M
Boys,82.1,9,Cody Smith,Cooper,77.29,149.69,77.11,174.63,401.43,Single-ply,SBD,M
Boys,82.1,10,Trevor Buckaloo,Bonham,81.56,154.22,81.65,147.42,383.29,Single-ply,SBD,M
Boys,82.1,11,Dakota Hembree,Paris North Lamar,76.84,149.69,77.11,154.22,381.02,Single-ply,SBD,M
Boys,82.1,DQ,Dedric Smith,Sulphur Springs,80.6,,,,,Single-ply,SBD,M
Boys,89.81,1,Isaiah Martinez,Commerce,89.36,254.01,161.03,238.14,653.17,Single-ply,SBD,M
Boys,89.81,2,Gannon Brown,Emory Rains,85.91,233.6,145.15,265.35,644.1,Single-ply,SBD,M
Boys,89.81,3,Bowen Kirkbride,Denison,88.54,256.28,145.15,226.8,628.23,Single-ply,SBD,M
Boys,89.81,4,Leo Meyers,Atlanta,87.45,238.14,158.76,226.8,623.69,Single-ply,SBD,M
Boys,89.81,5,Kenton Manis,Bonham,83.46,233.6,120.2,233.6,587.4,Single-ply,SBD,M
Boys,89.81,6,Cam Schulz,Atlanta,89.72,226.8,120.2,219.99,566.99,Single-ply,SBD,M
Boys,89.81,7,Andrew Johnson #6,Paris North Lamar,86.55,199.58,117.93,226.8,544.31,Single-ply,SBD,M
Boys,89.81,8,Darrion Dockins,Clarksville,88.81,204.12,111.13,213.19,528.44,Single-ply,SBD,M
Boys,89.81,9,Kendall Alexander,Paris,88.9,192.78,113.4,208.65,514.83,Single-ply,SBD,M
Boys,99.79,10,Branson Davis,Big Sandy Harmony,90.04,179.17,122.47,204.12,505.76,Single-ply,SBD,M
Boys,89.81,11,Tristan McClure,Paris,89.81,210.92,97.52,190.51,498.95,Single-ply,SBD,M
Boys,99.79,12,Zach Smith #14,Big Sandy Harmony,89.99,181.44,111.13,204.12,496.68,Single-ply,SBD,M
Boys,89.81,13,John Philips,Big Sandy Harmony,86.82,192.78,120.2,181.44,494.42,Single-ply,SBD,M
Boys,89.81,14,Alex Gamez,Sulphur Springs,86.73,197.31,111.13,179.17,487.61,Single-ply,SBD,M
Boys,89.81,15,Jackson Maxey,Hallsville,86.91,181.44,113.4,181.44,476.27,Single-ply,SBD,M
Boys,89.81,16,Tony Ramirez,Commerce,83.55,181.44,102.06,190.51,474,Single-ply,SBD,M
Boys,89.81,17,Ferendo Ramirez,Linden-Kildare,88.9,163.29,102.06,192.78,458.13,Single-ply,SBD,M
Boys,89.81,18,Dj Samuels,Paris,87.09,149.69,97.52,167.83,415.04,Single-ply,SBD,M
Boys,89.81,19,Casey Harper,Paris North Lamar,84.19,151.95,104.33,142.88,399.16,Single-ply,SBD,M
Boys,89.81,20,Ivan Flores,Hallsville,89.54,97.52,83.91,136.08,317.51,Single-ply,SBD,M
Boys,89.81,DQ,Heath Aundrey,Commerce,84.19,,,,,Single-ply,SBD,M
Boys,99.79,1,Neco Smith,Texarkana Pleasant Grove,96.52,267.62,154.22,224.53,646.37,Single-ply,SBD,M
Boys,99.79,2,Dexter Ward,Hallsville,93.8,217.72,147.42,215.46,580.6,Single-ply,SBD,M
Boys,99.79,3,Geoffrey Smith,Paris,99.47,215.46,131.54,226.8,573.79,Single-ply,SBD,M
Boys,99.79,4,Caleb Hill,Bonham,99.16,233.6,99.79,210.92,544.31,Single-ply,SBD,M
Boys,99.79,5,Tyran Wilson,Commerce,93.26,204.12,133.81,204.12,542.04,Single-ply,SBD,M
Boys,99.79,6,Blake Westbrook,Detroit,97.25,226.8,120.2,192.78,539.77,Single-ply,SBD,M
Boys,99.79,7,David Mauldin,Commerce,95.53,185.97,124.74,226.8,537.51,Single-ply,SBD,M
Boys,99.79,8,Cody Berry,Paris North Lamar,99.79,167.83,115.67,183.7,467.2,Single-ply,SBD,M
Boys,99.79,9,Jawun Sims,Paris,98.52,174.63,113.4,176.9,464.93,Single-ply,SBD,M
Boys,99.79,10,Brandon Halliday,Paris North Lamar,98.97,176.9,104.33,172.37,453.59,Single-ply,SBD,M
Boys,99.79,11,Clay Stephens,Bonham,98.43,165.56,92.99,181.44,439.98,Single-ply,SBD,M
Boys,99.79,12,Tristan Jones,Cooper,90.72,170.1,81.65,170.1,421.84,Single-ply,SBD,M
Boys,99.79,13,Ryder Bryant,Paris North Lamar,95.53,136.08,81.65,154.22,371.95,Single-ply,SBD,M
Boys,99.79,14,Doran Hutchinson,Paris North Lamar,95.62,138.35,77.11,124.74,340.19,Single-ply,SBD,M
Boys,99.79,15,Shay Cregg,Paris Chisum,92.53,122.47,70.31,136.08,328.85,Single-ply,SBD,M
Boys,99.79,DQ,Ethan England,Paris,96.71,,,,,Single-ply,SBD,M
Boys,99.79,DQ,Seth Lemley,Texarkana Pleasant Grove,90.72,226.8,,,,Single-ply,SBD,M
Boys,109.77,1,Ricky Johnson,Texarkana Liberty-Eylau,100.7,244.94,127.01,242.67,614.62,Single-ply,SBD,M
Boys,109.77,2,Cole Davis,Atlanta,104.69,244.94,140.61,222.26,607.81,Single-ply,SBD,M
Boys,109.77,3,Ethan Lawson,Sadler S & S Cons,108.68,233.6,129.27,217.72,580.6,Single-ply,SBD,M
Boys,109.77,4,Dennis Coleman,Paris,103.42,226.8,129.27,222.26,578.33,Single-ply,SBD,M
Boys,109.77,5,Chris Bloyd,Big Sandy Harmony,101.6,231.33,136.08,204.12,571.53,Single-ply,SBD,M
Boys,109.77,6,Tyler Carter,Paris North Lamar,106.5,201.85,147.42,204.12,553.38,Single-ply,SBD,M
Boys,109.77,7,Jade Panaro,Atlanta,103.33,204.12,106.59,206.38,517.1,Single-ply,SBD,M
Boys,109.77,8,Tyler Collier,Pattonville Prairiland,104.14,192.78,115.67,192.78,501.22,Single-ply,SBD,M
Boys,109.77,9,Dakota Helm,Paris,107.77,192.78,92.99,199.58,485.34,Single-ply,SBD,M
Boys,109.77,10,Kj Mohl,Hallsville,100.61,190.51,111.13,179.17,480.81,Single-ply,SBD,M
Boys,109.77,11,Hayden Hanks,Bogata Rivercrest,101.15,172.37,113.4,158.76,444.52,Single-ply,SBD,M
Boys,109.77,12,Tyler Ballard,Bogata Rivercrest,103.24,167.83,99.79,154.22,421.84,Single-ply,SBD,M
Boys,109.77,13,Eric Viramontes,Hallsville,106.23,170.1,90.72,158.76,419.57,Single-ply,SBD,M
Boys,109.77,14,Denim McIntire,Paris Chisum,105.05,156.49,95.25,161.03,412.77,Single-ply,SBD,M
Boys,109.77,DQ,Austin Morgan,Commerce,105.87,,,,,Single-ply,SBD,M
Boys,124.74,1,Drew Davis,Texarkana Pleasant Grove,121.02,267.62,183.7,215.46,666.78,Single-ply,SBD,M
Boys,124.74,2,Landon Watkins,Sulphur Springs,120.2,226.8,158.76,195.04,580.6,Single-ply,SBD,M
Boys,124.74,3,Daniel Logan,Big Sandy Harmony,122.02,231.33,122.47,213.19,566.99,Single-ply,SBD,M
Boys,124.74,4,Dalton Benson,Celeste,116.75,210.92,156.49,181.44,548.85,Single-ply,SBD,M
Boys,124.74,5,Mytchell Naylor,Paris Chisum,119.66,226.8,115.67,192.78,535.24,Single-ply,SBD,M
Boys,124.74,6,Dakota Griffin,Emory Rains,123.65,226.8,108.86,185.97,521.63,Single-ply,SBD,M
Boys,124.74,7,Jasper Spurlock,Hallsville,113.49,195.04,127.01,197.31,519.36,Single-ply,SBD,M
Boys,124.74+,8,Riley Coker,Paris,124.78,199.58,102.06,204.12,505.76,Single-ply,SBD,M
Boys,124.74,9,Brendan Reddick,Pattonville Prairiland,115.67,181.44,120.2,183.7,485.34,Single-ply,SBD,M
Boys,124.74,10,Stetson Henderson,Paris North Lamar,115.39,181.44,127.01,170.1,478.54,Single-ply,SBD,M
Boys,124.74,11,Franklin Smith,Texarkana Liberty-Eylau,112.58,181.44,88.45,201.85,471.74,Single-ply,SBD,M
Boys,124.74,12,Byron Muse,Paris,116.57,163.29,127.01,181.44,471.74,Single-ply,SBD,M
Boys,124.74,13,Brandon Miller,Bonham,118.48,165.56,99.79,147.42,412.77,Single-ply,SBD,M
Boys,124.74,14,Jacob Martello,Cooper,120.2,127.01,83.91,120.2,331.12,Single-ply,SBD,M
Boys,124.74+,1,Dillon Gage,Sadler S & S Cons,128,283.5,158.76,210.92,653.17,Single-ply,SBD,M
Boys,124.74+,2,Jordan LaBrie,Texarkana Pleasant Grove,137.98,281.23,172.37,199.58,653.17,Single-ply,SBD,M
Boys,124.74+,3,Lane Allen,Detroit,133.54,272.16,136.08,219.99,628.23,Single-ply,SBD,M
Boys,124.74+,4,Jackie Berry,Paris North Lamar,135.26,233.6,127.01,240.4,601.01,Single-ply,SBD,M
Boys,124.74+,5,Qurdale Huff,Paris,158.3,244.94,142.88,213.19,601.01,Single-ply,SBD,M
Boys,124.74+,6,Cassius McKee,Atlanta,129.64,240.4,124.74,208.65,573.79,Single-ply,SBD,M
Boys,124.74+,7,Dillon Chambers,Sadler S & S Cons,127.73,195.04,145.15,192.78,532.97,Single-ply,SBD,M
Boys,124.74+,8,Corey Hall,Hallsville,128.64,201.85,102.06,181.44,485.34,Single-ply,SBD,M
Boys,124.74+,9,D'Undre Williams,Linden-Kildare,146.33,154.22,108.86,154.22,417.3,Single-ply,SBD,M
Boys,124.74+,DQ,Bobby Krider,Linden-Kildare,131.09,,,,,Single-ply,SBD,M
