Division,WeightClassKg,Place,Name,Team,BodyweightKg,Best3SquatKg,Best3BenchKg,Best3DeadliftKg,TotalKg,Equipment,Event,Sex,BirthDate
Boys,51.71,1,Benjamin Marin,Wichita Falls,48.63,102.06,52.16,102.06,256.28,Single-ply,SBD,M,
Boys,51.71,2,Nathan Stevens,Wichita Falls City View,44.5,99.79,49.9,86.18,235.87,Single-ply,SBD,M,
Boys,51.71,3,Jace Yarbrough,Iowa Park,41.73,70.31,40.82,90.72,201.85,Single-ply,SBD,M,
Boys,51.71,DQ,Ryan Reader,Iowa Park,50.8,,,,,Single-ply,SBD,M,
Boys,51.71,DQ,Montee Kerr,Iowa Park,46.95,,40.82,79.38,,Single-ply,SBD,M,
Boys,55.79,1,Ivy D Kelly,Wichita Falls,54.61,127.01,74.84,140.61,342.46,Single-ply,SBD,M,
Boys,59.87,1,Francisco Balderas,Vernon,59.15,140.61,97.52,165.56,403.7,Single-ply,SBD,M,
Boys,59.87,2,Stephen Harris,Burkburnett,58.15,90.72,54.43,113.4,258.55,Single-ply,SBD,M,
Boys,67.13,1,Don Todd,Iowa Park,66.9,161.03,97.52,163.29,421.84,Single-ply,SBD,M,
Boys,67.13,2,Bryson McKnight,Iowa Park,66.22,151.95,97.52,149.69,399.16,Single-ply,SBD,M,
Boys,67.13,3,Ivory Kelly,Wichita Falls,61.05,120.2,65.77,147.42,333.39,Single-ply,SBD,M,
Boys,74.84,1,Chris Graham #1,Wichita Falls City View,71.67,256.28,127.01,229.06,612.35,Single-ply,SBD,M,
Boys,74.84,2,Carson Stevens,Iowa Park,73.03,215.46,122.47,183.7,521.63,Single-ply,SBD,M,
Boys,74.84,3,Logan Leal,Iowa Park,70.99,185.97,115.67,181.44,483.08,Single-ply,SBD,M,
Boys,74.84,4,Kason Major,Burkburnett,70.94,183.7,102.06,183.7,469.47,Single-ply,SBD,M,
Boys,74.84,5,Niko Tinsley,Wichita Falls City View,73.62,185.97,92.99,170.1,449.06,Single-ply,SBD,M,
Boys,74.84,6,Brigman Steward,Wichita Falls,71.8,165.56,88.45,158.76,412.77,Single-ply,SBD,M,
Boys,74.84,7,Ismael Trejo,Vernon,74.3,145.15,83.91,167.83,396.89,Single-ply,SBD,M,
Boys,74.84,8,Tin Nguyen,Wichita Falls City View,69.04,136.08,83.91,170.1,390.09,Single-ply,SBD,M,
Boys,74.84,9,Joseph Hickey,Petrolia,69.94,124.74,68.04,122.47,315.25,Single-ply,SBD,M,
Boys,74.84,10,Nich Cole,Wichita Falls,68.04,102.06,61.23,129.27,292.57,Single-ply,SBD,M,
Boys,82.1,1,Nick Leon,Wichita Falls Hirschi,75.93,181.44,102.06,185.97,469.47,Single-ply,SBD,M,
Boys,82.1,2,Landon Anderson,Burkburnett,81.74,149.69,92.99,201.85,444.52,Single-ply,SBD,M,
Boys,82.1,3,Wade Colley,Petrolia,81.24,183.7,102.06,113.4,399.16,Single-ply,SBD,M,
Boys,82.1,4,Cayden Resendez,Wichita Falls Hirschi,75.98,131.54,72.57,151.95,356.07,Single-ply,SBD,M,
Boys,82.1,DQ,Keyshun Jackson,Wichita Falls Hirschi,77.66,,,,,Single-ply,SBD,M,
Boys,82.1,DQ,Ethan Herber,Wichita Falls Hirschi,77.93,124.74,,154.22,,Single-ply,SBD,M,
Boys,89.81,1,Tinaye Mubvumba,Vernon,88.9,219.99,136.08,229.06,585.13,Single-ply,SBD,M,
Boys,89.81,2,Javian Frazier,Wichita Falls Hirschi,89.45,181.44,113.4,172.37,467.2,Single-ply,SBD,M,
Boys,89.81,3,Corbyn Oden,Iowa Park,89.58,156.49,102.06,149.69,408.23,Single-ply,SBD,M,
Boys,89.81,4,Kyle Garcia,Burkburnett,84.01,142.88,102.06,151.95,396.89,Single-ply,SBD,M,
Boys,89.81,5,Jacoby Clay,Wichita Falls,85.77,142.88,81.65,167.83,392.36,Single-ply,SBD,M,
Boys,89.81,6,Jessie Franklin,Wichita Falls City View,84.73,133.81,83.91,149.69,367.41,Single-ply,SBD,M,
Boys,89.81,DQ,Amari'a Wiley,Wichita Falls Hirschi,83.14,142.88,,149.69,,Single-ply,SBD,M,
Boys,89.81,DQ,Talon Ladesma,Iowa Park,88.68,149.69,,163.29,,Single-ply,SBD,M,
Boys,99.79,1,Zach Clark,Iowa Park,99.56,249.48,181.44,204.12,635.03,Single-ply,SBD,M,
Boys,99.79,2,Jordain Durham,Wichita Falls City View,91.85,238.14,127.01,231.33,596.47,Single-ply,SBD,M,
Boys,99.79,3,Tristan Perez #1,Wichita Falls Hirschi,94.17,233.6,136.08,208.65,578.33,Single-ply,SBD,M,
Boys,99.79,4,Luke Short,Petrolia,97.2,174.63,111.13,167.83,453.59,Single-ply,SBD,M,
Boys,99.79,5,Cory Whitman,Wichita Falls,93.12,158.76,92.99,167.83,419.57,Single-ply,SBD,M,
Boys,99.79,6,Nacion Estrada,Burkburnett,99.25,174.63,74.84,149.69,399.16,Single-ply,SBD,M,
Boys,99.79,7,Jacob Grounds,Burkburnett,89.9,127.01,79.38,142.88,349.27,Single-ply,SBD,M,
Boys,99.79,8,Brian Wilson-Perez,Wichita Falls City View,95.89,124.74,83.91,124.74,333.39,Single-ply,SBD,M,
Boys,99.79,9,Jason Franks,Burkburnett,98.16,115.67,72.57,120.2,308.44,Single-ply,SBD,M,
Boys,99.79,10,Levi Jones,Wichita Falls City View,95.25,113.4,68.04,120.2,301.64,Single-ply,SBD,M,
Boys,109.77,1,Kelsey Scott,Wichita Falls Hirschi,104.01,192.78,142.88,204.12,539.77,Single-ply,SBD,M,
Boys,109.77,2,Blake Rodriguez,Burkburnett,101.42,167.83,102.06,183.7,453.59,Single-ply,SBD,M,
Boys,109.77,3,Tyler Willson,Burkburnett,101.06,163.29,99.79,172.37,435.45,Single-ply,SBD,M,
Boys,109.77,4,Ashton Dickinson,Vernon,104.78,142.88,92.99,165.56,401.43,Single-ply,SBD,M,
Boys,109.77,5,Ethan Bennett,Burkburnett,108.86,145.15,88.45,158.76,392.36,Single-ply,SBD,M,
Boys,109.77,6,Cason Green,Iowa Park,101.6,136.08,102.06,124.74,362.87,Single-ply,SBD,M,
Boys,109.77,7,Emanuel Huerta,Wichita Falls City View,102.56,131.54,77.11,154.22,362.87,Single-ply,SBD,M,
Boys,109.77,DQ,Jerry Souther,Wichita Falls City View,109.36,138.35,,136.08,,Single-ply,SBD,M,
Boys,109.77,DQ,Sebastian Rodriguez,Wichita Falls Hirschi,104.37,111.13,,142.88,,Single-ply,SBD,M,
Boys,109.77,DQ,Robert Crump,Wichita Falls Hirschi,104.6,120.2,,,,Single-ply,SBD,M,
Boys,124.74,1,Mason Hill,Wichita Falls City View,120.2,233.6,124.74,238.14,596.47,Single-ply,SBD,M,
Boys,124.74,2,Hayden Meng,Burkburnett,113.58,217.72,122.47,238.14,578.33,Single-ply,SBD,M,
Boys,124.74,3,Aj Valdez #1,Wichita Falls,115.26,201.85,154.22,215.46,571.53,Single-ply,SBD,M,
Boys,124.74,4,Jonathan Eddleton,Petrolia,116.75,145.15,92.99,138.35,376.48,Single-ply,SBD,M,
Boys,124.74,5,Josh Valverde,Wichita Falls Hirschi,114.58,111.13,83.91,136.08,331.12,Single-ply,SBD,M,
Boys,139.71,1,Uriah Bates,Petrolia,127.1,136.08,113.4,170.1,419.57,Single-ply,SBD,M,
Boys,139.71+,DQ,Brett Briscoe,Petrolia,152.86,,,,,Single-ply,SBD,M,
