Division,WeightClassKg,Place,Name,Team,BodyweightKg,Best3SquatKg,Best3BenchKg,Best3DeadliftKg,TotalKg,Equipment,Event,Sex
Boys,51.71,1,David Garcia #5,Pharr Valley View,51.53,181.44,99.79,195.04,476.27,Single-ply,SBD,M
Boys,51.71,2,Tuti Garcia,Los Fresnos,50.62,174.63,95.25,185.97,455.86,Single-ply,SBD,M
Boys,51.71,3,Rodney Barnes,Everman,51.17,181.44,95.25,163.29,439.98,Single-ply,SBD,M
Boys,51.71,4,Randy Trevino,Gregory-Portland,50.44,170.1,86.18,181.44,437.72,Single-ply,SBD,M
Boys,51.71,5,Hector Villegas,Roma,50.98,170.1,90.72,172.37,433.18,Single-ply,SBD,M
Boys,51.71,6,LA Gonzalez,Alice,51.17,176.9,86.18,165.56,428.64,Single-ply,SBD,M
Boys,51.71,7,Brooks Guzman,Weslaco East,50.98,158.76,83.91,174.63,417.3,Single-ply,SBD,M
Boys,51.71,8,Albert de la Rosa,San Benito,51.62,154.22,90.72,172.37,417.3,Single-ply,SBD,M
Boys,51.71,9,Wylie Brown,Nacogdoches,51.71,145.15,86.18,167.83,399.16,Single-ply,SBD,M
Boys,55.79,10,Carlos Reynoso,McKinney Boyd,51.8,138.35,81.65,147.42,367.41,Single-ply,SBD,M
Boys,51.71,11,Ja'Vonta Mitchell,Greenville,49.62,149.69,74.84,136.08,360.61,Single-ply,SBD,M
Boys,51.71,12,Dawson Carusso,Burleson,49.99,127.01,72.57,158.76,358.34,Single-ply,SBD,M
Boys,55.79,13,Grayson Danner,Conroe The Woodlands,51.89,131.54,83.91,140.61,356.07,Single-ply,SBD,M
Boys,55.79,14,Cody Strokos,New Caney,51.8,136.08,61.23,154.22,351.53,Single-ply,SBD,M
Boys,51.71,15,Ryan Dean,Waco Midway,50.89,124.74,77.11,142.88,344.73,Single-ply,SBD,M
Boys,55.79,16,Timothy Ortiz,Odessa,51.89,117.93,77.11,149.69,344.73,Single-ply,SBD,M
Boys,51.71,17,Ignacio Romero,Plainview,45.9,108.86,56.7,113.4,278.96,Single-ply,SBD,M
Boys,59.87,1,Raul Mota,San Benito,55.88,179.17,108.86,192.78,480.81,Single-ply,SBD,M
Boys,55.79,2,John Rameriz,Victoria West,55.16,158.76,111.13,201.85,471.74,Single-ply,SBD,M
Boys,55.79,3,Juan Rivera,Los Fresnos,55.25,161.03,117.93,192.78,471.74,Single-ply,SBD,M
Boys,55.79,4,Brandon Thomas,McKinney North,54.98,181.44,83.91,199.58,464.93,Single-ply,SBD,M
Boys,55.79,5,Devon Harris,North Forney,55.16,170.1,108.86,185.97,464.93,Single-ply,SBD,M
Boys,55.79,6,Eliazar Duenes,Edcouch-Elsa,54.43,145.15,108.86,195.04,449.06,Single-ply,SBD,M
Boys,55.79,7,Isaac Castillo,Laredo Cigarroa,54.79,181.44,83.91,181.44,446.79,Single-ply,SBD,M
Boys,55.79,8,Angel Flores #2,Weslaco East,55.07,170.1,86.18,190.51,446.79,Single-ply,SBD,M
Boys,59.87,9,Gerald Van Ess,McKinney North,55.97,181.44,99.79,165.56,446.79,Single-ply,SBD,M
Boys,55.79,10,Jesse Ortiz,Sulphur Springs,54.16,172.37,92.99,172.37,437.72,Single-ply,SBD,M
Boys,59.87,11,Josh Bedolla,Elgin,55.88,158.76,102.06,174.63,435.45,Single-ply,SBD,M
Boys,59.87,12,Alec Webster,Killeen Shoemaker,55.97,145.15,102.06,181.44,428.64,Single-ply,SBD,M
Boys,55.79,13,Trey Marrero,Alvin,55.16,158.76,108.86,158.76,426.38,Single-ply,SBD,M
Boys,55.79,14,Anthony Washington,Plainview,55.43,149.69,81.65,161.03,392.36,Single-ply,SBD,M
Boys,55.79,15,Cameron Guillen,Clute Brazoswood,55.79,142.88,86.18,158.76,387.82,Single-ply,SBD,M
Boys,55.79,DQ,Jonathon Rodriguez,Abilene Cooper,54.52,,,,,Single-ply,SBD,M
Boys,59.87,1,Ashton Williams,Everman,59.78,206.38,106.59,213.19,526.17,Single-ply,SBD,M
Boys,67.13,2,Jacob de la Paz,Corpus Christi Calallen,60.06,215.46,102.06,204.12,521.63,Single-ply,SBD,M
Boys,59.87,3,Kyle Van Pelt,Mansfield Timberview,59.24,190.51,111.13,208.65,510.29,Single-ply,SBD,M
Boys,59.87,4,Armani Donaldson,Wichita Falls,59.69,204.12,115.67,190.51,510.29,Single-ply,SBD,M
Boys,59.87,5,Grayson Brown,Conroe The Woodlands,59.6,215.46,104.33,188.24,508.02,Single-ply,SBD,M
Boys,59.87,6,Michael Robason,Frisco Wakeland,59.24,213.19,102.06,190.51,505.76,Single-ply,SBD,M
Boys,59.87,7,Juan Chapa,San Antonio Southside,58.15,190.51,124.74,172.37,487.61,Single-ply,SBD,M
Boys,59.87,8,Victor Acosta,Pharr Valley View,59.87,188.24,115.67,181.44,485.34,Single-ply,SBD,M
Boys,59.87,9,Luis Gamez #1,Sulphur Springs,58.97,181.44,108.86,183.7,474,Single-ply,SBD,M
Boys,59.87,10,Issac Montemayor,Ennis,59.15,176.9,97.52,195.04,469.47,Single-ply,SBD,M
Boys,59.87,11,Donovan Lee,Katy Mayde Creek,59.69,165.56,99.79,204.12,469.47,Single-ply,SBD,M
Boys,59.87,12,Shang Bou,Fort Worth Paschal,57.79,174.63,92.99,197.31,464.93,Single-ply,SBD,M
Boys,59.87,13,Austin Blalock,Burleson Centennial,59.24,165.56,102.06,192.78,460.4,Single-ply,SBD,M
Boys,59.87,14,Zane Ponder,Plainview,59.42,170.1,81.65,158.76,410.5,Single-ply,SBD,M
Boys,59.87,15,Danny Gallardo,Plainview,59.78,147.42,81.65,170.1,399.16,Single-ply,SBD,M
Boys,59.87,DQ,Isaiah Robinson,Waco Midway,59.06,,,,,Single-ply,SBD,M
Boys,67.13,1,Jonathan Pena,Laredo United South,65.14,235.87,142.88,226.8,605.55,Single-ply,SBD,M
Boys,67.13,2,Nathan Ruiz,San Antonio East Central,66.32,217.72,151.95,229.06,598.74,Single-ply,SBD,M
Boys,67.13,3,Kenny Stafford,Everman,65.86,244.94,124.74,224.53,594.21,Single-ply,SBD,M
Boys,67.13,4,Tyler Marcel,Conroe Oak Ridge,65.23,213.19,145.15,229.06,587.4,Single-ply,SBD,M
Boys,67.13,5,Jade Haney,Port Lavaca Calhoun,66.32,238.14,115.67,233.6,587.4,Single-ply,SBD,M
Boys,67.13,6,David Taylor,College Station A&M Cons,66.5,217.72,129.27,240.4,587.4,Single-ply,SBD,M
Boys,67.13,7,Reggie Davis,College Station A&M Cons,66.86,213.19,147.42,222.26,582.87,Single-ply,SBD,M
Boys,67.13,8,Elvis Benitez,San Antonio East Central,66.95,217.72,151.95,213.19,582.87,Single-ply,SBD,M
Boys,67.13,9,Modesto Martinez,Victoria West,65.68,226.8,120.2,222.26,569.26,Single-ply,SBD,M
Boys,67.13,10,Samuel Navarro,Beeville Jones,66.22,219.99,122.47,226.8,569.26,Single-ply,SBD,M
Boys,67.13,11,Alec DeLeon,Dickinson,66.32,226.8,127.01,208.65,562.45,Single-ply,SBD,M
Boys,67.13,12,Mathew Barrett,Mansfield Summit,65.68,213.19,108.86,238.14,560.19,Single-ply,SBD,M
Boys,67.13,13,Garrett Shantz,Montgomery,65.41,213.19,122.47,215.46,551.11,Single-ply,SBD,M
Boys,67.13,14,Alex Ramsey,Royse City,67.04,217.72,124.74,208.65,551.11,Single-ply,SBD,M
Boys,67.13,15,Xavier Moffitt,Belton,66.68,199.58,111.13,231.33,542.04,Single-ply,SBD,M
Boys,67.13,16,Ivan Arroyo,Odessa,66.68,204.12,136.08,199.58,539.77,Single-ply,SBD,M
Boys,67.13,17,Damian Cisneros,Gregory-Portland,64.68,204.12,115.67,217.72,537.51,Single-ply,SBD,M
Boys,67.13,18,Ja'Vontay Williams,Nacogdoches,65.32,222.26,97.52,213.19,532.97,Single-ply,SBD,M
Boys,67.13,19,Javonte Parker,Marshall,63.14,199.58,104.33,215.46,519.36,Single-ply,SBD,M
Boys,67.13,20,Josh Binder,Midland,64.05,165.56,117.93,199.58,483.08,Single-ply,SBD,M
Boys,74.84,DQ,Zach Masssey,Vidor,67.31,210.92,147.42,,,Single-ply,SBD,M
Boys,74.84,1,Bacardi Clark,Mesquite Horn,73.39,288.03,142.88,256.28,687.19,Single-ply,SBD,M
Boys,74.84,2,Jarod Hill,Everman,72.76,263.08,147.42,267.62,678.12,Single-ply,SBD,M
Boys,74.84,3,Christopher Godoy,Brownsville Rivera,73.57,256.28,136.08,285.76,678.12,Single-ply,SBD,M
Boys,74.84,4,Josh Moreno,Comal Canyon,73.66,258.55,172.37,235.87,666.78,Single-ply,SBD,M
Boys,74.84,5,Tristan Pelitire,Beeville Jones,74.48,256.28,174.63,235.87,666.78,Single-ply,SBD,M
Boys,82.1,6,James Bain,Corpus Christi Tuloso-Midway,74.93,272.16,138.35,242.67,653.17,Single-ply,SBD,M
Boys,82.1,7,Carlos Lucio,Bryan,75.02,258.55,163.29,231.33,653.17,Single-ply,SBD,M
Boys,82.1,8,Angel Moreno,San Angelo Lake View,74.93,260.82,163.29,213.19,637.3,Single-ply,SBD,M
Boys,74.84,9,Jared Garcia,Corpus Christi Calallen,74.57,242.67,142.88,249.48,635.03,Single-ply,SBD,M
Boys,74.84,10,Chris Vega,Fort Worth North Side,72.94,233.6,163.29,229.06,625.96,Single-ply,SBD,M
Boys,82.1,11,Tumerius Flowers,Mansfield Summit,74.93,231.33,145.15,247.21,623.69,Single-ply,SBD,M
Boys,74.84,12,Calvin Laskey,Katy Mayde Creek,73.57,226.8,140.61,249.48,616.89,Single-ply,SBD,M
Boys,74.84,13,Noah Allen,Marshall,74.21,244.94,131.54,229.06,605.55,Single-ply,SBD,M
Boys,74.84,14,Christian Quitugua,Vidor,72.57,226.8,131.54,226.8,585.13,Single-ply,SBD,M
Boys,74.84,15,Holt Eads,Midland,73.75,204.12,136.08,226.8,566.99,Single-ply,SBD,M
Boys,74.84,16,Cornelius Zachary,Longview,72.67,229.06,99.79,229.06,557.92,Single-ply,SBD,M
Boys,74.84,DQ,Harrell Henderson,Waco Midway,73.57,,,,,Single-ply,SBD,M
Boys,89.81,1,Ben Navarrez,Edcouch-Elsa,82.28,281.23,188.24,290.3,759.77,Single-ply,SBD,M
Boys,82.1,2,Raynard Taylor,Comal Canyon,81.01,267.62,170.1,256.28,694,Single-ply,SBD,M
Boys,82.1,3,Mason Pierce,Plano John Paul II,81.28,235.87,176.9,256.28,669.05,Single-ply,SBD,M
Boys,82.1,4,Javi Cruz,Los Fresnos,80.1,238.14,138.35,267.62,644.1,Single-ply,SBD,M
Boys,82.1,5,Domingo Saucedo,Plainview,81.37,249.48,161.03,233.6,644.1,Single-ply,SBD,M
Boys,82.1,6,Vernon Allen,Crosby,80.38,260.82,138.35,238.14,637.3,Single-ply,SBD,M
Boys,82.1,7,Sergio Zuniga,San Antonio Southside,80.65,260.82,145.15,224.53,630.49,Single-ply,SBD,M
Boys,82.1,8,Travis Anderson,Crosby,81.37,249.48,145.15,233.6,628.23,Single-ply,SBD,M
Boys,82.1,9,Rhil Dougherty,Dripping Springs,79.92,226.8,142.88,249.48,619.15,Single-ply,SBD,M
Boys,82.1,10,Diego Garcia,Edcouch-Elsa,80.83,244.94,142.88,231.33,619.15,Single-ply,SBD,M
Boys,82.1,11,Jacob Palmares,Buda Hays,80.65,226.8,127.01,258.55,612.35,Single-ply,SBD,M
Boys,82.1,12,Clay Layman,Longview,79.65,244.94,117.93,244.94,607.81,Single-ply,SBD,M
Boys,89.81,13,Cory Flanagan,Longview,82.28,226.8,120.2,247.21,594.21,Single-ply,SBD,M
Boys,82.1,14,Ramses Gomez,Garland Rowlett,81.28,222.26,154.22,206.38,582.87,Single-ply,SBD,M
Boys,82.1,15,Caleb Hudson,San Angelo Lake View,77.2,226.8,122.47,226.8,576.06,Single-ply,SBD,M
Boys,82.1,16,Thomas Bridges,Dickinson,78.74,204.12,165.56,204.12,573.79,Single-ply,SBD,M
Boys,89.81,1,Troy Angelo,Orange Little Cypress-Mauriceville,88.54,290.3,158.76,283.5,732.55,Single-ply,SBD,M
Boys,89.81,2,Arnulfo Marin,Pharr Valley View,86.82,285.76,158.76,256.28,700.8,Single-ply,SBD,M
Boys,89.81,3,Jacob Flores,Beeville Jones,88.9,272.16,156.49,254.01,682.66,Single-ply,SBD,M
Boys,89.81,4,Jared Loftis,Royse City,89.27,272.16,140.61,263.08,675.85,Single-ply,SBD,M
Boys,89.81,5,George Stephenson,Conroe Oak Ridge,86.73,274.42,145.15,249.48,669.05,Single-ply,SBD,M
Boys,89.81,6,Agustin Morales,Weslaco East,88.9,265.35,142.88,258.55,666.78,Single-ply,SBD,M
Boys,89.81,7,Robert Trevino,Edcouch-Elsa,88.36,265.35,129.27,269.89,664.51,Single-ply,SBD,M
Boys,89.81,8,Josh Mercado,San Marcos,88.45,256.28,145.15,260.82,662.24,Single-ply,SBD,M
Boys,89.81,9,Zach Griffin,Beaumont Central,89.09,254.01,161.03,244.94,659.98,Single-ply,SBD,M
Boys,89.81,10,Coleton Whitlock,Midland,88.54,240.4,149.69,244.94,635.03,Single-ply,SBD,M
Boys,89.81,11,Najee Mustafaa,Midlothian,89.54,249.48,138.35,231.33,619.15,Single-ply,SBD,M
Boys,89.81,12,Nika Davis,Waco,86.73,229.06,138.35,249.48,616.89,Single-ply,SBD,M
Boys,89.81,13,Dayton Dennard,Odessa,87.27,215.46,127.01,226.8,569.26,Single-ply,SBD,M
Boys,89.81,14,Cody Brantley,Mount Pleasant,87.18,217.72,156.49,192.78,566.99,Single-ply,SBD,M
Boys,89.81,DQ,Doveon Dillard,Cedar Hill,87.27,244.94,,,,Single-ply,SBD,M
Boys,89.81,DQ,Chris Sherrill,Bay City,87,,,,,Single-ply,SBD,M
Boys,89.81,DQ,Matt Ritch,San Antonio East Central,89.63,303.91,176.9,251.74,,Single-ply,SBD,M
Boys,99.79,1,Mitchell Fountain,Conroe The Woodlands,99.16,317.51,195.04,333.39,845.95,Single-ply,SBD,M
Boys,99.79,2,Chase Nix,Crosby,98.07,283.5,181.44,278.96,743.89,Single-ply,SBD,M
Boys,99.79,3,Xavier Bryant,Temple,98.25,272.16,176.9,272.16,721.21,Single-ply,SBD,M
Boys,99.79,4,Jacob Alaniz,Brownsville Veterans Memorial,99.06,297.1,154.22,267.62,718.94,Single-ply,SBD,M
Boys,99.79,5,Blade Bronstad,Corpus Christi Calallen,96.89,285.76,163.29,265.35,714.41,Single-ply,SBD,M
Boys,99.79,6,John Rivera,Alice,98.79,299.37,170.1,238.14,707.6,Single-ply,SBD,M
Boys,99.79,7,Keith Ngondo,Little Elm,94.98,285.76,136.08,272.16,694,Single-ply,SBD,M
Boys,109.77,8,Francios Bonilla,Texas City,99.88,272.16,163.29,256.28,691.73,Single-ply,SBD,M
Boys,99.79,9,Trevor Luckemeyer,Comal Canyon,94.89,285.76,142.88,260.82,689.46,Single-ply,SBD,M
Boys,99.79,10,Chase Wingo,Midlothian,94.98,260.82,167.83,260.82,689.46,Single-ply,SBD,M
Boys,99.79,11,Dustin Hoeffler,New Caney Porter,96.71,272.16,161.03,256.28,689.46,Single-ply,SBD,M
Boys,99.79,12,Marco Banda,Laredo Nixon,94.89,267.62,179.17,240.4,687.19,Single-ply,SBD,M
Boys,99.79,13,Matthew Dickson,Corpus Christi Tuloso-Midway,95.07,263.08,158.76,263.08,684.92,Single-ply,SBD,M
Boys,99.79,14,Jose Flores #2,Laredo Cigarroa,97.52,265.35,161.03,258.55,684.92,Single-ply,SBD,M
Boys,99.79,15,Jason Paul,Conroe Woodlands College Park,95.07,288.03,145.15,226.8,659.98,Single-ply,SBD,M
Boys,99.79,16,Christian Hernandez,Everman,98.52,249.48,151.95,242.67,644.1,Single-ply,SBD,M
Boys,109.77,17,Hosbaldo Ruiz,Cleburne,99.97,244.94,154.22,238.14,637.3,Single-ply,SBD,M
Boys,99.79,18,Reagan Cooke,Abilene,96.98,267.62,142.88,217.72,628.23,Single-ply,SBD,M
Boys,99.79,19,Dannyk Ramos,Midland,94.26,272.16,136.08,217.72,625.96,Single-ply,SBD,M
Boys,99.79,20,JR Rodriguez,Bay City,99.61,265.35,136.08,215.46,616.89,Single-ply,SBD,M
Boys,99.79,21,Omar French,Longview,94.71,242.67,115.67,,358.34,Single-ply,SB,M
Boys,99.79,DQ,Tyler Ray,Magnolia West,97.89,244.94,,,,Single-ply,SB,M
Boys,109.77,1,Jeremy Chamberlain,San Antonio East Central,108.05,312.98,185.97,317.51,816.47,Single-ply,SBD,M
Boys,109.77,2,Dakota Cooksy,Corpus Christi Calallen,107.77,310.71,170.1,285.76,766.57,Single-ply,SBD,M
Boys,109.77,3,Gerald Hatch,Burleson,108.59,290.3,172.37,292.57,755.23,Single-ply,SBD,M
Boys,109.77,4,Kaylond North,Dickinson,106.5,308.44,174.63,263.08,746.16,Single-ply,SBD,M
Boys,109.77,5,Sergio Orona,Denison,108.05,283.5,176.9,272.16,732.55,Single-ply,SBD,M
Boys,109.77,6,Max Flores,Laredo Alexander,108.77,281.23,181.44,269.89,732.55,Single-ply,SBD,M
Boys,109.77,7,Parker Blount,Huntsville,109.23,283.5,181.44,265.35,730.28,Single-ply,SBD,M
Boys,109.77,8,Caesar Soto,San Antonio East Central,108.05,312.98,172.37,233.6,718.94,Single-ply,SBD,M
Boys,109.77,9,Kevin Trevino,PSJA North,106.32,274.42,172.37,254.01,700.8,Single-ply,SBD,M
Boys,109.77,10,Moises Garcia,Plainview,109.59,274.42,158.76,265.35,698.53,Single-ply,SBD,M
Boys,109.77,11,Jack Flowers,Frisco Wakeland,108.41,294.84,158.76,231.33,684.92,Single-ply,SBD,M
Boys,109.77,12,Victor Mejia,Waxahachie,108.14,260.82,161.03,251.74,673.58,Single-ply,SBD,M
Boys,109.77,13,Anietie Etuk,Dickinson,105.69,244.94,142.88,272.16,659.98,Single-ply,SBD,M
Boys,109.77,14,Miguel Espinoza,Abilene,105.05,265.35,158.76,226.8,650.91,Single-ply,SBD,M
Boys,109.77,15,Derrick Moore,Waco,108.14,249.48,145.15,249.48,644.1,Single-ply,SBD,M
Boys,109.77,DQ,Andres Arvizu,Alice,106.96,308.44,,,,Single-ply,SBD,M
Boys,124.74,1,Justin Bigelow,Denison,121.74,340.19,229.06,308.44,877.7,Single-ply,SBD,M
Boys,124.74,2,Alex Briseno,Brownsville Rivera,122.83,351.53,210.92,308.44,870.9,Single-ply,SBD,M
Boys,124.74,3,Michael Cadena,Bryan,123.2,335.66,208.65,281.23,825.54,Single-ply,SBD,M
Boys,124.74,4,Josue Garzoria,Los Fresnos,122.92,299.37,192.78,267.62,759.77,Single-ply,SBD,M
Boys,124.74,5,Gabriel Rodriguez,Edcouch-Elsa,120.29,324.32,188.24,242.67,755.23,Single-ply,SBD,M
Boys,124.74,6,Jesse Benevides Munoz,San Marcos,123.38,312.98,174.63,265.35,752.96,Single-ply,SBD,M
Boys,124.74,7,Dominic Hill #2,Fort Worth Boswell,123.47,294.84,183.7,265.35,743.89,Single-ply,SBD,M
Boys,124.74,8,Joe Gonzales,Justin Northwest,119.11,319.78,167.83,249.48,737.09,Single-ply,SBD,M
Boys,124.74,9,Colton Hostetler,Burleson Centennial,118.21,278.96,179.17,272.16,730.28,Single-ply,SBD,M
Boys,124.74,10,Josh Opiela,Crosby,121.83,312.98,165.56,249.48,728.02,Single-ply,SBD,M
Boys,124.74,11,Erik Mendez,Plainview,115.85,290.3,163.29,272.16,725.75,Single-ply,SBD,M
Boys,124.74,12,Keith Mora,Mission Sharyland,122.11,312.98,172.37,231.33,716.68,Single-ply,SBD,M
Boys,124.74,13,Will Demings,Conroe,123.65,317.51,165.56,233.6,716.68,Single-ply,SBD,M
Boys,124.74,14,Jacob Granado,Midland,119.29,310.71,151.95,238.14,700.8,Single-ply,SBD,M
Boys,124.74,15,Jesse Guzman,Brownsville Veterans Memorial,116.48,285.76,161.03,244.94,691.73,Single-ply,SBD,M
Boys,124.74,16,Jacobey Callahan,New Caney Porter,117.21,290.3,154.22,240.4,684.92,Single-ply,SBD,M
Boys,124.74,17,Hayden Mahone,Ennis,115.58,281.23,136.08,231.33,648.64,Single-ply,SBD,M
Boys,124.74,18,William Mitchell,Longview Pine Tree,116.03,272.16,170.1,199.58,641.83,Single-ply,SBD,M
Boys,124.74+,1,Rudy Flores,Laredo United South,145.78,381.02,240.4,301.64,923.06,Single-ply,SBD,M
Boys,124.74+,2,Davonte Moore,Temple,151.14,362.87,204.12,272.16,839.15,Single-ply,SBD,M
Boys,124.74+,3,William Simpson,Houston Madison,149.32,362.87,217.72,249.48,830.07,Single-ply,SBD,M
Boys,124.74+,4,Jose Limon,Los Fresnos,156.49,362.87,172.37,272.16,807.39,Single-ply,SBD,M
Boys,124.74+,5,Tyler Preson,Georgetown,129,317.51,195.04,278.96,791.52,Single-ply,SBD,M
Boys,124.74+,6,Charest Inman,Castroville Medina Valley,152.23,294.84,204.12,274.42,773.37,Single-ply,SBD,M
Boys,124.74+,7,Alec Gonzalez,San Antonio East Central,136.35,317.51,204.12,249.48,771.11,Single-ply,SBD,M
Boys,124.74+,8,Sergio Morales,Weslaco East,153.31,278.96,183.7,303.91,766.57,Single-ply,SBD,M
Boys,124.74+,9,Alonzo Crittendon,Dickinson,142.79,340.19,149.69,272.16,762.04,Single-ply,SBD,M
Boys,124.74+,10,Erik Ortega,Rio Grande City,146.96,317.51,167.83,272.16,757.5,Single-ply,SBD,M
Boys,124.74+,11,Chance Harmanson,Dickinson,133.9,294.84,185.97,272.16,752.96,Single-ply,SBD,M
Boys,124.74+,12,Des Johnson,Huntsville,137.17,294.84,215.46,238.14,748.43,Single-ply,SBD,M
Boys,124.74+,13,Andrew Blueitt,Beaumont West Brook,159.85,294.84,181.44,272.16,748.43,Single-ply,SBD,M
Boys,124.74+,14,Chris Mangini,Port Neches-Groves,128.28,283.5,197.31,249.48,730.28,Single-ply,SBD,M
Boys,124.74+,15,Maea Teuhema,Keller,155.85,260.82,208.65,249.48,718.94,Single-ply,SBD,M
Boys,124.74+,16,Will Wright,Mount Pleasant,168.92,294.84,181.44,235.87,712.14,Single-ply,SBD,M
Boys,124.74+,17,Dj Schlather,San Angelo Lake View,135.71,285.76,167.83,254.01,707.6,Single-ply,SBD,M
Boys,124.74+,18,Trey Marks,Little Elm,145.24,294.84,172.37,238.14,705.34,Single-ply,SBD,M
Boys,124.74+,19,Riley Owens,Abilene Cooper,144.15,281.23,154.22,244.94,680.39,Single-ply,SBD,M
