Name,WeightClassKg,Division,AgeRange,Sex,Best3SquatKg,Best3BenchKg,Best3DeadliftKg,TotalKg,Event,Equipment,Place,Age
Nicole Ryan,52,Open,,F,,47.63,,47.63,B,Single-ply,1,
Ben Bell,52,T,13-19,M,97.52,63.5,117.93,278.96,SBD,Single-ply,1,
J. Lenhardt,52,T,13-19,M,,,,,SBD,Single-ply,DQ,
T. Kim,56,T,13-19,M,65.77,52.16,122.47,240.4,SBD,Single-ply,1,
Brock Bell,56,T,13-19,M,90.72,,,,SBD,Single-ply,DQ,
V. Ibragimichaev,56,T,13-19,M,72.57,40.82,102.06,215.46,SBD,Single-ply,2,
Andy Kreuzer,60,Open,,M,192.78,117.93,165.56,476.27,SBD,Single-ply,1,
S. Kim,60,T,,M,106.59,74.84,133.81,315.25,SBD,Single-ply,1,
J. Silano,60,Open,,M,,74.84,,74.84,B,Single-ply,G,
Rich Vininski,67.5,Open,,M,65.77,99.79,201.85,367.41,SBD,Single-ply,1,
Rich Beyer,67.5,M 50-59,50-59,M,133.81,61.24,163.29,358.34,SBD,Single-ply,1,
James Golba,67.5,T,13-19,M,151.95,113.4,138.35,403.7,SBD,Single-ply,1,
P. Mills,67.5,T,13-19,M,92.99,52.16,122.47,267.62,SBD,Single-ply,2,
C. Mitchell #8,67.5,T,13-19,M,,122.47,,122.47,B,Single-ply,1,
P. Ryan,67.5,Open,,M,133.81,,,133.81,S,Single-ply,G,
Rich Vininski,67.5,M 50-59,50-59,M,,99.79,,99.79,B,Single-ply,1,
Rich Vininski,67.5,M 50-59,50-59,M,,,201.85,201.85,D,Single-ply,1,
Eric Sayles,75,Open,,M,219.99,113.4,238.14,571.53,SBD,Single-ply,1,
Dennis Villano,75,M 50-59,50-59,M,65.77,99.79,183.71,349.27,SBD,Single-ply,1,
A. Black #2,75,T,13-19,M,136.08,90.72,224.53,451.32,SBD,Single-ply,1,
D. Bissen,75,T,13-19,M,104.33,72.57,172.37,349.27,SBD,Single-ply,2,
J. Pipic,75,T,13-19,M,90.72,49.9,127.01,267.62,SBD,Single-ply,3,
T. Hollaway,75,T,13-19,M,79.38,56.7,113.4,249.48,SBD,Single-ply,4,
J. Williams,75,T,13-19,M,,,,,SBD,Single-ply,DQ,
N. Keohane,75,Nov,,M,158.76,136.08,192.78,487.61,SBD,Single-ply,1,
G. Troast,75,M 40-49,40-49,M,,117.93,,117.93,B,Single-ply,1,
Jack Wolff #1,75,M 50-59,50-59,M,,99.79,,99.79,B,Single-ply,1,
J. Kapushinsky,75,R Open,,M,,104.33,,104.33,B,Raw,1,
Jim Onderdonk,82.5,M 40-49,40-49,M,199.58,138.35,215.46,553.38,SBD,Single-ply,1,
Jim Onderdonk,82.5,Law/Mil,,M,199.58,138.35,215.46,553.38,SBD,Single-ply,1,
Akura Shaude,82.5,T,,M,170.1,104.33,215.46,489.88,SBD,Single-ply,1,
Rocky Haley,82.5,T,,M,170.1,122.47,197.31,489.88,SBD,Single-ply,2,
Tony Garretti,82.5,M 40-49,40-49,M,,122.47,,122.47,B,Single-ply,1,
C. Newcomb,82.5,RM 40-49,40-49,M,,122.47,,122.47,B,Raw,1,
C. Newcomb,82.5,R Nov,,M,,122.47,,122.47,B,Raw,1,
C. Newcomb,82.5,R Open,,M,,122.47,,122.47,B,Raw,1,
Gary Savocka,90,M 40-49,40-49,M,238.14,158.76,272.16,669.05,SBD,Single-ply,1,
Joe Kazanowksy Sr,90,M 50-59,50-59,M,154.22,136.08,228.38,518.68,SBD,Single-ply,1,
T. Palmer,90,T,13-19,M,154.22,90.72,204.12,449.06,SBD,Single-ply,1,
Joe Kazanowksy Jr,90,T,13-19,M,154.22,65.77,183.71,403.7,SBD,Single-ply,2,
Les Smear,90,R Open,,M,215.46,140.61,238.14,594.21,SBD,Raw,1,
J. Antignani,90,R Open,,M,215.46,124.74,235.87,576.06,SBD,Raw,2,
G. Phillips,90,R Open,,M,170.1,131.54,224.53,526.17,SBD,Raw,3,
Dan Caffrey,90,R Open,,M,172.37,136.08,210.92,519.36,SBD,Raw,4,
B. Zarczynski,90,Open,,M,,149.69,,149.69,B,Single-ply,2,
Vinnie Gengaro,90,M 40-49,40-49,M,,158.76,,158.76,B,Single-ply,1,
Rich Arline,90,RM 40-49,40-49,M,,156.49,,156.49,B,Raw,1,
R. Anderson,90,M 40-49,40-49,M,,131.54,,131.54,B,Single-ply,2,
J. Donnelly,90,M 40-49,40-49,M,,131.54,,131.54,B,Single-ply,3,
Scott Donaldson,90,Sub,35-39,M,,165.56,,165.56,B,Single-ply,1,
Rich Arline,90,R Law/Mil,,M,,156.49,,156.49,B,Raw,1,
Rich Arline,90,R Open,,M,,156.49,,156.49,B,Raw,1,
M. DeClario,90,R Open,,M,,147.42,,147.42,B,Raw,2,
E. Budlowski,90,R Open,,M,,140.61,,140.61,B,Raw,3,
Scott Donaldson,90,Sub,35-39,M,,,219.99,219.99,D,Single-ply,1,
Rich Schmazel,100,M 50-59,50-59,M,263.08,133.81,272.16,669.05,SBD,Single-ply,1,
A. Murray,100,M 50-59,50-59,M,179.17,117.93,197.31,494.42,SBD,Single-ply,2,
John Phelan,100,T,13-19,M,183.71,115.67,204.12,503.49,SBD,Single-ply,1,16
Robert Sandman,100,T,13-19,M,201.85,92.99,181.44,476.27,SBD,Single-ply,2,18
A. Murray,100,Open,,M,179.17,117.93,197.31,494.42,SBD,Single-ply,G,
Mike Anderson,100,R Open,,M,229.06,174.63,260.82,664.51,SBD,Raw,1,
Mario Bowers,100,R Open,,M,181.44,174.63,272.16,628.23,SBD,Raw,2,
Mike Briant,100,R Open,,M,204.12,158.76,249.48,612.35,SBD,Raw,3,
Howard Peele,100,Open,,M,,136.08,,136.08,B,Single-ply,1,
Howard Peele,100,M 40-49,,M,,136.08,,136.08,B,Single-ply,1,
Howard Peele,100,Nov,,M,,136.08,,136.08,B,Single-ply,1,
Jeff Jurick,100,R Open,,M,,172.37,,172.37,B,Raw,1,
Howard Peele,100,M 40-49,,M,,,204.12,204.12,D,Single-ply,1,
Mike Watahovich,110,M 50-59,50-59,M,181.44,163.29,215.46,560.19,SBD,Single-ply,1,
S. Boys,110,T,,M,158.76,95.25,192.78,446.79,SBD,Single-ply,1,
E. Baptista,110,T,,M,145.15,92.99,181.44,419.57,SBD,Single-ply,2,
Steve Caldwell,110,R Open,,M,235.87,167.83,235.87,639.57,SBD,Raw,1,
Gary Ham,110,R Open,,M,165.56,149.69,229.06,544.31,SBD,Raw,2,
M. Jones,110,R Open,,M,,,,,SBD,Raw,DQ,
D. Smith,110,R Open,,M,,,,,SBD,Raw,DQ,
Jule Dolci,110,M 40-49,40-49,M,,181.44,,181.44,B,Single-ply,1,
G. Ceserano,110,R Open,,M,,156.49,,156.49,B,Raw,1,
Gary Ham,110,Sub,35-39,M,,,229.06,229.06,D,Single-ply,1,
Wes Slingland,125,Sub,35-39,M,254.01,190.51,,,SBD,Single-ply,DQ,
Chris Lundland,125,Open,,M,249.48,181.44,254.01,684.93,SBD,Single-ply,G,
Robert Clevenger,125,R Open,,M,229.06,158.76,247.21,635.03,SBD,Raw,1,
JoJo White,125,R Open,,M,226.8,158.76,226.8,612.35,SBD,Raw,2,
Mike Muselle,145,Open,,M,315.25,183.71,301.64,800.59,SBD,Single-ply,1,
Greg Wiggand,145,R Open,,M,226.8,179.17,238.14,644.1,SBD,Raw,1,
J. McKeen,145,R Open,,M,192.78,142.88,233.6,569.26,SBD,Raw,2,
