{
    "licenseKey": "fd56a4db-f11f-47ae-9fc0-83cfe4b5a96e",
    "devtools_port": 9090,
    "startup_app": {
        "name": "Ben's App With Tray",
        "description": "Neptune Buy Side GUI",
        "url": "https://live.neptunefi.com",
        "uuid": "Bongobongo",
        "autoShow": true,
        "defaultCentered": true,
        "defaultWidth": 1024,
        "defaultHeight": 768
    },
    "runtime": {
        "version": "16.82.50.9",
        "forceLatest": true
    },
    "shortcut": {
        "company": "Neptune Networks Ltd",
        "description": "Neptune Buy Side GUI",
        "name": "Bongi Config App",
        "icon": "https://live.neptunefi.com/assets/img/neptune-logo.ico",
        "force": false,
        "trayIcon" : {
            "enabled": true
        }

    },
    "supportInformation": {
        "company": "Neptune Networks Ltd",
        "product": "Neptune BSG",
        "email": "support@neptunefi.com"
    }
}
