{
  "selfDescriptionCredential": {
    "@context": [
      "http://www.w3.org/ns/shacl#",
      "http://www.w3.org/2001/XMLSchema#",
      "https://registry.gaia-x.eu/api/v2206/shape/files?file=resource&type=ttl#",
      "https://registry.gaia-x.eu/api/v2206/shape/files?file=participant&type=ttl#",
      "https://registry.gaia-x.eu/api/v2206/shape/files?file=service-offering&type=ttl#"
    ],
    "id": "https://arlabdevelopments.com/.well-known/infrastructure-v2206/AdvancedCloudM.json",
    "type": [
      "VerifiableCredential",
      "ServiceOfferingExperimental"
    ],
    "credentialSubject": {
      "id": "https://arlabdevelopments.com/.well-known/infrastructure-v2206/AdvancedCloudM.json",
      "gx-service-offering:providedBy": "https://arlabdevelopments.com/.well-known/ArsysParticipant-v2206.json",
      "gx-service-offering:name": "Advanced Cloud M",
      "gx-service-offering:description": "Arsys Advanced Cloud Server - Preconfigured Model (M)",
      "gx-service-offering:ramsize": {
        "gx-service-offering:Value": "4",
        "gx-service-offering:Unit": "GB"
      },
      "gx-service-offering:disk": {
        "gx-service-offering:Value": "40",
        "gx-service-offering:Unit": "GB",
        "gx-service-offering:description": "SSD (Solid State Drives)"
      },
      "gx-service-offering:cpu": {
        "gx-service-offering:Value": "2",
        "gx-service-offering:description": "vCPU Intel Xeon"
      },
      "gx-service-offering:ipv4": "1",
      "gx-service-offering:webAddress": "https://www.arsys.net/servers/cloud",
      "gx-service-offering:hostedOn": [
        "https://arlabdevelopments.com/.well-known/datacenter-v2206/serviceDatacenterEs.json",
        "https://arlabdevelopments.com/.well-known/datacenter-v2206/serviceDatacenterUs.json"
      ],
      "gx-service-offering:termsAndConditions": [
        {
          "gx-service-offering:url": "https://www.arsys.net/legal",
          "gx-service-offering:hash": "70cf73cbb47217865004ae15949348f65272dda4da862e54c6b83615e8256809"
        },
        {
          "gx-service-offering:url": "https://www.arsys.net/terms/condiciones-30-cloud-pro-o-cloud-avanzado",
          "gx-service-offering:hash": "e7564bba1d1628327691fd33991115f09938e871daf7712d349f6b4e8b9eabf9"
        }
      ],
      "gx-service-offering:dataProtectionRegime": [
        "GDPR2016"
      ],
      "gx-service-offering:gdpr": [
        {
          "gx-service-offering:url": "https://www.arsys.net/terms/personal-data-protection",
          "gx-service-offering:hash": "1c38521fd3f205e582b129d4a642d94a73aee78aec7656127b8c71bc8d252a79"
        }
      ],
      "gx-service-offering:dataExport": [
        {
          "gx-service-offering:requestType": "emails",
          "gx-service-offering:accessType": "digital",
          "gx-service-offering:formatType": "mime/png"
        },
        {
          "gx-service-offering:requestType": "API",
          "gx-service-offering:accessType": "digital",
          "gx-service-offering:formatType": "application/json"
        },
        {
          "gx-service-offering:requestType": "webform",
          "gx-service-offering:accessType": "digital",
          "gx-service-offering:formatType": "text/html"
        }
      ]
    },
    "proof": {
      "type": "JsonWebKey2020",
      "created": "2022-08-16T14:33:36.525Z",
      "proofPurpose": "assertionMethod",
      "verificationMethod": "did:web:arlabdevelopments.com",
      "jws": "eyJhbGciOiJQUzI1NiIsImI2NCI6ZmFsc2UsImNyaXQiOlsiYjY0Il19..b45UmUgPFIUWyqa8snSvB3yltAzcPaPPgrAPPPTSO-UbhA0058hzvRg-g-Ncax0C05XUxIY7i7Bv3XSMk-CXgIaIlNsBkmjyNmK_NiWwtHbKqbxY2UcIFIR8a3n3hgm_itX4UzNbSe98ze85mMwwjF-AA2s4x5g0ghqbpWzRHFEfdDnprq4OcYbvXvtaoFx2rc5i-ZF1mZwiZI2s7X4OmLKMPgr4OZHb5hkbT0BaenuQClMHi5EI-DDdN2d0OP8q7abtS0ixNrgfdyL6VtdPAr3XanNLs6SAj21XJ6kgZ3Lc4WZA_qfzrZf5F2ZF46re9KTeygsCDUD7jBtKw4ONmA"
    }
  },
  "complianceCredential": {
    "@context": [
      "https://www.w3.org/2018/credentials/v1"
    ],
    "type": [
      "VerifiableCredential",
      "ServiceOfferingCredentialExperimental"
    ],
    "id": "https://catalogue.gaia-x.eu/credentials/ServiceOfferingCredentialExperimental/1660660419950",
    "issuer": "did:web:compliance.lab.gaia-x.eu",
    "issuanceDate": "2022-08-16T14:33:39.950Z",
    "credentialSubject": {
      "id": "https://arlabdevelopments.com/.well-known/infrastructure-v2206/AdvancedCloudM.json",
      "hash": "f8c73942277844dcdd5c344650e3d07263582128016caaf40386b1a5638ec596"
    },
    "proof": {
      "type": "JsonWebKey2020",
      "created": "2022-08-16T14:33:39.950Z",
      "proofPurpose": "assertionMethod",
      "jws": "eyJhbGciOiJQUzI1NiIsImI2NCI6ZmFsc2UsImNyaXQiOlsiYjY0Il19..Ft1VbmYjPlYyONCQaR6jXHbpZwEaolTkLEY9Xuui4W4Gr_nRLT1BUcsw0t0Uiu-hKGFhnHB7u1mJJHcPahaM2Og4mgXXKZ8Zs_UZ-8189SR8DdYgwuaw2ezBMYqjoWC6SWC4WVORKqKhd02qI-UJ2sALddmWffhMzE_wH485FkKvxuEMzjH0QhQU6lyRT4_d3e6to1alLJQHRxVWlNTeIVjU273gNxYr-0vwn2tCGVp_aKcMNijqelyzxXP8mLxwN6EVlX0YVaP-AwjutRwNRxosWYL08DwlpkLQQusGeBoOujIVAOeAv-xTXhDAyvUrhXQXTpLXzYf8EGaRXmI52Q",
      "verificationMethod": "did:web:compliance.lab.gaia-x.eu"
    }
  }
}