%YAML 1.1
%TAG !u! tag:unity3d.com,2011:
--- !u!1045 &1
EditorBuildSettings:
  m_ObjectHideFlags: 0
  serializedVersion: 2
  m_Scenes: []
  m_configObjects:
    com.unity.addressableassets: {fileID: 11400000, guid: a831fcc80add49c4f9a9af4b6ad74e25, type: 2}
