{
  "project_info": {
    "project_number": "474993992127",
    "firebase_url": "https://arav-1c890.firebaseio.com",
    "project_id": "arav-1c890",
    "storage_bucket": "arav-1c890.appspot.com"
  },
  "client": [
    {
      "client_info": {
        "mobilesdk_app_id": "1:474993992127:android:879b0e1f3bdcd01bb1810a",
        "android_client_info": {
          "package_name": "io.kolibri.aravanjarnak"
        }
      },
      "oauth_client": [
        {
          "client_id": "474993992127-td1h3ik9t4nbh3ucpbbqg7g7v6hn5ugb.apps.googleusercontent.com",
          "client_type": 3
        }
      ],
      "api_key": [
        {
          "current_key": "AIzaSyCXa1h3uBcfmAFim7edHQRPkQrSt2Sm5Tw"
        }
      ],
      "services": {
        "appinvite_service": {
          "other_platform_oauth_client": [
            {
              "client_id": "474993992127-td1h3ik9t4nbh3ucpbbqg7g7v6hn5ugb.apps.googleusercontent.com",
              "client_type": 3
            }
          ]
        }
      }
    }
  ],
  "configuration_version": "1"
}