31/03/2023 09:00,Birmingham,William Hodge,Large Flavoured hot chocolate - Caramel - 2.90,2.9,CARD,6641080278560406
31/03/2023 09:03,Birmingham,Robert Jones,"Regular Speciality Tea - Camomile - 1.30, Regular Speciality Tea - Camomile - 1.30, Large Speciality Tea - Camomile - 1.60",4.2,CARD,2502315612790734
31/03/2023 09:06,Birmingham,Marietta Rood,"Regular Cortado - 2.05, Regular Flavoured hot chocolate - Caramel - 2.60",4.65,CARD,9709597246941464
31/03/2023 09:09,Birmingham,Elma Pruett,"Large Chai latte - 2.60, Large Flavoured hot chocolate - Caramel - 2.90",5.5,CARD,2476793584172499
31/03/2023 09:12,Birmingham,Richard Williams,"Regular Cortado - 2.05, Regular Flavoured hot chocolate - Caramel - 2.60, Large Speciality Tea - Camomile - 1.60, Large Speciality Tea - English breakfast - 1.60",7.85,CASH,
31/03/2023 09:15,Birmingham,Sherry Richards,Large Speciality Tea - English breakfast - 1.60,1.6,CARD,6098321112630863
31/03/2023 09:18,Birmingham,Donna Shults,"Regular Speciality Tea - English breakfast - 1.30, Regular Speciality Tea - Camomile - 1.30",2.6,CASH,
31/03/2023 09:22,Birmingham,Dorothy Mccown,"Regular Red Label tea - 1.20, Large Speciality Tea - English breakfast - 1.60, Large Speciality Tea - English breakfast - 1.60, Regular Flavoured hot chocolate - Caramel - 2.60, Large Speciality Tea - English breakfast - 1.60",8.6,CARD,8961589831244081
31/03/2023 09:25,Birmingham,Arthur Moore,"Regular Chai latte - 2.30, Regular Flavoured hot chocolate - Caramel - 2.60",4.9,CARD,4717124597716525
31/03/2023 09:28,Birmingham,Micheal Johnson,"Regular Chai latte - 2.30, Large Red Label tea - 1.80, Large Speciality Tea - English breakfast - 1.60, Regular Red Label tea - 1.20",6.9,CASH,
31/03/2023 09:31,Birmingham,Nancy Williams,"Large Speciality Tea - English breakfast - 1.60, Regular Red Label tea - 1.20, Regular Cortado - 2.05, Large Speciality Tea - Camomile - 1.60",6.45,CARD,7415643173735480
31/03/2023 09:34,Birmingham,Gerda Stein,"Large Speciality Tea - English breakfast - 1.60, Large Speciality Tea - English breakfast - 1.60, Regular Cortado - 2.05",5.25,CARD,1652775838459647
31/03/2023 09:37,Birmingham,Hugh Villa,"Large Speciality Tea - English breakfast - 1.60, Large Chai latte - 2.60",4.2,CASH,
31/03/2023 09:40,Birmingham,Margaret Miller,Large Flavoured hot chocolate - Caramel - 2.90,2.9,CARD,8675041778065967
31/03/2023 09:44,Birmingham,Kristine Gilchrist,"Regular Red Label tea - 1.20, Regular Cortado - 2.05, Regular Chai latte - 2.30, Large Red Label tea - 1.80",7.35,CARD,5530213027048252
31/03/2023 09:47,Birmingham,Cassandra Tompkins,"Large Cortado - 2.35, Regular Red Label tea - 1.20",3.55,CARD,8624031363050667
31/03/2023 09:50,Birmingham,Alfredo Carter,"Regular Speciality Tea - English breakfast - 1.30, Large Speciality Tea - English breakfast - 1.60",2.9,CASH,
31/03/2023 09:53,Birmingham,Joseph Cook,Regular Speciality Tea - English breakfast - 1.30,1.3,CARD,6965057033617460
31/03/2023 09:56,Birmingham,Patricia Lanier,"Large Speciality Tea - English breakfast - 1.60, Regular Chai latte - 2.30",3.9,CASH,
31/03/2023 09:59,Birmingham,Edward Kemper,Large Speciality Tea - English breakfast - 1.60,1.6,CARD,6476920730545071
31/03/2023 10:03,Birmingham,Thomas Blumberg,"Large Red Label tea - 1.80, Large Flavoured hot chocolate - Caramel - 2.90, Large Flavoured hot chocolate - Caramel - 2.90, Large Flavoured hot chocolate - Caramel - 2.90, Regular Flavoured hot chocolate - Caramel - 2.60, Regular Speciality Tea - English breakfast - 1.30",14.4,CARD,6282211040208519
31/03/2023 10:04,Birmingham,Ariel Guest,"Regular Chai latte - 2.30, Large Chai latte - 2.60, Large Flavoured hot chocolate - Caramel - 2.90, Large Cortado - 2.35",10.15,CASH,
31/03/2023 10:06,Birmingham,Donna Bonilla,Regular Cortado - 2.05,2.05,CARD,9079318850388116
31/03/2023 10:07,Birmingham,Warren Graham,"Regular Red Label tea - 1.20, Regular Speciality Tea - English breakfast - 1.30, Large Cortado - 2.35",4.85,CARD,4783069278631469
31/03/2023 10:09,Birmingham,Belinda Lopez,Regular Cortado - 2.05,2.05,CARD,7516388975861557
31/03/2023 10:10,Birmingham,Margaret Mitchell,"Regular Speciality Tea - Camomile - 1.30, Large Flavoured hot chocolate - Caramel - 2.90",4.2,CASH,
31/03/2023 10:12,Birmingham,Henry Pearson,Large Speciality Tea - Camomile - 1.60,1.6,CARD,9694176667207722
31/03/2023 10:13,Birmingham,Antonio Esmond,"Regular Speciality Tea - Camomile - 1.30, Regular Flavoured hot chocolate - Caramel - 2.60, Regular Chai latte - 2.30",6.2,CARD,5565340837640799
31/03/2023 10:15,Birmingham,Thomas Kazmierczak,Regular Speciality Tea - English breakfast - 1.30,1.3,CARD,2143721820483657
31/03/2023 10:16,Birmingham,Susan Truitt,"Regular Speciality Tea - Camomile - 1.30, Large Cortado - 2.35, Regular Chai latte - 2.30, Large Speciality Tea - Camomile - 1.60, Large Speciality Tea - Camomile - 1.60, Regular Red Label tea - 1.20",10.35,CARD,4066469952528328
31/03/2023 10:18,Birmingham,Agustin Kim,"Large Speciality Tea - Camomile - 1.60, Regular Speciality Tea - English breakfast - 1.30, Regular Flavoured hot chocolate - Caramel - 2.60",5.5,CARD,4501100135632909
31/03/2023 10:19,Birmingham,James Ross,"Large Chai latte - 2.60, Regular Chai latte - 2.30, Regular Speciality Tea - English breakfast - 1.30",6.2,CARD,4148712493298511
31/03/2023 10:21,Birmingham,Maxine Jones,"Regular Speciality Tea - Camomile - 1.30, Large Speciality Tea - English breakfast - 1.60",2.9,CASH,
31/03/2023 10:22,Birmingham,Lynne Schmidt,"Large Flavoured hot chocolate - Caramel - 2.90, Large Speciality Tea - Camomile - 1.60",4.5,CARD,7492783126851150
31/03/2023 10:24,Birmingham,Lucy Pace,Large Flavoured hot chocolate - Caramel - 2.90,2.9,CARD,7401167514933413
31/03/2023 10:26,Birmingham,Orlando Kane,"Large Chai latte - 2.60, Regular Red Label tea - 1.20, Regular Chai latte - 2.30",6.1,CASH,
31/03/2023 10:27,Birmingham,Steven Steffen,"Large Speciality Tea - Camomile - 1.60, Large Cortado - 2.35",3.95,CARD,4802018001642702
31/03/2023 10:29,Birmingham,Gerald Vann,Large Chai latte - 2.60,2.6,CASH,
31/03/2023 10:30,Birmingham,Steven Granata,Large Chai latte - 2.60,2.6,CARD,6579118348014502
31/03/2023 10:32,Birmingham,Eileen Overstreet,"Large Cortado - 2.35, Large Speciality Tea - English breakfast - 1.60",3.95,CASH,
31/03/2023 10:33,Birmingham,Mary Gilbert,"Large Red Label tea - 1.80, Large Red Label tea - 1.80, Regular Speciality Tea - English breakfast - 1.30, Regular Red Label tea - 1.20",6.1,CARD,4400514071708632
31/03/2023 10:35,Birmingham,Jason Frandsen,"Regular Chai latte - 2.30, Large Red Label tea - 1.80, Large Speciality Tea - Camomile - 1.60, Large Chai latte - 2.60",8.3,CASH,
31/03/2023 10:36,Birmingham,Daniel Fisher,Regular Speciality Tea - Camomile - 1.30,1.3,CARD,3212247626732249
31/03/2023 10:38,Birmingham,Wendy Shipman,"Large Speciality Tea - English breakfast - 1.60, Regular Speciality Tea - Camomile - 1.30, Regular Flavoured hot chocolate - Caramel - 2.60, Regular Cortado - 2.05",7.55,CARD,2284531455536645
31/03/2023 10:39,Birmingham,Bryan Sherrod,"Large Cortado - 2.35, Large Flavoured hot chocolate - Caramel - 2.90, Large Speciality Tea - English breakfast - 1.60, Regular Speciality Tea - Camomile - 1.30, Large Speciality Tea - English breakfast - 1.60, Regular Cortado - 2.05",11.8,CARD,1930941792729884
31/03/2023 10:41,Birmingham,Rocco Bebee,"Large Cortado - 2.35, Large Cortado - 2.35",4.7,CARD,9337922731709758
31/03/2023 10:42,Birmingham,Dixie Fanter,"Regular Speciality Tea - Camomile - 1.30, Regular Speciality Tea - English breakfast - 1.30",2.6,CARD,5018061761344623
31/03/2023 10:44,Birmingham,Kathleen Hamlin,"Regular Red Label tea - 1.20, Regular Cortado - 2.05, Regular Speciality Tea - Camomile - 1.30, Regular Speciality Tea - Camomile - 1.30",5.85,CARD,4942149760156799
31/03/2023 10:45,Birmingham,Calvin Payne,Large Speciality Tea - English breakfast - 1.60,1.6,CARD,2565865547926095
31/03/2023 10:47,Birmingham,Ann Woods,"Large Speciality Tea - English breakfast - 1.60, Regular Speciality Tea - Camomile - 1.30, Regular Speciality Tea - Camomile - 1.30, Large Speciality Tea - Camomile - 1.60, Large Speciality Tea - English breakfast - 1.60, Large Flavoured hot chocolate - Caramel - 2.90",10.3,CASH,
31/03/2023 10:49,Birmingham,Patricia Varela,"Regular Flavoured hot chocolate - Caramel - 2.60, Large Red Label tea - 1.80, Regular Speciality Tea - English breakfast - 1.30, Large Red Label tea - 1.80, Large Speciality Tea - Camomile - 1.60",9.1,CARD,7832444823502594
31/03/2023 10:50,Birmingham,Nancy Brogan,Regular Speciality Tea - English breakfast - 1.30,1.3,CARD,8947300026942916
31/03/2023 10:52,Birmingham,Pauline Blackston,Regular Cortado - 2.05,2.05,CASH,
31/03/2023 10:53,Birmingham,Kelly Perry,"Large Chai latte - 2.60, Large Cortado - 2.35",4.95,CARD,8603577177181434
31/03/2023 10:55,Birmingham,Dona Zeller,"Regular Speciality Tea - English breakfast - 1.30, Regular Red Label tea - 1.20, Large Chai latte - 2.60",5.1,CASH,
31/03/2023 10:56,Birmingham,Virgie Moffett,"Regular Speciality Tea - Camomile - 1.30, Large Speciality Tea - Camomile - 1.60, Large Chai latte - 2.60, Regular Flavoured hot chocolate - Caramel - 2.60",8.1,CASH,
31/03/2023 10:58,Birmingham,John Thornton,"Large Speciality Tea - English breakfast - 1.60, Large Cortado - 2.35",3.95,CARD,7688602940394890
31/03/2023 10:59,Birmingham,Carolyn Schmidt,Regular Speciality Tea - English breakfast - 1.30,1.3,CARD,1440139431767161
31/03/2023 11:01,Birmingham,Deborah Goff,"Regular Chai latte - 2.30, Regular Flavoured hot chocolate - Caramel - 2.60, Large Speciality Tea - Camomile - 1.60, Large Chai latte - 2.60, Regular Speciality Tea - Camomile - 1.30",10.4,CASH,
31/03/2023 11:16,Birmingham,Donna Lewis,"Large Chai latte - 2.60, Large Speciality Tea - English breakfast - 1.60",4.2,CASH,
31/03/2023 11:31,Birmingham,Angelina Strange,"Large Speciality Tea - Camomile - 1.60, Large Chai latte - 2.60",4.2,CARD,9270094004343506
31/03/2023 11:46,Birmingham,Brian Owens,"Regular Cortado - 2.05, Large Cortado - 2.35, Large Speciality Tea - Camomile - 1.60",6.0,CARD,9848090522493122
31/03/2023 12:01,Birmingham,Thurman Rathke,Large Speciality Tea - English breakfast - 1.60,1.6,CARD,1968364656857165
31/03/2023 12:04,Birmingham,Eldon Miller,"Regular Chai latte - 2.30, Regular Cortado - 2.05, Large Cortado - 2.35, Large Speciality Tea - Camomile - 1.60",8.3,CARD,5820410266279974
31/03/2023 12:06,Birmingham,Gail Marcus,"Regular Red Label tea - 1.20, Large Cortado - 2.35, Large Speciality Tea - English breakfast - 1.60",5.15,CASH,
31/03/2023 12:09,Birmingham,Amelia Harris,"Regular Speciality Tea - Camomile - 1.30, Regular Speciality Tea - Camomile - 1.30",2.6,CARD,1280707793052175
31/03/2023 12:12,Birmingham,William Toliver,"Regular Flavoured hot chocolate - Caramel - 2.60, Large Speciality Tea - English breakfast - 1.60, Large Speciality Tea - English breakfast - 1.60, Large Flavoured hot chocolate - Caramel - 2.90",8.7,CARD,7993746864675167
31/03/2023 12:15,Birmingham,Jane Cook,"Large Speciality Tea - Camomile - 1.60, Large Flavoured hot chocolate - Caramel - 2.90",4.5,CARD,8847729315061011
31/03/2023 12:18,Birmingham,Randall Heatherly,Large Red Label tea - 1.80,1.8,CARD,8651862694266326
31/03/2023 12:21,Birmingham,William Ennis,Large Speciality Tea - Camomile - 1.60,1.6,CARD,7538052064257495
31/03/2023 12:24,Birmingham,Pamela Gonzalez,"Large Red Label tea - 1.80, Large Red Label tea - 1.80",3.6,CASH,
31/03/2023 12:26,Birmingham,Michael Hall,"Large Speciality Tea - English breakfast - 1.60, Regular Flavoured hot chocolate - Caramel - 2.60",4.2,CARD,1581524391256177
31/03/2023 12:29,Birmingham,David Ballard,"Regular Cortado - 2.05, Regular Speciality Tea - English breakfast - 1.30, Large Speciality Tea - Camomile - 1.60, Regular Cortado - 2.05, Large Red Label tea - 1.80",8.8,CARD,7405910884386728
31/03/2023 12:32,Birmingham,Charles Baskin,"Regular Flavoured hot chocolate - Caramel - 2.60, Large Red Label tea - 1.80, Regular Speciality Tea - English breakfast - 1.30",5.7,CASH,
31/03/2023 12:35,Birmingham,Irma Good,Regular Speciality Tea - English breakfast - 1.30,1.3,CARD,9490515302888493
31/03/2023 12:38,Birmingham,Todd Ramirez,"Large Cortado - 2.35, Large Flavoured hot chocolate - Caramel - 2.90, Large Chai latte - 2.60",7.85,CARD,3120650948509662
31/03/2023 12:41,Birmingham,Barbara Lucas,"Large Speciality Tea - English breakfast - 1.60, Regular Flavoured hot chocolate - Caramel - 2.60",4.2,CARD,6346852915877031
31/03/2023 12:44,Birmingham,Samuel Begay,"Regular Speciality Tea - English breakfast - 1.30, Large Chai latte - 2.60",3.9,CARD,2429622137868196
31/03/2023 12:46,Birmingham,Erik Conaughty,"Large Red Label tea - 1.80, Regular Red Label tea - 1.20",3.0,CARD,4979301931738196
31/03/2023 12:49,Birmingham,Hilario Fackler,"Large Red Label tea - 1.80, Large Chai latte - 2.60, Large Flavoured hot chocolate - Caramel - 2.90, Large Speciality Tea - Camomile - 1.60",8.9,CARD,8698895970941284
31/03/2023 12:52,Birmingham,Salvatore Jones,"Large Cortado - 2.35, Regular Speciality Tea - English breakfast - 1.30",3.65,CASH,
31/03/2023 12:55,Birmingham,Lauren Elia,"Large Flavoured hot chocolate - Caramel - 2.90, Large Flavoured hot chocolate - Caramel - 2.90, Large Speciality Tea - Camomile - 1.60",7.4,CARD,8555267675091982
31/03/2023 12:58,Birmingham,Sarah Heminger,Large Chai latte - 2.60,2.6,CASH,
31/03/2023 13:01,Birmingham,Wilhelmina Chevas,Regular Chai latte - 2.30,2.3,CARD,1677961448453222
31/03/2023 13:02,Birmingham,Rick Anderson,Large Cortado - 2.35,2.35,CASH,
31/03/2023 13:03,Birmingham,Kathy Parrott,Large Speciality Tea - English breakfast - 1.60,1.6,CASH,
31/03/2023 13:04,Birmingham,Florinda Ringel,"Regular Red Label tea - 1.20, Regular Speciality Tea - Camomile - 1.30, Large Speciality Tea - Camomile - 1.60, Large Speciality Tea - Camomile - 1.60, Large Speciality Tea - Camomile - 1.60",7.3,CARD,3242496121418005
31/03/2023 13:05,Birmingham,Avis Swindle,"Large Chai latte - 2.60, Large Red Label tea - 1.80, Regular Speciality Tea - Camomile - 1.30, Large Speciality Tea - Camomile - 1.60",7.3,CARD,3972712261336048
31/03/2023 13:06,Birmingham,Joan Williams,"Large Red Label tea - 1.80, Regular Flavoured hot chocolate - Caramel - 2.60, Regular Speciality Tea - English breakfast - 1.30, Large Speciality Tea - English breakfast - 1.60, Regular Speciality Tea - English breakfast - 1.30",8.6,CASH,
31/03/2023 13:07,Birmingham,Flossie Mccann,Large Cortado - 2.35,2.35,CARD,2730034004356393
31/03/2023 13:08,Birmingham,Joseph Lenk,Large Flavoured hot chocolate - Caramel - 2.90,2.9,CARD,4656211624652323
31/03/2023 13:09,Birmingham,Kyle Leclair,"Large Cortado - 2.35, Large Chai latte - 2.60, Large Speciality Tea - English breakfast - 1.60, Large Speciality Tea - English breakfast - 1.60, Large Speciality Tea - English breakfast - 1.60",9.75,CARD,2058945658328292
31/03/2023 13:11,Birmingham,Helen Knutson,"Regular Speciality Tea - English breakfast - 1.30, Regular Red Label tea - 1.20, Large Cortado - 2.35, Large Red Label tea - 1.80, Large Flavoured hot chocolate - Caramel - 2.90, Large Speciality Tea - Camomile - 1.60",11.15,CASH,
31/03/2023 13:12,Birmingham,Darrell Orosco,"Large Flavoured hot chocolate - Caramel - 2.90, Regular Red Label tea - 1.20, Regular Red Label tea - 1.20, Regular Speciality Tea - English breakfast - 1.30",6.6,CARD,8816919187105394
31/03/2023 13:13,Birmingham,Ronald Mcmillen,"Large Flavoured hot chocolate - Caramel - 2.90, Large Chai latte - 2.60, Large Flavoured hot chocolate - Caramel - 2.90",8.4,CARD,4180388143128136
31/03/2023 13:14,Birmingham,Jennifer Lang,"Large Speciality Tea - English breakfast - 1.60, Regular Chai latte - 2.30, Regular Red Label tea - 1.20",5.1,CARD,9190331267791768
31/03/2023 13:15,Birmingham,Karen Becher,Regular Red Label tea - 1.20,1.2,CARD,7830001541234220
31/03/2023 13:16,Birmingham,Virginia Greener,"Large Flavoured hot chocolate - Caramel - 2.90, Large Speciality Tea - English breakfast - 1.60, Regular Flavoured hot chocolate - Caramel - 2.60, Regular Chai latte - 2.30, Large Speciality Tea - Camomile - 1.60, Regular Cortado - 2.05",13.05,CARD,4197900852450846
31/03/2023 13:17,Birmingham,Eula Baltazar,"Large Speciality Tea - Camomile - 1.60, Large Red Label tea - 1.80, Large Cortado - 2.35, Regular Speciality Tea - English breakfast - 1.30",7.05,CASH,
31/03/2023 13:18,Birmingham,Joyce Proctor,Large Chai latte - 2.60,2.6,CASH,
31/03/2023 13:19,Birmingham,Alden Garfinkle,Regular Red Label tea - 1.20,1.2,CASH,
31/03/2023 13:20,Birmingham,Zachery Clark,"Regular Flavoured hot chocolate - Caramel - 2.60, Large Cortado - 2.35, Large Speciality Tea - English breakfast - 1.60, Regular Speciality Tea - Camomile - 1.30, Large Speciality Tea - Camomile - 1.60, Large Cortado - 2.35",11.8,CARD,3242418387670634
31/03/2023 13:22,Birmingham,William Bouie,"Large Speciality Tea - Camomile - 1.60, Large Speciality Tea - Camomile - 1.60",3.2,CARD,1731833706598799
31/03/2023 13:23,Birmingham,Jessie Martin,"Large Cortado - 2.35, Regular Speciality Tea - Camomile - 1.30",3.65,CARD,6858828845593638
31/03/2023 13:24,Birmingham,David Vega,"Regular Chai latte - 2.30, Regular Red Label tea - 1.20, Regular Speciality Tea - English breakfast - 1.30, Large Cortado - 2.35, Regular Chai latte - 2.30",9.45,CARD,4929305626581208
31/03/2023 13:25,Birmingham,Laurence Perry,"Large Chai latte - 2.60, Large Red Label tea - 1.80, Large Speciality Tea - Camomile - 1.60, Regular Red Label tea - 1.20, Regular Cortado - 2.05",9.25,CARD,9781274287101769
31/03/2023 13:26,Birmingham,Robert Terry,Large Speciality Tea - English breakfast - 1.60,1.6,CASH,
31/03/2023 13:27,Birmingham,Allison Robbins,Large Speciality Tea - Camomile - 1.60,1.6,CARD,7388613994085589
31/03/2023 13:28,Birmingham,Casey Chandler,"Large Cortado - 2.35, Regular Cortado - 2.05",4.4,CASH,
31/03/2023 13:29,Birmingham,Sam Seger,"Large Red Label tea - 1.80, Regular Speciality Tea - English breakfast - 1.30, Regular Chai latte - 2.30, Large Cortado - 2.35, Regular Speciality Tea - English breakfast - 1.30",9.05,CASH,
31/03/2023 13:30,Birmingham,Jennifer Ramey,"Regular Speciality Tea - Camomile - 1.30, Large Speciality Tea - English breakfast - 1.60",2.9,CARD,1945817235854900
31/03/2023 13:31,Birmingham,Tracy Plumley,"Large Red Label tea - 1.80, Regular Speciality Tea - Camomile - 1.30, Regular Speciality Tea - Camomile - 1.30, Regular Speciality Tea - English breakfast - 1.30",5.7,CASH,
31/03/2023 13:33,Birmingham,Jonathan Vaughn,"Large Red Label tea - 1.80, Regular Chai latte - 2.30, Large Speciality Tea - English breakfast - 1.60, Large Flavoured hot chocolate - Caramel - 2.90",8.6,CARD,2746961323618044
31/03/2023 13:34,Birmingham,Jared Anderson,"Large Speciality Tea - English breakfast - 1.60, Regular Cortado - 2.05, Large Red Label tea - 1.80",5.45,CARD,2865568280765038
31/03/2023 13:35,Birmingham,Lisa Hinson,"Large Speciality Tea - English breakfast - 1.60, Large Red Label tea - 1.80, Large Chai latte - 2.60, Regular Speciality Tea - English breakfast - 1.30",7.3,CARD,4558466740641523
31/03/2023 13:36,Birmingham,James Valley,"Large Cortado - 2.35, Regular Chai latte - 2.30",4.65,CASH,
31/03/2023 13:37,Birmingham,Eloise Mitchell,"Large Speciality Tea - Camomile - 1.60, Large Chai latte - 2.60, Large Speciality Tea - Camomile - 1.60",5.8,CARD,7594915805013127
31/03/2023 13:38,Birmingham,Melissa Ferrar,"Regular Chai latte - 2.30, Regular Speciality Tea - English breakfast - 1.30, Regular Chai latte - 2.30",5.9,CASH,
31/03/2023 13:39,Birmingham,Trinidad Anger,"Large Speciality Tea - Camomile - 1.60, Large Speciality Tea - English breakfast - 1.60, Large Speciality Tea - English breakfast - 1.60, Regular Flavoured hot chocolate - Caramel - 2.60, Large Speciality Tea - Camomile - 1.60",9.0,CARD,5405081760013851
31/03/2023 13:40,Birmingham,Elizabeth Bly,"Large Red Label tea - 1.80, Regular Speciality Tea - English breakfast - 1.30, Large Chai latte - 2.60",5.7,CARD,4092536989227093
31/03/2023 13:41,Birmingham,Myrtle Bundy,"Large Chai latte - 2.60, Large Speciality Tea - English breakfast - 1.60, Large Red Label tea - 1.80",6.0,CARD,6257458984077736
31/03/2023 13:42,Birmingham,Dolores Bertrand,"Large Speciality Tea - Camomile - 1.60, Regular Speciality Tea - English breakfast - 1.30, Regular Red Label tea - 1.20, Large Speciality Tea - Camomile - 1.60",5.7,CARD,1717658077056698
31/03/2023 13:44,Birmingham,Isaiah Wisneski,"Regular Cortado - 2.05, Large Speciality Tea - Camomile - 1.60",3.65,CARD,7401053748636104
31/03/2023 13:45,Birmingham,Kurt Barnett,"Large Speciality Tea - Camomile - 1.60, Regular Chai latte - 2.30, Regular Chai latte - 2.30, Large Red Label tea - 1.80, Regular Chai latte - 2.30",10.3,CASH,
31/03/2023 13:46,Birmingham,Tasha Miller,Regular Speciality Tea - Camomile - 1.30,1.3,CARD,5499750900350367
31/03/2023 13:47,Birmingham,Arnold Hilser,Regular Speciality Tea - English breakfast - 1.30,1.3,CARD,8200582647184658
31/03/2023 13:48,Birmingham,Ronald Dudley,"Regular Chai latte - 2.30, Regular Speciality Tea - English breakfast - 1.30",3.6,CASH,
31/03/2023 13:49,Birmingham,Stuart Dancy,"Large Flavoured hot chocolate - Caramel - 2.90, Regular Speciality Tea - English breakfast - 1.30, Regular Speciality Tea - English breakfast - 1.30",5.5,CARD,6114362278318415
31/03/2023 13:50,Birmingham,Candace Taunton,"Regular Speciality Tea - Camomile - 1.30, Large Flavoured hot chocolate - Caramel - 2.90, Regular Red Label tea - 1.20",5.4,CARD,4649241167277788
31/03/2023 13:51,Birmingham,Melanie Drew,"Regular Flavoured hot chocolate - Caramel - 2.60, Regular Speciality Tea - English breakfast - 1.30",3.9,CARD,8628378817221972
31/03/2023 13:52,Birmingham,Edwin Austell,"Regular Cortado - 2.05, Regular Flavoured hot chocolate - Caramel - 2.60, Regular Cortado - 2.05",6.7,CASH,
31/03/2023 13:53,Birmingham,Laura Mitchell,"Regular Red Label tea - 1.20, Large Speciality Tea - English breakfast - 1.60, Large Red Label tea - 1.80, Regular Speciality Tea - English breakfast - 1.30, Large Chai latte - 2.60",8.5,CARD,9349803213341267
31/03/2023 13:55,Birmingham,Victor Martin,"Large Chai latte - 2.60, Regular Chai latte - 2.30, Large Speciality Tea - English breakfast - 1.60",6.5,CARD,5558613775282715
31/03/2023 13:56,Birmingham,Richard Hunter,"Large Speciality Tea - English breakfast - 1.60, Regular Speciality Tea - Camomile - 1.30",2.9,CASH,
31/03/2023 13:57,Birmingham,Robert Sanders,"Large Red Label tea - 1.80, Large Red Label tea - 1.80, Large Speciality Tea - English breakfast - 1.60, Large Red Label tea - 1.80",7.0,CASH,
31/03/2023 13:58,Birmingham,Cindy Tuck,Regular Flavoured hot chocolate - Caramel - 2.60,2.6,CARD,9408691476346585
31/03/2023 13:59,Birmingham,Danielle Crabill,"Regular Speciality Tea - English breakfast - 1.30, Large Speciality Tea - English breakfast - 1.60, Large Speciality Tea - Camomile - 1.60",4.5,CASH,
31/03/2023 14:00,Birmingham,Raymond England,"Regular Flavoured hot chocolate - Caramel - 2.60, Regular Cortado - 2.05, Regular Chai latte - 2.30, Regular Speciality Tea - Camomile - 1.30",8.25,CARD,9845855492071069
31/03/2023 14:01,Birmingham,Brady Burnett,"Regular Red Label tea - 1.20, Large Red Label tea - 1.80",3.0,CASH,
31/03/2023 14:02,Birmingham,Debbie Fredrickson,"Regular Speciality Tea - English breakfast - 1.30, Large Speciality Tea - Camomile - 1.60",2.9,CARD,1937092742547188
31/03/2023 14:03,Birmingham,Todd Michell,"Large Red Label tea - 1.80, Large Speciality Tea - English breakfast - 1.60, Regular Speciality Tea - Camomile - 1.30, Large Chai latte - 2.60",7.3,CARD,9815025498018611
31/03/2023 14:05,Birmingham,Robert Howland,"Regular Speciality Tea - English breakfast - 1.30, Large Speciality Tea - English breakfast - 1.60, Large Flavoured hot chocolate - Caramel - 2.90, Large Speciality Tea - English breakfast - 1.60",7.4,CARD,3754593376299816
31/03/2023 14:06,Birmingham,Harvey Graham,Regular Speciality Tea - English breakfast - 1.30,1.3,CASH,
31/03/2023 14:07,Birmingham,Juan West,"Large Red Label tea - 1.80, Regular Flavoured hot chocolate - Caramel - 2.60",4.4,CARD,4806680815303078
31/03/2023 14:08,Birmingham,Amy Gurley,"Large Red Label tea - 1.80, Large Speciality Tea - English breakfast - 1.60, Large Chai latte - 2.60",6.0,CASH,
31/03/2023 14:09,Birmingham,Kari Grissom,Regular Red Label tea - 1.20,1.2,CASH,
31/03/2023 14:10,Birmingham,Gerald Hopkins,"Large Chai latte - 2.60, Large Cortado - 2.35, Regular Speciality Tea - English breakfast - 1.30, Regular Chai latte - 2.30, Large Speciality Tea - English breakfast - 1.60",10.15,CARD,9115897426588732
31/03/2023 14:12,Birmingham,Sharon Lynch,"Large Flavoured hot chocolate - Caramel - 2.90, Regular Flavoured hot chocolate - Caramel - 2.60",5.5,CARD,8259419059647669
31/03/2023 14:13,Birmingham,Melissa Small,"Regular Red Label tea - 1.20, Large Flavoured hot chocolate - Caramel - 2.90, Regular Red Label tea - 1.20, Large Speciality Tea - Camomile - 1.60, Regular Flavoured hot chocolate - Caramel - 2.60",9.5,CARD,6404089729045185
31/03/2023 14:14,Birmingham,Michael Rastorfer,"Regular Chai latte - 2.30, Large Chai latte - 2.60, Regular Speciality Tea - English breakfast - 1.30, Large Chai latte - 2.60, Regular Speciality Tea - Camomile - 1.30, Large Flavoured hot chocolate - Caramel - 2.90",13.0,CASH,
31/03/2023 14:15,Birmingham,Robert Regalado,"Large Speciality Tea - Camomile - 1.60, Regular Red Label tea - 1.20",2.8,CARD,6271695994211845
31/03/2023 14:16,Birmingham,Brittany Malady,"Regular Speciality Tea - English breakfast - 1.30, Large Speciality Tea - English breakfast - 1.60",2.9,CARD,4403179676461234
31/03/2023 14:17,Birmingham,Dorthy Newton,"Large Red Label tea - 1.80, Regular Chai latte - 2.30, Large Chai latte - 2.60, Large Speciality Tea - Camomile - 1.60, Regular Flavoured hot chocolate - Caramel - 2.60, Large Speciality Tea - English breakfast - 1.60",12.5,CARD,7220489893547547
31/03/2023 14:18,Birmingham,Guadalupe Eidson,"Large Speciality Tea - English breakfast - 1.60, Regular Chai latte - 2.30, Large Flavoured hot chocolate - Caramel - 2.90, Large Red Label tea - 1.80, Large Speciality Tea - Camomile - 1.60, Large Speciality Tea - English breakfast - 1.60",11.8,CARD,7280016851989915
31/03/2023 14:20,Birmingham,Ernest Hilburn,"Large Speciality Tea - Camomile - 1.60, Regular Speciality Tea - Camomile - 1.30",2.9,CARD,9026567788746924
31/03/2023 14:21,Birmingham,Heather Yohe,Regular Chai latte - 2.30,2.3,CASH,
31/03/2023 14:22,Birmingham,Deborah Hayes,"Large Cortado - 2.35, Regular Flavoured hot chocolate - Caramel - 2.60, Regular Speciality Tea - English breakfast - 1.30",6.25,CASH,
31/03/2023 14:23,Birmingham,Rachel Johnson,"Regular Speciality Tea - English breakfast - 1.30, Large Cortado - 2.35",3.65,CASH,
31/03/2023 14:24,Birmingham,Jackie Villagomez,"Large Cortado - 2.35, Regular Flavoured hot chocolate - Caramel - 2.60",4.95,CARD,3967446335761310
31/03/2023 14:25,Birmingham,Tyler Aldrich,"Regular Cortado - 2.05, Regular Cortado - 2.05, Regular Cortado - 2.05, Regular Speciality Tea - Camomile - 1.30, Regular Red Label tea - 1.20, Large Speciality Tea - English breakfast - 1.60",10.25,CASH,
31/03/2023 14:26,Birmingham,Gladys Reyes,"Large Cortado - 2.35, Large Chai latte - 2.60, Large Flavoured hot chocolate - Caramel - 2.90",7.85,CARD,7827358913237017
31/03/2023 14:28,Birmingham,Christopher Reese,Large Speciality Tea - Camomile - 1.60,1.6,CARD,9911072451430267
31/03/2023 14:29,Birmingham,Robin Wright,"Large Speciality Tea - English breakfast - 1.60, Regular Speciality Tea - English breakfast - 1.30, Regular Speciality Tea - English breakfast - 1.30",4.2,CARD,8936194982673031
31/03/2023 14:30,Birmingham,Lee Merz,"Large Flavoured hot chocolate - Caramel - 2.90, Large Chai latte - 2.60, Regular Red Label tea - 1.20",6.7,CASH,
31/03/2023 14:31,Birmingham,Randy Gardner,"Regular Speciality Tea - English breakfast - 1.30, Regular Red Label tea - 1.20, Regular Chai latte - 2.30, Regular Speciality Tea - English breakfast - 1.30, Regular Flavoured hot chocolate - Caramel - 2.60, Large Red Label tea - 1.80",10.5,CARD,9669724665596188
31/03/2023 14:32,Birmingham,Edward Allred,"Regular Flavoured hot chocolate - Caramel - 2.60, Large Flavoured hot chocolate - Caramel - 2.90",5.5,CASH,
31/03/2023 14:33,Birmingham,Lupe Nicholson,"Large Speciality Tea - Camomile - 1.60, Large Speciality Tea - Camomile - 1.60, Large Cortado - 2.35, Regular Cortado - 2.05",7.6,CASH,
31/03/2023 14:35,Birmingham,Cynthia Messler,"Large Speciality Tea - Camomile - 1.60, Large Speciality Tea - Camomile - 1.60, Large Speciality Tea - Camomile - 1.60, Large Chai latte - 2.60, Large Chai latte - 2.60",10.0,CARD,3180106463252893
31/03/2023 14:36,Birmingham,Milton Flores,"Large Red Label tea - 1.80, Regular Chai latte - 2.30",4.1,CARD,2087652909501211
31/03/2023 14:37,Birmingham,David Ballinger,"Regular Cortado - 2.05, Large Chai latte - 2.60",4.65,CASH,
31/03/2023 14:38,Birmingham,Robert Yarber,"Large Cortado - 2.35, Regular Cortado - 2.05",4.4,CARD,6983199575529584
31/03/2023 14:39,Birmingham,Richard Wilson,Regular Chai latte - 2.30,2.3,CARD,5863007469707172
31/03/2023 14:40,Birmingham,Stefanie Slavick,"Large Flavoured hot chocolate - Caramel - 2.90, Large Red Label tea - 1.80",4.7,CASH,
31/03/2023 14:41,Birmingham,Eva Allen,Large Red Label tea - 1.80,1.8,CARD,9445565108178462
31/03/2023 14:43,Birmingham,Sheila Schrader,"Large Speciality Tea - Camomile - 1.60, Regular Chai latte - 2.30",3.9,CARD,4076395265471515
31/03/2023 14:44,Birmingham,Richard Witmer,"Large Flavoured hot chocolate - Caramel - 2.90, Large Speciality Tea - English breakfast - 1.60",4.5,CARD,6233048688886403
31/03/2023 14:45,Birmingham,Norma Tatom,"Regular Red Label tea - 1.20, Regular Speciality Tea - English breakfast - 1.30, Large Speciality Tea - English breakfast - 1.60",4.1,CARD,3503324659947127
31/03/2023 14:46,Birmingham,Lesley Luallen,"Large Red Label tea - 1.80, Large Speciality Tea - English breakfast - 1.60, Large Cortado - 2.35, Regular Chai latte - 2.30",8.05,CARD,9495832612530488
31/03/2023 14:47,Birmingham,Kara Watson,"Regular Flavoured hot chocolate - Caramel - 2.60, Regular Red Label tea - 1.20, Regular Cortado - 2.05",5.85,CARD,8275670503575130
31/03/2023 14:48,Birmingham,James Contreras,"Regular Speciality Tea - Camomile - 1.30, Large Speciality Tea - English breakfast - 1.60, Regular Cortado - 2.05, Large Chai latte - 2.60",7.55,CARD,2959586446182631
31/03/2023 14:49,Birmingham,Amy Kendall,"Regular Speciality Tea - Camomile - 1.30, Regular Chai latte - 2.30, Regular Red Label tea - 1.20, Large Cortado - 2.35, Regular Red Label tea - 1.20, Regular Speciality Tea - Camomile - 1.30",9.65,CARD,3452429792804140
31/03/2023 14:51,Birmingham,Rosalina Holt,"Large Cortado - 2.35, Regular Cortado - 2.05",4.4,CASH,
31/03/2023 14:52,Birmingham,Scott Hill,"Large Speciality Tea - English breakfast - 1.60, Regular Cortado - 2.05, Regular Chai latte - 2.30",5.95,CARD,9343152063479286
31/03/2023 14:53,Birmingham,Theresa Gran,"Regular Cortado - 2.05, Regular Speciality Tea - English breakfast - 1.30",3.35,CARD,5124441450215649
31/03/2023 14:54,Birmingham,Marcia Bell,"Large Speciality Tea - Camomile - 1.60, Regular Chai latte - 2.30",3.9,CARD,6678191358448900
31/03/2023 14:55,Birmingham,Rafael Flanagan,"Regular Chai latte - 2.30, Large Chai latte - 2.60, Regular Red Label tea - 1.20, Large Flavoured hot chocolate - Caramel - 2.90",9.0,CASH,
31/03/2023 14:56,Birmingham,Evelyn Chain,"Large Speciality Tea - English breakfast - 1.60, Large Red Label tea - 1.80, Regular Cortado - 2.05",5.45,CARD,7486338223994941
31/03/2023 14:58,Birmingham,Julia Steely,"Large Speciality Tea - English breakfast - 1.60, Regular Cortado - 2.05, Large Flavoured hot chocolate - Caramel - 2.90",6.55,CARD,8018259963407109
31/03/2023 14:59,Birmingham,Suzanne Hogan,"Large Chai latte - 2.60, Regular Cortado - 2.05, Large Chai latte - 2.60",7.25,CASH,
31/03/2023 15:00,Birmingham,Beverly Hess,"Regular Speciality Tea - English breakfast - 1.30, Large Speciality Tea - Camomile - 1.60, Large Speciality Tea - Camomile - 1.60, Regular Speciality Tea - Camomile - 1.30, Large Chai latte - 2.60, Regular Chai latte - 2.30",10.7,CARD,9118963374255571
31/03/2023 15:01,Birmingham,Earl Poston,"Regular Chai latte - 2.30, Large Cortado - 2.35, Regular Red Label tea - 1.20, Large Speciality Tea - Camomile - 1.60, Regular Speciality Tea - English breakfast - 1.30",8.75,CARD,8375662063963133
31/03/2023 15:02,Birmingham,Grady Dampier,"Regular Cortado - 2.05, Regular Chai latte - 2.30, Regular Speciality Tea - Camomile - 1.30, Large Chai latte - 2.60, Large Cortado - 2.35, Regular Chai latte - 2.30",12.9,CARD,7737524653551492
31/03/2023 15:04,Birmingham,Terrence Gonzalez,"Large Speciality Tea - Camomile - 1.60, Regular Speciality Tea - English breakfast - 1.30, Regular Red Label tea - 1.20, Regular Chai latte - 2.30",6.4,CARD,1732055289838080
31/03/2023 15:05,Birmingham,Sandy Oneal,"Large Red Label tea - 1.80, Regular Red Label tea - 1.20, Large Cortado - 2.35",5.35,CASH,
31/03/2023 15:06,Birmingham,Edward Alfonso,"Regular Speciality Tea - Camomile - 1.30, Large Flavoured hot chocolate - Caramel - 2.90",4.2,CARD,4711133521668534
31/03/2023 15:07,Birmingham,Annie Blok,"Regular Red Label tea - 1.20, Regular Cortado - 2.05",3.25,CARD,7874526376646455
31/03/2023 15:09,Birmingham,Lillian Dewispelaere,Regular Flavoured hot chocolate - Caramel - 2.60,2.6,CARD,1656597293137316
31/03/2023 15:10,Birmingham,Janet Taylor,"Regular Chai latte - 2.30, Regular Flavoured hot chocolate - Caramel - 2.60",4.9,CARD,6179812730138519
31/03/2023 15:11,Birmingham,Aurora Davignon,"Regular Flavoured hot chocolate - Caramel - 2.60, Large Chai latte - 2.60",5.2,CASH,
31/03/2023 15:12,Birmingham,Nancy Bevington,"Large Chai latte - 2.60, Large Speciality Tea - English breakfast - 1.60, Regular Speciality Tea - English breakfast - 1.30, Large Speciality Tea - Camomile - 1.60",7.1,CASH,
31/03/2023 15:14,Birmingham,Lisa Penn,"Large Red Label tea - 1.80, Regular Flavoured hot chocolate - Caramel - 2.60, Large Chai latte - 2.60, Large Cortado - 2.35",9.35,CARD,3676974052245060
31/03/2023 15:15,Birmingham,Joseph Sakkinen,Large Cortado - 2.35,2.35,CARD,7383909443304920
31/03/2023 15:16,Birmingham,James Halyk,Large Red Label tea - 1.80,1.8,CARD,1377211266983401
31/03/2023 15:18,Birmingham,Sandra Jones,"Regular Cortado - 2.05, Regular Chai latte - 2.30, Large Cortado - 2.35",6.7,CASH,
31/03/2023 15:19,Birmingham,Irma Steele,"Regular Speciality Tea - Camomile - 1.30, Large Flavoured hot chocolate - Caramel - 2.90",4.2,CARD,2024612239522792
31/03/2023 15:20,Birmingham,Anthony Soto,"Regular Cortado - 2.05, Regular Cortado - 2.05, Regular Chai latte - 2.30, Regular Chai latte - 2.30, Large Chai latte - 2.60",11.3,CASH,
31/03/2023 15:21,Birmingham,Kenneth Hansel,"Large Speciality Tea - Camomile - 1.60, Regular Speciality Tea - English breakfast - 1.30, Large Speciality Tea - Camomile - 1.60, Regular Speciality Tea - English breakfast - 1.30, Large Speciality Tea - English breakfast - 1.60, Large Speciality Tea - English breakfast - 1.60",9.0,CARD,6154613716550950
31/03/2023 15:23,Birmingham,Chris Youngblood,"Regular Cortado - 2.05, Large Cortado - 2.35",4.4,CASH,
31/03/2023 15:24,Birmingham,Edmundo Miller,"Regular Chai latte - 2.30, Large Flavoured hot chocolate - Caramel - 2.90, Regular Red Label tea - 1.20",6.4,CARD,2101144759183321
31/03/2023 15:25,Birmingham,Lisa Cuccia,"Large Speciality Tea - English breakfast - 1.60, Large Red Label tea - 1.80, Large Speciality Tea - English breakfast - 1.60",5.0,CARD,6707369808681660
31/03/2023 15:26,Birmingham,Stacie Curry,"Regular Speciality Tea - Camomile - 1.30, Large Speciality Tea - Camomile - 1.60, Large Flavoured hot chocolate - Caramel - 2.90, Large Chai latte - 2.60, Large Speciality Tea - English breakfast - 1.60",10.0,CARD,4954702667191536
31/03/2023 15:28,Birmingham,Neil Schaich,"Large Flavoured hot chocolate - Caramel - 2.90, Regular Cortado - 2.05",4.95,CARD,1000270977252061
31/03/2023 15:29,Birmingham,Allen Cox,Large Red Label tea - 1.80,1.8,CARD,9773114800839774
31/03/2023 15:30,Birmingham,Piper Klare,"Regular Speciality Tea - English breakfast - 1.30, Regular Speciality Tea - English breakfast - 1.30, Regular Red Label tea - 1.20",3.8,CASH,
31/03/2023 15:31,Birmingham,Kenneth Mercado,"Large Speciality Tea - Camomile - 1.60, Large Cortado - 2.35, Large Chai latte - 2.60, Regular Speciality Tea - Camomile - 1.30",7.85,CARD,7510097820770049
31/03/2023 15:33,Birmingham,Michelle Lavoie,"Regular Speciality Tea - Camomile - 1.30, Large Red Label tea - 1.80",3.1,CARD,4771853090874281
31/03/2023 15:34,Birmingham,Richard Warren,"Large Speciality Tea - English breakfast - 1.60, Regular Cortado - 2.05, Regular Speciality Tea - English breakfast - 1.30",4.95,CARD,5386623809374549
31/03/2023 15:35,Birmingham,John Chen,"Large Chai latte - 2.60, Regular Chai latte - 2.30",4.9,CARD,4917632922475048
31/03/2023 15:37,Birmingham,Carlton Manheim,"Large Red Label tea - 1.80, Large Chai latte - 2.60",4.4,CARD,7339757822690133
31/03/2023 15:38,Birmingham,William Sherwood,"Regular Cortado - 2.05, Large Speciality Tea - English breakfast - 1.60, Large Chai latte - 2.60",6.25,CARD,4647866363102876
31/03/2023 15:39,Birmingham,George Terrio,"Regular Speciality Tea - English breakfast - 1.30, Regular Chai latte - 2.30, Large Speciality Tea - Camomile - 1.60",5.2,CARD,9701036019416025
31/03/2023 15:40,Birmingham,Lisa Augustine,"Large Cortado - 2.35, Regular Speciality Tea - Camomile - 1.30, Large Flavoured hot chocolate - Caramel - 2.90, Large Speciality Tea - Camomile - 1.60",8.15,CARD,9986305631308034
31/03/2023 15:42,Birmingham,Christine Nelson,"Regular Cortado - 2.05, Regular Chai latte - 2.30, Regular Chai latte - 2.30, Regular Cortado - 2.05",8.7,CARD,2211575284519532
31/03/2023 15:43,Birmingham,Robert Pina,"Regular Speciality Tea - Camomile - 1.30, Large Speciality Tea - English breakfast - 1.60, Regular Flavoured hot chocolate - Caramel - 2.60, Large Speciality Tea - Camomile - 1.60, Regular Cortado - 2.05, Large Cortado - 2.35",11.5,CARD,2461193847619351
31/03/2023 15:44,Birmingham,Stanley Singleton,"Large Cortado - 2.35, Large Speciality Tea - English breakfast - 1.60, Large Cortado - 2.35, Regular Chai latte - 2.30, Regular Speciality Tea - Camomile - 1.30",9.9,CARD,2468688420428377
31/03/2023 15:45,Birmingham,Raymond Dreyer,"Regular Chai latte - 2.30, Regular Flavoured hot chocolate - Caramel - 2.60",4.9,CASH,
31/03/2023 15:47,Birmingham,Pearl Taft,Regular Speciality Tea - English breakfast - 1.30,1.3,CARD,6144692236589244
31/03/2023 15:48,Birmingham,Buford Larkins,Regular Speciality Tea - English breakfast - 1.30,1.3,CARD,7590375470055292
31/03/2023 15:49,Birmingham,Joyce Bean,"Regular Chai latte - 2.30, Regular Flavoured hot chocolate - Caramel - 2.60, Regular Speciality Tea - English breakfast - 1.30, Regular Cortado - 2.05",8.25,CARD,8036535143798753
31/03/2023 15:50,Birmingham,Maria Shockley,"Regular Red Label tea - 1.20, Large Chai latte - 2.60",3.8,CARD,6911969706768252
31/03/2023 15:52,Birmingham,Marvin Manzione,"Regular Speciality Tea - English breakfast - 1.30, Large Speciality Tea - Camomile - 1.60, Large Cortado - 2.35, Large Red Label tea - 1.80",7.05,CARD,1607767612244952
31/03/2023 15:53,Birmingham,Danny Dempsy,"Regular Speciality Tea - Camomile - 1.30, Regular Cortado - 2.05, Large Chai latte - 2.60, Regular Speciality Tea - Camomile - 1.30",7.25,CASH,
31/03/2023 15:54,Birmingham,Benjamin Robbins,"Regular Red Label tea - 1.20, Regular Cortado - 2.05",3.25,CARD,8201124457335579
31/03/2023 15:56,Birmingham,Glenda Johnson,"Regular Speciality Tea - Camomile - 1.30, Regular Cortado - 2.05",3.35,CASH,
31/03/2023 15:57,Birmingham,Horace Whitney,"Regular Chai latte - 2.30, Large Flavoured hot chocolate - Caramel - 2.90, Regular Chai latte - 2.30",7.5,CARD,2847365557866231
31/03/2023 15:58,Birmingham,Laura Sedlock,"Large Chai latte - 2.60, Regular Flavoured hot chocolate - Caramel - 2.60",5.2,CASH,
31/03/2023 15:59,Birmingham,Linda Novak,Regular Speciality Tea - English breakfast - 1.30,1.3,CASH,
31/03/2023 16:01,Birmingham,Joel Hopkins,"Large Chai latte - 2.60, Large Speciality Tea - Camomile - 1.60",4.2,CASH,
31/03/2023 16:04,Birmingham,Marian Bryant,Regular Red Label tea - 1.20,1.2,CARD,7605365294610633
31/03/2023 16:08,Birmingham,Priscilla Berry,"Large Speciality Tea - English breakfast - 1.60, Large Chai latte - 2.60, Large Red Label tea - 1.80, Regular Cortado - 2.05",8.05,CASH,
31/03/2023 16:11,Birmingham,Kandace Snyder,Regular Chai latte - 2.30,2.3,CASH,
31/03/2023 16:15,Birmingham,Sheryl Clouthier,"Large Speciality Tea - Camomile - 1.60, Regular Flavoured hot chocolate - Caramel - 2.60",4.2,CARD,4156335368246280
31/03/2023 16:18,Birmingham,Michelle Nelson,"Large Speciality Tea - English breakfast - 1.60, Regular Red Label tea - 1.20, Large Flavoured hot chocolate - Caramel - 2.90, Large Speciality Tea - English breakfast - 1.60",7.3,CASH,
31/03/2023 16:22,Birmingham,John Garcia,"Large Red Label tea - 1.80, Large Speciality Tea - English breakfast - 1.60",3.4,CASH,
31/03/2023 16:25,Birmingham,Sue Coleman,"Regular Flavoured hot chocolate - Caramel - 2.60, Large Speciality Tea - English breakfast - 1.60, Large Chai latte - 2.60, Large Red Label tea - 1.80",8.6,CARD,6025254518395649
31/03/2023 16:29,Birmingham,Devorah Lee,Large Flavoured hot chocolate - Caramel - 2.90,2.9,CARD,3148374709993397
31/03/2023 16:32,Birmingham,Jesse Zaring,"Large Chai latte - 2.60, Regular Cortado - 2.05",4.65,CARD,1535296630325391
31/03/2023 16:36,Birmingham,Tina Brookshire,"Large Cortado - 2.35, Regular Cortado - 2.05, Large Red Label tea - 1.80",6.2,CASH,
31/03/2023 16:39,Birmingham,Kent Myers,"Large Speciality Tea - Camomile - 1.60, Large Red Label tea - 1.80, Regular Red Label tea - 1.20, Regular Cortado - 2.05",6.65,CARD,1622099409765022
31/03/2023 16:43,Birmingham,Olga Holley,"Regular Flavoured hot chocolate - Caramel - 2.60, Regular Speciality Tea - English breakfast - 1.30",3.9,CARD,1993457542501848
31/03/2023 16:46,Birmingham,Dudley Delacruz,"Regular Chai latte - 2.30, Regular Speciality Tea - Camomile - 1.30, Large Speciality Tea - Camomile - 1.60, Large Flavoured hot chocolate - Caramel - 2.90",8.1,CARD,3818542205636111
31/03/2023 16:50,Birmingham,Orlando Martin,"Large Flavoured hot chocolate - Caramel - 2.90, Large Red Label tea - 1.80",4.7,CARD,8791881383789177
31/03/2023 16:53,Birmingham,Jo Kirtley,Regular Red Label tea - 1.20,1.2,CARD,1274383715437819
31/03/2023 16:57,Birmingham,Traci Fritzler,Large Cortado - 2.35,2.35,CARD,2501807510205028
