%YAML 1.1
%TAG !u! tag:unity3d.com,2011:
--- !u!1 &4798782898589426993
GameObject:
  m_ObjectHideFlags: 0
  m_CorrespondingSourceObject: {fileID: 0}
  m_PrefabInstance: {fileID: 0}
  m_PrefabAsset: {fileID: 0}
  serializedVersion: 6
  m_Component:
  - component: {fileID: 1088595609049975090}
  - component: {fileID: 5979104967143487178}
  - component: {fileID: 3291070188056987320}
  m_Layer: 31
  m_Name: Layer1
  m_TagString: Untagged
  m_Icon: {fileID: 0}
  m_NavMeshLayer: 0
  m_StaticEditorFlags: 0
  m_IsActive: 1
--- !u!4 &1088595609049975090
Transform:
  m_ObjectHideFlags: 0
  m_CorrespondingSourceObject: {fileID: 0}
  m_PrefabInstance: {fileID: 0}
  m_PrefabAsset: {fileID: 0}
  m_GameObject: {fileID: 4798782898589426993}
  m_LocalRotation: {x: -0, y: -0, z: -0, w: 1}
  m_LocalPosition: {x: 0, y: 0, z: 0}
  m_LocalScale: {x: 1, y: 1, z: 1}
  m_Children: []
  m_Father: {fileID: 5719534692759502933}
  m_RootOrder: 0
  m_LocalEulerAnglesHint: {x: 0, y: 0, z: 0}
--- !u!1839735485 &5979104967143487178
Tilemap:
  m_ObjectHideFlags: 0
  m_CorrespondingSourceObject: {fileID: 0}
  m_PrefabInstance: {fileID: 0}
  m_PrefabAsset: {fileID: 0}
  m_GameObject: {fileID: 4798782898589426993}
  m_Enabled: 1
  m_Tiles:
  - first: {x: -2, y: -3, z: 0}
    second:
      m_TileIndex: 20
      m_TileSpriteIndex: 20
      m_TileMatrixIndex: 0
      m_TileColorIndex: 0
      m_ObjectToInstantiate: {fileID: 0}
      m_TileFlags: 1
      m_ColliderType: 1
  - first: {x: -1, y: -3, z: 0}
    second:
      m_TileIndex: 21
      m_TileSpriteIndex: 21
      m_TileMatrixIndex: 0
      m_TileColorIndex: 0
      m_ObjectToInstantiate: {fileID: 0}
      m_TileFlags: 1
      m_ColliderType: 1
  - first: {x: 0, y: -3, z: 0}
    second:
      m_TileIndex: 22
      m_TileSpriteIndex: 22
      m_TileMatrixIndex: 0
      m_TileColorIndex: 0
      m_ObjectToInstantiate: {fileID: 0}
      m_TileFlags: 1
      m_ColliderType: 1
  - first: {x: -2, y: -2, z: 0}
    second:
      m_TileIndex: 15
      m_TileSpriteIndex: 15
      m_TileMatrixIndex: 0
      m_TileColorIndex: 0
      m_ObjectToInstantiate: {fileID: 0}
      m_TileFlags: 1
      m_ColliderType: 1
  - first: {x: -1, y: -2, z: 0}
    second:
      m_TileIndex: 16
      m_TileSpriteIndex: 16
      m_TileMatrixIndex: 0
      m_TileColorIndex: 0
      m_ObjectToInstantiate: {fileID: 0}
      m_TileFlags: 1
      m_ColliderType: 1
  - first: {x: 0, y: -2, z: 0}
    second:
      m_TileIndex: 17
      m_TileSpriteIndex: 17
      m_TileMatrixIndex: 0
      m_TileColorIndex: 0
      m_ObjectToInstantiate: {fileID: 0}
      m_TileFlags: 1
      m_ColliderType: 1
  - first: {x: 1, y: -2, z: 0}
    second:
      m_TileIndex: 18
      m_TileSpriteIndex: 18
      m_TileMatrixIndex: 0
      m_TileColorIndex: 0
      m_ObjectToInstantiate: {fileID: 0}
      m_TileFlags: 1
      m_ColliderType: 1
  - first: {x: 2, y: -2, z: 0}
    second:
      m_TileIndex: 19
      m_TileSpriteIndex: 19
      m_TileMatrixIndex: 0
      m_TileColorIndex: 0
      m_ObjectToInstantiate: {fileID: 0}
      m_TileFlags: 1
      m_ColliderType: 1
  - first: {x: -2, y: -1, z: 0}
    second:
      m_TileIndex: 10
      m_TileSpriteIndex: 10
      m_TileMatrixIndex: 0
      m_TileColorIndex: 0
      m_ObjectToInstantiate: {fileID: 0}
      m_TileFlags: 1
      m_ColliderType: 1
  - first: {x: -1, y: -1, z: 0}
    second:
      m_TileIndex: 11
      m_TileSpriteIndex: 11
      m_TileMatrixIndex: 0
      m_TileColorIndex: 0
      m_ObjectToInstantiate: {fileID: 0}
      m_TileFlags: 1
      m_ColliderType: 1
  - first: {x: 0, y: -1, z: 0}
    second:
      m_TileIndex: 12
      m_TileSpriteIndex: 12
      m_TileMatrixIndex: 0
      m_TileColorIndex: 0
      m_ObjectToInstantiate: {fileID: 0}
      m_TileFlags: 1
      m_ColliderType: 1
  - first: {x: 1, y: -1, z: 0}
    second:
      m_TileIndex: 13
      m_TileSpriteIndex: 13
      m_TileMatrixIndex: 0
      m_TileColorIndex: 0
      m_ObjectToInstantiate: {fileID: 0}
      m_TileFlags: 1
      m_ColliderType: 1
  - first: {x: 2, y: -1, z: 0}
    second:
      m_TileIndex: 14
      m_TileSpriteIndex: 14
      m_TileMatrixIndex: 0
      m_TileColorIndex: 0
      m_ObjectToInstantiate: {fileID: 0}
      m_TileFlags: 1
      m_ColliderType: 1
  - first: {x: -2, y: 0, z: 0}
    second:
      m_TileIndex: 5
      m_TileSpriteIndex: 5
      m_TileMatrixIndex: 0
      m_TileColorIndex: 0
      m_ObjectToInstantiate: {fileID: 0}
      m_TileFlags: 1
      m_ColliderType: 1
  - first: {x: -1, y: 0, z: 0}
    second:
      m_TileIndex: 6
      m_TileSpriteIndex: 6
      m_TileMatrixIndex: 0
      m_TileColorIndex: 0
      m_ObjectToInstantiate: {fileID: 0}
      m_TileFlags: 1
      m_ColliderType: 1
  - first: {x: 0, y: 0, z: 0}
    second:
      m_TileIndex: 7
      m_TileSpriteIndex: 7
      m_TileMatrixIndex: 0
      m_TileColorIndex: 0
      m_ObjectToInstantiate: {fileID: 0}
      m_TileFlags: 1
      m_ColliderType: 1
  - first: {x: 1, y: 0, z: 0}
    second:
      m_TileIndex: 8
      m_TileSpriteIndex: 8
      m_TileMatrixIndex: 0
      m_TileColorIndex: 0
      m_ObjectToInstantiate: {fileID: 0}
      m_TileFlags: 1
      m_ColliderType: 1
  - first: {x: 2, y: 0, z: 0}
    second:
      m_TileIndex: 9
      m_TileSpriteIndex: 9
      m_TileMatrixIndex: 0
      m_TileColorIndex: 0
      m_ObjectToInstantiate: {fileID: 0}
      m_TileFlags: 1
      m_ColliderType: 1
  - first: {x: -2, y: 1, z: 0}
    second:
      m_TileIndex: 0
      m_TileSpriteIndex: 0
      m_TileMatrixIndex: 0
      m_TileColorIndex: 0
      m_ObjectToInstantiate: {fileID: 0}
      m_TileFlags: 1
      m_ColliderType: 1
  - first: {x: -1, y: 1, z: 0}
    second:
      m_TileIndex: 1
      m_TileSpriteIndex: 1
      m_TileMatrixIndex: 0
      m_TileColorIndex: 0
      m_ObjectToInstantiate: {fileID: 0}
      m_TileFlags: 1
      m_ColliderType: 1
  - first: {x: 0, y: 1, z: 0}
    second:
      m_TileIndex: 2
      m_TileSpriteIndex: 2
      m_TileMatrixIndex: 0
      m_TileColorIndex: 0
      m_ObjectToInstantiate: {fileID: 0}
      m_TileFlags: 1
      m_ColliderType: 1
  - first: {x: 1, y: 1, z: 0}
    second:
      m_TileIndex: 3
      m_TileSpriteIndex: 3
      m_TileMatrixIndex: 0
      m_TileColorIndex: 0
      m_ObjectToInstantiate: {fileID: 0}
      m_TileFlags: 1
      m_ColliderType: 1
  - first: {x: 2, y: 1, z: 0}
    second:
      m_TileIndex: 4
      m_TileSpriteIndex: 4
      m_TileMatrixIndex: 0
      m_TileColorIndex: 0
      m_ObjectToInstantiate: {fileID: 0}
      m_TileFlags: 1
      m_ColliderType: 1
  m_AnimatedTiles: {}
  m_TileAssetArray:
  - m_RefCount: 1
    m_Data: {fileID: 11400000, guid: 2b420bad1d911c14e84af7dfcaadb95d, type: 2}
  - m_RefCount: 1
    m_Data: {fileID: 11400000, guid: f4de22dbd0e40e04aa2ec4fa78ae22cc, type: 2}
  - m_RefCount: 1
    m_Data: {fileID: 11400000, guid: c7cfa95f51b2ae94c91a57649b2b26e3, type: 2}
  - m_RefCount: 1
    m_Data: {fileID: 11400000, guid: 92fce3239baf88044b591d72fc899001, type: 2}
  - m_RefCount: 1
    m_Data: {fileID: 11400000, guid: 438dd76ec12552a4bb68bd40e3a07e0e, type: 2}
  - m_RefCount: 1
    m_Data: {fileID: 11400000, guid: 69e8d7eb3fc5a984388965ca7d59cd3d, type: 2}
  - m_RefCount: 1
    m_Data: {fileID: 11400000, guid: 374e40a69006d2f4ebfd8e9a623eee5b, type: 2}
  - m_RefCount: 1
    m_Data: {fileID: 11400000, guid: 0a60abf72eb79dd4eb3571908b622c64, type: 2}
  - m_RefCount: 1
    m_Data: {fileID: 11400000, guid: bda9887e14c977243afc48d0bcddf22e, type: 2}
  - m_RefCount: 1
    m_Data: {fileID: 11400000, guid: 96938cca892798145be45978616039c4, type: 2}
  - m_RefCount: 1
    m_Data: {fileID: 11400000, guid: 44c75899e1e4a104293883fe96c61040, type: 2}
  - m_RefCount: 1
    m_Data: {fileID: 11400000, guid: 6844c4ca27b3ec04da43c5f60e1495c2, type: 2}
  - m_RefCount: 1
    m_Data: {fileID: 11400000, guid: bdc8887da16e04640b5b5c8a88f181b7, type: 2}
  - m_RefCount: 1
    m_Data: {fileID: 11400000, guid: 8f38d76a8faa8ff47ad2f47e45c8fcbb, type: 2}
  - m_RefCount: 1
    m_Data: {fileID: 11400000, guid: c60fe38a21b953041841790bd1837862, type: 2}
  - m_RefCount: 1
    m_Data: {fileID: 11400000, guid: 5f078d448a4169e4294a7026a864654e, type: 2}
  - m_RefCount: 1
    m_Data: {fileID: 11400000, guid: 892103542c4c94a459631e703364a7f5, type: 2}
  - m_RefCount: 1
    m_Data: {fileID: 11400000, guid: db0313d8ac02a914681ec99d22ff44d0, type: 2}
  - m_RefCount: 1
    m_Data: {fileID: 11400000, guid: a684b3af7d615d74d8a42d8893a53c8c, type: 2}
  - m_RefCount: 1
    m_Data: {fileID: 11400000, guid: 3be8c2289794ae245b5b37f9e002c9f9, type: 2}
  - m_RefCount: 1
    m_Data: {fileID: 11400000, guid: f2151294ae7f1fa4e9107400bcc40f28, type: 2}
  - m_RefCount: 1
    m_Data: {fileID: 11400000, guid: c55c38d5d0388154590bbd52a40ed545, type: 2}
  - m_RefCount: 1
    m_Data: {fileID: 11400000, guid: b041ab0f4fcbbe44b80bca70c048fe0c, type: 2}
  m_TileSpriteArray:
  - m_RefCount: 1
    m_Data: {fileID: 21300000, guid: 63ad18c6725ff2f49bf12bee1e398d8e, type: 3}
  - m_RefCount: 1
    m_Data: {fileID: 21300000, guid: 61fa27570d5b48241a5adf414cb7ce7c, type: 3}
  - m_RefCount: 1
    m_Data: {fileID: 21300000, guid: 649edd28af01b884cac8f02eec4f3534, type: 3}
  - m_RefCount: 1
    m_Data: {fileID: 21300000, guid: 130ad3e930c27ff4db751f5244a50549, type: 3}
  - m_RefCount: 1
    m_Data: {fileID: 21300000, guid: 20535e3a8b0059442883bba1c82f49aa, type: 3}
  - m_RefCount: 1
    m_Data: {fileID: 21300000, guid: 258ced7a9926407449da3faa6b1b7fb0, type: 3}
  - m_RefCount: 1
    m_Data: {fileID: 21300000, guid: 250c329a389c22a49952d5881d5abeec, type: 3}
  - m_RefCount: 1
    m_Data: {fileID: 21300000, guid: 9a2de7c39dade4b43b1d1939ae13da00, type: 3}
  - m_RefCount: 1
    m_Data: {fileID: 21300000, guid: 8b67a504253b73f438101dd1e5cdbc27, type: 3}
  - m_RefCount: 1
    m_Data: {fileID: 21300000, guid: 6d5f2cc453009044da7e9d62b5ee9a2e, type: 3}
  - m_RefCount: 1
    m_Data: {fileID: 21300000, guid: 76d22ce6aace37e4ca81a7831d516903, type: 3}
  - m_RefCount: 1
    m_Data: {fileID: 21300000, guid: 6680fc1910c5fe648ad31c2d9e4bb368, type: 3}
  - m_RefCount: 1
    m_Data: {fileID: 21300000, guid: 99f26329430965140934b29217a84be7, type: 3}
  - m_RefCount: 1
    m_Data: {fileID: 21300000, guid: d086f09af8ba42045a3de55cf2912578, type: 3}
  - m_RefCount: 1
    m_Data: {fileID: 21300000, guid: 7854311c734016044a4598da4fff2973, type: 3}
  - m_RefCount: 1
    m_Data: {fileID: 21300000, guid: bc46245cf1d08b94d8c3697d108be68e, type: 3}
  - m_RefCount: 1
    m_Data: {fileID: 21300000, guid: d466f3acc58b6954aa5ea91486b1b203, type: 3}
  - m_RefCount: 1
    m_Data: {fileID: 21300000, guid: 7c0fa7ac858609e4aa67b0b978921bcb, type: 3}
  - m_RefCount: 1
    m_Data: {fileID: 21300000, guid: 7c9bdfbc98dd12c4484db30f4ce8da5e, type: 3}
  - m_RefCount: 1
    m_Data: {fileID: 21300000, guid: fc1af950d66100d4c88fd5b3af1524af, type: 3}
  - m_RefCount: 1
    m_Data: {fileID: 21300000, guid: e9be7925c5e3f814899789b692c1e60d, type: 3}
  - m_RefCount: 1
    m_Data: {fileID: 21300000, guid: f0bffdf7bd0cd5b468208bb049eb3980, type: 3}
  - m_RefCount: 1
    m_Data: {fileID: 21300000, guid: e1e9b5abe513eab4aae19803c8458ce8, type: 3}
  m_TileMatrixArray:
  - m_RefCount: 23
    m_Data:
      e00: 1
      e01: 0
      e02: 0
      e03: 0
      e10: 0
      e11: 1
      e12: 0
      e13: 0
      e20: 0
      e21: 0
      e22: 1
      e23: 0
      e30: 0
      e31: 0
      e32: 0
      e33: 1
  m_TileColorArray:
  - m_RefCount: 23
    m_Data: {r: 1, g: 1, b: 1, a: 1}
  m_AnimationFrameRate: 1
  m_Color: {r: 1, g: 1, b: 1, a: 1}
  m_Origin: {x: -2, y: -3, z: 0}
  m_Size: {x: 5, y: 5, z: 1}
  m_TileAnchor: {x: 0.5, y: 0.5, z: 0}
  m_TileOrientation: 0
  m_TileOrientationMatrix:
    e00: 1
    e01: 0
    e02: 0
    e03: 0
    e10: 0
    e11: 1
    e12: 0
    e13: 0
    e20: 0
    e21: 0
    e22: 1
    e23: 0
    e30: 0
    e31: 0
    e32: 0
    e33: 1
--- !u!483693784 &3291070188056987320
TilemapRenderer:
  m_ObjectHideFlags: 0
  m_CorrespondingSourceObject: {fileID: 0}
  m_PrefabInstance: {fileID: 0}
  m_PrefabAsset: {fileID: 0}
  m_GameObject: {fileID: 4798782898589426993}
  m_Enabled: 0
  m_CastShadows: 0
  m_ReceiveShadows: 0
  m_DynamicOccludee: 0
  m_MotionVectors: 1
  m_LightProbeUsage: 0
  m_ReflectionProbeUsage: 0
  m_RenderingLayerMask: 1
  m_RendererPriority: 0
  m_Materials:
  - {fileID: 10754, guid: 0000000000000000f000000000000000, type: 0}
  m_StaticBatchInfo:
    firstSubMesh: 0
    subMeshCount: 0
  m_StaticBatchRoot: {fileID: 0}
  m_ProbeAnchor: {fileID: 0}
  m_LightProbeVolumeOverride: {fileID: 0}
  m_ScaleInLightmap: 1
  m_PreserveUVs: 0
  m_IgnoreNormalsForChartDetection: 0
  m_ImportantGI: 0
  m_StitchLightmapSeams: 1
  m_SelectedEditorRenderState: 0
  m_MinimumChartSize: 4
  m_AutoUVMaxDistance: 0.5
  m_AutoUVMaxAngle: 89
  m_LightmapParameters: {fileID: 0}
  m_SortingLayerID: 0
  m_SortingLayer: 0
  m_SortingOrder: 0
  m_ChunkSize: {x: 32, y: 32, z: 32}
  m_ChunkCullingBounds: {x: 0, y: 0, z: 0}
  m_MaxChunkCount: 16
  m_MaxFrameAge: 16
  m_SortOrder: 0
  m_Mode: 0
  m_DetectChunkCullingBounds: 0
  m_MaskInteraction: 0
--- !u!1 &7725677649874746295
GameObject:
  m_ObjectHideFlags: 0
  m_CorrespondingSourceObject: {fileID: 0}
  m_PrefabInstance: {fileID: 0}
  m_PrefabAsset: {fileID: 0}
  serializedVersion: 6
  m_Component:
  - component: {fileID: 5719534692759502933}
  - component: {fileID: 4172545467835819958}
  m_Layer: 31
  m_Name: TileMapPallete
  m_TagString: Untagged
  m_Icon: {fileID: 0}
  m_NavMeshLayer: 0
  m_StaticEditorFlags: 0
  m_IsActive: 1
--- !u!4 &5719534692759502933
Transform:
  m_ObjectHideFlags: 0
  m_CorrespondingSourceObject: {fileID: 0}
  m_PrefabInstance: {fileID: 0}
  m_PrefabAsset: {fileID: 0}
  m_GameObject: {fileID: 7725677649874746295}
  m_LocalRotation: {x: 0, y: 0, z: 0, w: 1}
  m_LocalPosition: {x: 0, y: 0, z: 0}
  m_LocalScale: {x: 1, y: 1, z: 1}
  m_Children:
  - {fileID: 1088595609049975090}
  m_Father: {fileID: 0}
  m_RootOrder: 0
  m_LocalEulerAnglesHint: {x: 0, y: 0, z: 0}
--- !u!156049354 &4172545467835819958
Grid:
  m_ObjectHideFlags: 0
  m_CorrespondingSourceObject: {fileID: 0}
  m_PrefabInstance: {fileID: 0}
  m_PrefabAsset: {fileID: 0}
  m_GameObject: {fileID: 7725677649874746295}
  m_Enabled: 1
  m_CellSize: {x: 1, y: 1, z: 0}
  m_CellGap: {x: 0, y: 0, z: 0}
  m_CellLayout: 0
  m_CellSwizzle: 0
--- !u!114 &6641628214934080711
MonoBehaviour:
  m_ObjectHideFlags: 0
  m_CorrespondingSourceObject: {fileID: 0}
  m_PrefabInstance: {fileID: 0}
  m_PrefabAsset: {fileID: 0}
  m_GameObject: {fileID: 0}
  m_Enabled: 1
  m_EditorHideFlags: 0
  m_Script: {fileID: 12395, guid: 0000000000000000e000000000000000, type: 0}
  m_Name: Palette Settings
  m_EditorClassIdentifier: 
  cellSizing: 0
