<?xml version="1.0" encoding="utf-8"?>
<!-- Generator: Adobe Illustrator 21.0.0, SVG Export Plug-In . SVG Version: 6.00 Build 0)  -->
<svg version="1.1" id="Layer_1" xmlns="http://www.w3.org/2000/svg" xmlns:xlink="http://www.w3.org/1999/xlink" x="0px" y="0px"
	 viewBox="0 0 950 910.3" style="enable-background:new 0 0 950 910.3;" xml:space="preserve">
<style type="text/css">
	.st0{fill:none;}
	.st1{fill:#2662B3;}
	.st2{fill:#E9EDEA;}
	.st3{fill:#FFFFFF;}
	.st4{fill:#1F1919;}
	.st5{fill:#EEFFF7;}
	.st6{fill:#95395C;}
	.st7{fill:#C2CDC5;}
</style>
<g>
	<path class="st0" d="M787.5,570.1l-3.3-1.5l-0.9,1.3c1.7,0,2.6,0.1,2.6,0.1S786.5,569.9,787.5,570.1z"/>
	<path class="st1" d="M808.2,586.2c9.8,6,20.7,10.5,29.6,12.2c-6.9-8-15.2-14.7-24.3-20c-9.5-5.6-21.8-7.7-26.1-8.3
		C787.5,570.1,798.4,580.2,808.2,586.2z"/>
	<path class="st2" d="M660.5,0c-2.6,0.2-2.7,2.4-2.7,2.4L692,557.7l-5.5-3.2c0,0-2.9,0-4.6,3.4c-1.8,3.4-2.6,4.8-1,8.5
		c1.6,3.7,8.4,7,8.4,7l4.4,13.2l2.9,48.6l0.5,7.2l3.5-0.2l-1.4-32.7l-0.9-22.1L698,581L663,1.8C663,1.8,663.1-0.2,660.5,0z"/>
	<path class="st3" d="M622.8,687.8c0,0-6-8.2-8.8-8.1c-2.8,0.2-6.6,8.4-6.2,11c0.3,2.6,6.4,8.7,10.2,8.5c3.8-0.2,5.3-7,5.3-7
		L667,691l-19.7-9L622.8,687.8z"/>
	<path class="st2" d="M641.1,615.3c-0.7-0.2-1.4-0.3-1.7,0c-1.2,1.2-4.8,4.5-6.3,8.6s0.6,9.5,0.6,9.5s6.4-8.2,7.8-10.9
		C643,619.7,642.3,618.2,641.1,615.3z"/>
	<path class="st3" d="M667,691l0.3,0.1c0.5-0.1,0.8-0.2,0.8-0.2L667,691z"/>
	<path class="st2" d="M686.1,699.8L239.2,907.9c-0.1,0.3-0.2,0.6-0.2,1c0.2,2,2.8,0.6,2.8,0.6L638,725.9l1.5-2.2l-1.5,2.2l35.2-17
		l-32.1,22.8l5.7-0.3l-5.7,0.3l0,0c1.2,2.1,2.6,4.1,3.3,4.5c1.8,1,3.7,0,3.7,0s9.9,13,12.2,14.4c2.4,1.5,5.9-1.8,7.3-3.3
		c1.4-1.5,27.5-34.8,27.5-34.8L686.1,699.8L686.1,699.8z"/>
	<path class="st1" d="M673.2,708.8l-35.2,17c0,0,1.5,3,3.1,5.7l0,0L673.2,708.8z"/>
	<path class="st4" d="M722.5,582.5c6.8,5.9,42.2,30.5,42.2,30.5l1.3-2.2c0,0-15.4-10.3-17.3-11.6l1.5-1.9l-1.7-0.9l-2.8,1.8
		c0,0-30.2-18.7-28-27.4c-0.8,0.3-1.5,0.6-2,1C715.8,571.7,715.7,576.6,722.5,582.5z"/>
	<path class="st1" d="M667.3,691.2c-3.6,0.7-18.1,3.7-23.1,6.4c-5.8,3-14.1,8-14.1,8s2.1,6.2,4.2,9.2c2.2,3,2.8,5.6,2.8,5.6
		L241.5,905.9c0,0-1.8,0.7-2.3,2l446.9-208.2L667.3,691.2z"/>
	<path class="st3" d="M449.9,585.5c-3.7,5.5-3.3,4.6-5.2,3.4c0,0,0.9,4.1,4,0.8c3.1-3.3,6.1-11.2,6-13.7c-0.2-2.4-2-3.4-6-3.6
		l-176.8-80.2l179.7,84.1C451.6,576.3,453.5,580,449.9,585.5z"/>
	<path class="st4" d="M820.9,641.7c0,0-0.8-3.1-1-4.1c0.3,1.4-2.4,2.1-2.4,2.1l-7.3-5.3c0.6-3.8-0.2-11.2-0.2-11.2s-1.6,9-2,9.9
		c-0.4,0.9,1.2,1.2-5.9-2c-7.2-3.2-28.9-14.1-28.9-14.1s41.2,25.6,56.5,31l-1-1.3l1,1.3l0.9-0.1c0.4,0,0.8-0.1,1.2-0.1L820.9,641.7z
		"/>
	<path class="st3" d="M829.6,647.9c0.3,0,0.6-0.1,0.9-0.1L829.6,647.9L829.6,647.9z"/>
	<path class="st4" d="M795.5,579.7c0,0-8.3,1.5-16,3c-6.3,1.2-20.2,6-25.1,7.7l0,0c0,0,29.5-8.3,44.8-8.3c0,0,12,8,16.5,10.4
		c0,0,4.2,24,4.2,37.5c0,0,1.5-21.1-1.5-35.8c0,0,13.5,5.9,22.5,8c-1-1.3-2-2.5-3-3.7l-1.2,1l1.2-1c-8.9-1.7-19.8-6.2-29.6-12.2
		c-9.8-6-20.7-16.1-20.8-16.1c-1-0.1-1.5-0.2-1.5-0.2s-1,0-2.6-0.1C786.9,573.8,795.5,579.7,795.5,579.7z"/>
	<path class="st3" d="M928.9,688c11.5,14.6,18.7,33.1,20,54.1c0,0.2,0,0.4,0,0.6c0,0.5,0.1,0.9,0.1,1.4
		c2.7,44.5-20.2,89.2-56.5,119.3c36.8-29.7,60-74.4,57.3-118.8C948.5,722.5,940.9,703.3,928.9,688z"/>
	<path class="st3" d="M948.9,742.7c0-0.2,0-0.4,0-0.6c-1.3-21-8.5-39.5-20-54.1c-0.5-0.6-1-1.2-1.5-1.8
		C939.6,701.5,947.3,720.7,948.9,742.7z"/>
	<path class="st3" d="M928.9,688c-0.5-0.6-1-1.2-1.5-1.9l0,0C927.9,686.7,928.4,687.3,928.9,688z"/>
	<path class="st3" d="M927.3,686c-13.8-17.3-33.5-29.7-56.4-35.3l-2,1.1C892.6,656.8,913,668.7,927.3,686z"/>
	<path class="st2" d="M692.6,803.1c-1.6-26.4,5.9-52.7,19.9-76.1l-5.6,0.7c-13.7,23.4-20.9,49.6-19.4,75.8
		c4.1,67.8,65.9,109.5,138.1,93.2c24.9-5.6,47.7-17.4,66.8-33.3c-18.4,14.8-40.3,26-64,31.4C757.4,910.9,696.6,869.8,692.6,803.1z"
		/>
	<path class="st3" d="M830.5,647.8l1.2-0.1l0,0C831.3,647.8,830.9,647.8,830.5,647.8z"/>
	<polygon class="st3" points="831.7,647.8 831.7,647.8 831.7,647.7 	"/>
	<path class="st3" d="M831.7,647.8l5.1-0.3C835.1,647.5,833.4,647.6,831.7,647.8L831.7,647.8z"/>
	<path class="st3" d="M813.9,653c19.4-4.4,38-4.5,55-1.1l2-1.1c-10.7-2.6-22.2-3.8-34.1-3.3l-5.1,0.3h-0.1l-0.1,1.2l0.1-1.2
		l-1.2,0.1c-0.3,0-0.6,0.1-0.9,0.1l1,1.3l-1-1.3c-6.1,0.6-12.4,1.5-18.7,3c-44.3,10.1-82.3,39.7-104,76.9l5.6-0.7
		C734,691.2,770.9,662.7,813.9,653z"/>
	<path class="st3" d="M927.4,686.1L927.4,686.1L927.4,686.1L927.4,686.1z"/>
	<path class="st3" d="M927.4,686.1L927.4,686.1L927.4,686.1L927.4,686.1z"/>
	<path class="st4" d="M949,744.2c0-0.5-0.1-0.9-0.1-1.4c3.5,63.6-48.4,127.6-116.1,143c-67.9,15.4-126.1-23.9-129.9-87.7
		c-1.5-25,5.5-49.9,18.7-72.1c20.5-34.6,56-62,97.4-71.5c17-3.9,33.4-4.3,48.5-1.8c24.4,4.1,45.4,15.9,59.9,33.5l0,0
		C913,668.9,892.7,657,869,652.1c-16.9-3.5-35.6-3.3-55,1.1c-43,9.8-79.9,38.3-101.4,74.2c-14,23.4-21.5,49.7-19.9,76.1
		c4,66.7,64.8,107.8,135.8,91.7c23.7-5.4,45.6-16.5,64-31.4C928.8,833.3,951.6,788.6,949,744.2z"/>
	<path class="st2" d="M927.4,686.1c-14.6-17.5-35.5-29.4-59.9-33.5c-15.1-2.5-31.5-2.1-48.5,1.8c-41.4,9.4-76.8,37-97.4,71.5
		c-13.2,22.1-20.2,47.1-18.7,72.1c3.8,63.8,62,103.1,129.9,87.7c67.7-15.4,119.6-79.3,116.1-143
		C947.3,720.7,939.6,701.5,927.4,686.1L927.4,686.1z M789,691.7l9.5-1.3l0.1,1.3l1.5-0.2l0.4,6.8l-9.4,2.4l-0.1-1.4l-1.5,0.4
		L789,691.7z M742.2,795.1l-7.8,2.8l-0.1-1.2l-1.4,0.5l-0.6-10l7.8-2.9l0.1,1.3l1.4-0.5L742.2,795.1z M850.4,809.1l-4.1,11.4
		l-5.7,0.4l-107.9-49.7l91.5,3.8l26.8-81.3l8.5,90.5l-1.3,3.5C860.2,795.5,857.1,803.8,850.4,809.1z"/>
	<path class="st2" d="M853.8,780.1L853.8,780.1l-0.5-7.1l-4.1-63l-20.5,66.2l2.4-7.9l-2.4,7.9C837.9,772.1,847.9,773.9,853.8,780.1z
		"/>
	<path class="st2" d="M821.7,781.3L821.7,781.3l-70.8-5.5l67.9,30.4l0,0c-0.6-0.9-1.2-1.8-1.6-2.8
		C813.8,796.2,815.8,787.5,821.7,781.3z"/>
	
		<ellipse transform="matrix(0.9979 -6.428662e-02 6.428662e-02 0.9979 -49.3284 55.4422)" class="st2" cx="836.9" cy="794.2" rx="9.3" ry="9.3"/>
	<polygon class="st4" points="790.6,692.7 798.6,691.6 798.5,690.3 789,691.7 789.5,699.6 791,699.3 	"/>
	<polygon class="st4" points="740.1,785.5 740,784.2 732.3,787.2 732.9,797.2 734.3,796.7 733.8,788 	"/>
	<polygon class="st5" points="791,699.3 791.1,700.7 800.5,698.3 800.1,691.4 798.6,691.6 790.6,692.7 	"/>
	<polygon class="st5" points="733.8,788 734.3,796.7 734.4,797.9 742.2,795.1 741.5,785 740.1,785.5 	"/>
	<path class="st3" d="M456.9,580.1l10.2,4.2l-9.4-8.5C457.7,575.9,457.3,578.6,456.9,580.1z"/>
	<polygon class="st3" points="451.3,592.4 460.4,596.7 452.5,589.5 	"/>
	<g>
		<path class="st4" d="M921,712.2c-3.9,0.3-7.8,0.7-11.7,1.3c-0.4,0.1-0.8,0.1-1.2,0.2c-3.8-2.2-7.8-4.1-11.9-5.8
			c-5.9-2.4-12-4.3-18.1-5.9c-1.1-0.3-2.2-0.5-3.4-0.8c1.4,0,2.8,0,4.2,0c6.6,0.1,13.1,0.4,19.7,0.9c6.5,0.5,13.1,1.2,19.5,2.4
			c3.2,0.6,6.4,1.3,9.5,2.4s6.1,2.4,8.7,4.4c-2.4-2.3-5.4-3.9-8.5-5.1c-3.1-1.3-6.3-2.2-9.5-3.1c-3.2-0.8-6.5-1.4-9.8-2
			c-3.3-0.5-6.6-0.9-9.9-1.3c-6.6-0.7-13.2-1.1-19.8-1.4c-6.6-0.2-21.1-0.8-27.7-0.6l0.8,3.3c6.2,0.7,19.3,2.1,25.4,3.5
			s12.1,3.2,18,5.3c3.3,1.2,6.6,2.6,9.8,4.2c-6.4,1-12.8,2.2-19.2,3.5c-7.7,1.6-15.3,3.4-23,5.2s-15.2,4.4-22.6,6.9
			c-14.8,5.2-29.4,11-44,16.9c-14.6,5.9-44.8,16.1-59.2,22.3c0,0,20.3-1.3,27.3-3.2c7-1.9,46.2-15,74.8-22.5
			c14.3-3.8,28.7-7.3,43.1-10.5c7.2-1.6,14.5-3.1,21.8-4.3c3.6-0.6,7.3-1.1,11-1.5c2.5-0.3,5.1-0.5,7.6-0.5c1.2,1.3,2.3,2.6,3.3,4
			c-0.8-1.4-1.7-2.7-2.7-4c1,0,1.9,0,2.9,0c-1-0.1-2-0.1-3-0.1c-0.9-1.2-1.9-2.3-3-3.4c-2.2-2.3-4.7-4.3-7.3-6.1
			c-1.3-0.9-2.5-1.7-3.9-2.5c0.1,0,0.1,0,0.2,0c3.9-0.7,7.7-1.2,11.6-1.6c1.9-0.2,3.9-0.3,5.9-0.4c2,0,3.9,0.1,5.8,0.5
			c-1.9-0.5-3.9-0.7-5.8-0.8C925,712,923,712.1,921,712.2z M912.3,717.9c3.8,2.3,7.4,5.1,10.4,8.4c-6.2-0.1-12.4,0.6-18.6,1.4
			c-7.3,1-14.7,2.3-21.9,3.6c-14.6,2.8-29,6.2-43.4,9.7s-28.7,7.3-43,11.3c-6.5,1.8-12.9,3.6-19.3,5.4c7-2.9,14-5.8,21-8.7
			c14.5-6,29.1-11.7,43.8-17.2c7.4-2.7,14.7-5.3,22.3-7.2c7.6-2,15.2-3.8,22.8-5.6c6.7-1.6,13.4-3,20.2-4.3
			C908.5,715.7,910.5,716.8,912.3,717.9z"/>
		<path class="st4" d="M910.1,760.1c-7,4.9-13.8,10.2-20.5,15.7c-6.7,5.4-13,11.1-19.4,16.9c5.6-6.4,11.5-12.7,17.4-18.9
			c5.9-6.2,12-12.2,18.4-17.9c6.3-5.7,12.9-11.2,20.4-15.6l-5.7,3.1l-5.4,3.6c-3.5,2.5-7,5.1-10.2,7.8c-6.6,5.5-12.9,11.4-19,17.4
			c-6.2,6-12,12.3-17.8,18.7c-5.7,6.4-13.7,19.9-19.2,26.6l10.7-9.4c0,0,8.3-7.8,14.5-13.7c6.2-5.8,10.3-11.3,16.8-16.9
			c6.4-5.6,13-11.1,19.8-16.2c3.4-2.6,6.9-5.1,10.5-7.3c3.6-2.3,7.3-4.4,11.4-5.9c-4.1,1.2-8,3.1-11.8,5.2
			C917.2,755.4,913.6,757.7,910.1,760.1z"/>
	</g>
	<path class="st4" d="M942.2,712.2c0,0-8.6-5.7-13.4,7.6s-3.2,20.4-0.8,24.4c2.4,3.8,7.5,7.8,12.1,1.7s8.1-10.6,7.1-15.6
		C946.2,725.2,942.2,712.2,942.2,712.2z"/>
	<path class="st2" d="M686.1,699.8l0.6-4.9L686.1,699.8l20.2,9.2l4.8-8.6L477.5,589.6c1.1-2.7,0.9-4.5,0.9-4.5s0.7-3.1-0.9-4.4
		c-1.6-1.2-6-1.2-6-1.2l-14.4-7.5c0,0-1.7-3-4.8-1.9c-3,1.1-3.6,2.2-3.6,2.2c4,0.2,5.8,1.2,6,3.6c0.2,2.4-2.9,10.4-6,13.7
		s-4-0.8-4-0.8c1.9,1.1,1.5,2.1,5.2-3.4c3.7-5.5,1.8-9.2,1.8-9.2l-179.7-84l-257.8-117c0,0-9.9-7.5-13.4,0.8
		C-2.1,383,4.2,387,4.2,387l438.6,201.8c0,0-0.5,3,1.5,4.9c1.9,1.9,6.5,1.4,6.5,1.4l14.3,6.7c0,0,1.9,4,6.6-0.8l175.6,81l19.7,9h1.1
		c0,0-0.3,0.1-0.8,0.2L686.1,699.8L686.1,699.8z M451.3,592.4l1.2-3l7.9,7.2L451.3,592.4z M456.9,580.1c0.3-1.6,0.8-4.3,0.8-4.3
		l9.4,8.5L456.9,580.1z"/>
	<path class="st0" d="M733.1,624.2l11.3,18.3c0,0,2.1-0.7,3.5-0.2L736,624C736,624,733.3,621.2,733.1,624.2z"/>
	<polygon class="st0" points="745.4,608.4 735.8,620.3 743,629.4 	"/>
	<polygon class="st4" points="697.2,645.5 721.2,667.2 701.8,644.3 	"/>
	<path class="st3" d="M819.9,637.6L819.9,637.6C819.8,637.2,819.8,637.3,819.9,637.6z"/>
	<path class="st2" d="M639.2,634.3c0.2,2.5,3.3,4,3.3,4l2.8-4.4c-1.4-1-3.3-2.3-3.3-2.3L639.2,634.3z"/>
	<polygon class="st0" points="668.6,663.7 665.8,661.5 664.5,661.4 676.2,671.1 677.7,662.8 665.8,661.5 	"/>
	<path class="st2" d="M701.7,688.2c3.3,1.9,9.2,0.6,12.2-0.8c3-1.4,8.1-8.2,8.1-8.2l-2.7,0.2l2.7-0.2l0,0c0,0,0.6-2.6-0.3-4.2
		c-0.9-1.6-4.8-5.4-8-5.9c-3.2-0.5-15.4,4.3-15.4,4.3l-17.8-19.9l-1.9,4.4l-29.3-9.4l16.3,12.6l0.3,0.2l11.9,1.3l7.9,9.2l0.6-2.6
		l-0.6,2.6l3.9-0.7l-3.9,0.7l5.5-1l-5.5,1C685.5,672,698.4,686.4,701.7,688.2z M712.1,678.4c0,0,3.5-1.9,5.1-0.3
		c1.6,1.6-0.6,3.4-2.3,4.3s-4.1,1.9-4.9,0.3C709.2,681,712.1,678.4,712.1,678.4z"/>
	<path class="st6" d="M715,682.3c1.7-0.9,3.9-2.7,2.3-4.3s-5.1,0.3-5.1,0.3s-3,2.7-2.1,4.3C710.9,684.2,713.3,683.3,715,682.3z"/>
	<path class="st0" d="M775,659.2l15.9-12.3c0,0-5.3-1.4-7.7-2.6s-10.7-6.4-10.7-6.4l-18.7,1.2L749,613c0,0-1.3,7.7-1.4,12.5
		c-0.1,4.8,0.9,13.5,2,15.4c1.1,1.8,12.6,18.4,14.6,18.2l4.5-5.1l-4.5,5.1C766.4,658.9,775,659.2,775,659.2z"/>
	<path class="st2" d="M755.8,651.5l-3.2,1.2c1.6,6.5-10.5,11.5-10.5,11.5C757,663,755.8,651.5,755.8,651.5z"/>
	<path class="st2" d="M802.9,639.4c0,0-33.9-20.9-36.3-21.2c-2.5-0.4-4.9-3.4-10.4-0.1c0,0,10.4,10.2,18.9,16
		c8.5,5.9,22,10.5,22,10.5L802.9,639.4z"/>
	<polygon class="st0" points="705.4,630 703,622.3 700.1,612.9 701.4,632.1 	"/>
	<polygon class="st0" points="705.4,630 700.1,612.9 700.1,612.9 703,622.3 	"/>
	<polygon class="st0" points="710.8,612.2 698.6,588.6 708.3,619.6 709.5,616.1 	"/>
	<path class="st0" d="M757.4,635.2l10.2-0.7c0,0-11.6-10.8-14-16.2C753.6,618.3,756.8,630.6,757.4,635.2z"/>
	<path class="st7" d="M722,679.3l2.7-0.2C723.4,679.1,722,679.3,722,679.3z"/>
	<path class="st1" d="M810.9,651c6.3-1.4,12.6-2.4,18.7-3l0,0l-7.4,0.5l7.4-0.5c-15.3-5.4-56.5-31-56.5-31s21.7,10.9,28.9,14.1
		c7.2,3.2,5.5,2.9,5.9,2c0.4-0.9,2-9.9,2-9.9s0.9,7.4,0.2,11.2l7.3,5.3c0,0,2.7-0.8,2.4-2.1c-0.1-0.3-0.1-0.4,0-0.1c0,0,0,0,0,0.1
		c0.2,1,1,4.1,1,4.1l10.8,6l0.1-1.3l-0.1,1.3c1.7-0.1,3.5-0.2,5.2-0.3h0.1h-0.1c11.9-0.5,23.4,0.7,34.1,3.3l0,0
		c-0.7-2.6-3-6.6-3-6.6l23.2-28.1c2.2-2.3,2.2-3.8,1-4.9c-1.2-1.1-3.4,1.5-3.4,1.5l-24.2,26c0,0,3.1-4,1.6-4.1
		c-1.5-0.1-4.1,0.3-4.1,0.3s-11.1-18-18.8-29.3c-0.8-1.1-1.6-2.2-2.4-3.3l-1.6,2l1.6-2c-8.9-2.1-22.5-8-22.5-8
		c2.9,14.6,1.5,35.8,1.5,35.8l4.2-2.3l-4.2,2.3l-4.2,2.3l4.2-2.3c0-13.4-4.2-37.5-4.2-37.5c-4.5-2.4-16.5-10.4-16.5-10.4
		c-15.2-0.1-44.8,8.3-44.8,8.3l7.7,7.8l-7.7-7.8l0,0c-1.1,0.4-1.8,0.6-1.8,0.6s0.7-0.2,1.8-0.6l-7.7-7.8l7.7,7.8
		c5-1.7,18.9-6.5,25.1-7.7c7.7-1.5,16-3,16-3s-8.6-5.9-12.2-9.9l-2.4,3.5l2.4-3.5c-11.1-0.2-53.4-1.1-58.3-0.4
		c-2.2,0.3-5,0.5-7.2,1.3c-2.2,8.6,28,27.4,28,27.4l2.8-1.8l1.7,0.9l-1.5,1.9c1.9,1.4,17.3,11.6,17.3,11.6l-1.3,2.2
		c0,0-35.4-24.7-42.2-30.5c-6.8-5.9-6.8-10.8-6.8-10.8c-1.9,1.4-2.2,3.9,1.3,8.6c7.5,9.9,26.2,23.2,26.2,23.2l-13.9,17.7l-1.5-6.3
		c0,0-2.3-2.1-5.4-1.4l-0.4-6.2c0,0-5.3-0.5-9.1,2.1l-15.1-28.5l0.3,6.5l3.6,11.3l-3.6-11.3l0.9,22.1l1,3.2l0,0l5.2,17.1l7.2,21.5
		l-5.3-26.2l11.9,36l-2.8-15.7l11.7,19.5c0,0,4.4,1.4,7,1.2s7-2.1,7-2.1c-4.6,0.8-8.9-4.4-9.2-8.5s5.9-11.2,5.9-11.2
		c-5.7,1.9-9.5,9.6-9.5,9.6l-13.5-22.3l-2.6,2.7l-4.8-14.7l-1.6,4.7l1.6-4.7l-9.8-31l12.3,23.5l-1.3,4l0.4-1.2l-0.4,1.2l-1.2,3.5
		l4.8,14.7l2.6-2.7l13.5,22.3c0,0,3.8-7.7,9.5-9.6c0,0-6.2,7-5.9,11.2s4.6,9.3,9.2,8.5l0.9-2.8l-0.9,2.8c0,0,12.1-4.9,10.5-11.5
		l3.2-1.2c0,0,1.2,11.5-13.8,12.7l-0.9,2.8l0.9-2.8c0,0-4.3,1.9-7,2.1c-2.6,0.2-7-1.2-7-1.2l-11.7-19.5l2.8,15.7l-11.9-36l5.3,26.2
		l-7.2-21.5l2.3,7.7l-2.3-7.7l-4,2.1l-1.2-19.2l-1-3.2l1.4,32.7l-3.5,0.2l-0.5-7.2c0,0-33.6-35.1-35.9-35.8
		c-2.3-0.7-4.1-2.4-4.5,1.4c-0.4,3.8,0.2,13-0.8,14.6s-5.3-3-6.5-2c-1.3,1-3.3,4.2-3.3,4.2s-2.5-1.9-4.4-2.5c1.2,3,1.9,4.5,0.4,7.2
		c-1.5,2.7-7.8,10.9-7.8,10.9s2.3,1.2,1.9,2.3c-0.4,1.1-2.5,1.3-2.5,1.3l6.6,5.4l-6.6-5.4l44.4,36.6l8-1.5l-5.5,1l5.5-1l-7.9-9.2
		l-1.5,8.2l-11.7-9.7l1.3,0.1l-0.3-0.2l-3.1-2.4l3.1,2.4l-16.3-12.6l29.3,9.4l1.9-4.4l17.8,19.9c0,0,12.2-4.8,15.4-4.3
		c3.2,0.5,7.1,4.3,8,5.9c0.9,1.6,0.3,4.2,0.3,4.2l1.1-4.7l-1.1,4.7l0,0c0,0,1.3-0.1,2.7-0.2c1.1-0.1,2.2-0.1,2.7-0.1
		c1.2,0,2.8,2.1,3.2,3.2c0.4,1.1,1.2,3.9,1.2,3.9s3.2,1,5.5-2c2.3-3,4.8-10.4,4.8-10.4s-2.7-4.7-3.2-4.1c-0.5,0.6,1.1-2.1,2.8-2.7
		c1.6-0.6,7.7-3.3,8.3-3.2s14.3-4.5,14.3-4.5c-2.1,0.2-13.5-16.4-14.6-18.2c-1.1-1.8-2.1-10.6-2-15.4c0.1-4.8,1.4-12.5,1.4-12.5
		l4.8,26.1l18.7-1.2c0,0,8.3,5.2,10.7,6.4c2.4,1.2,7.7,2.6,7.7,2.6L775,659.2c0,0-8.6-0.3-10.7-0.1l-4.5,5.1l4.5-5.1
		c0,0-13.7,4.6-14.3,4.5c-0.6-0.1-6.7,2.6-8.3,3.2c-1.6,0.6-3.3,3.4-2.8,2.7c0.5-0.6,3.2,4.1,3.2,4.1s-2.5,7.5-4.8,10.4
		c-2.3,3-5.5,2-5.5,2s-0.8-2.8-1.2-3.9c-0.4-1.1-2-3.2-3.2-3.2c-0.5,0-1.6,0-2.7,0.1l-2.7,0.2l-1.1,4.7l1.1-4.7c0,0-5.1,6.7-8.1,8.2
		c-3,1.5-8.9,2.7-12.2,0.8c-3.3-1.9-16.1-16.2-16.1-16.2l-0.6,2.6l0.6-2.6l-3.9,0.7l3.9-0.7l-8,1.5l-44.4-36.6l4,3.2l-4-3.2
		L436.4,484.2c0,0-1.6-0.8-2.8,0.6c-1.2,1.4,2,3.2,2,3.2l202.7,157.7l-9.7,6.4c0,0,8.5,4.8,15.6,6.1c7.1,1.3,14,1.7,14,1.7
		l16.8,14.4l-6.2,0.4l-190.4-89.6c0,0,0.2,1.7-0.9,4.5l233.6,110.7l-4.8,8.6l-20.2-9.2l9.1,12.7l7.4,13.6l4.3,1.6l0,0
		C728.7,690.6,766.6,661,810.9,651z M642.6,638.3c0,0-3.2-1.5-3.3-4l2.8-2.7c0,0,1.9,1.3,3.3,2.3L642.6,638.3z M697.2,645.5l4.6-1.2
		l19.5,22.9L697.2,645.5z M745.4,608.4l-2.4,21l-7.2-9L745.4,608.4z M736.1,641.1l5.4,6.4L736.1,641.1z M744.4,642.4l-11.3-18.3
		c0.1-3,2.9-0.2,2.9-0.2l11.9,18.2C746.5,641.8,744.4,642.4,744.4,642.4z M757.4,635.2c-0.6-4.6-3.7-16.9-3.7-16.9
		c2.3,5.4,14,16.2,14,16.2L757.4,635.2z M775.1,634.2c-8.5-5.9-18.9-16-18.9-16c5.5-3.3,8-0.3,10.4,0.1c2.5,0.4,36.3,21.2,36.3,21.2
		l-5.8,5.2C797.1,644.7,783.6,640,775.1,634.2z"/>
	<path class="st5" d="M853.8,780.1c-5.9-6.2-16-8-25-3.9c-2.8,1.3-5.2,3-7.2,5.1c-5.8,6-7.9,14.7-4.5,22.1c0.5,1,1,1.9,1.6,2.8
		c5.5,7.8,16.7,10.5,26.6,5.9c1.8-0.8,3.5-1.9,4.9-3.1c6.7-5.3,9.8-13.7,7.7-21.3c-0.3-1-0.6-1.9-1-2.9
		C856.3,783.1,855.2,781.5,853.8,780.1z M837.5,803.6c-5.1,0.3-9.5-3.5-9.8-8.7c-0.3-5.1,3.5-9.5,8.6-9.8s9.5,3.5,9.8,8.7
		C846.4,798.8,842.6,803.2,837.5,803.6z"/>
	<path class="st1" d="M850.9,693.7L824.1,775l-91.5-3.8l107.9,49.7l5.7-0.4l4.1-11.4c-1.5,1.2-3.1,2.2-4.9,3.1
		c-9.9,4.6-21.1,1.9-26.6-5.9l0,0l-67.9-30.4l70.8,5.5l0,0c2-2,4.4-3.8,7.2-5.1l20.5-66.2l4.1,63l0.5,7.1l0,0c1.3,1.4,2.4,3,3.3,4.8
		c0.4,0.9,0.7,1.9,1,2.9l1.3-3.5L850.9,693.7z"/>
</g>
</svg>
