<?xml version="1.0" encoding="utf-8"?>
<!-- Generator: Adobe Illustrator 21.0.0, SVG Export Plug-In . SVG Version: 6.00 Build 0)  -->
<svg version="1.1" id="Layer_1" xmlns="http://www.w3.org/2000/svg" xmlns:xlink="http://www.w3.org/1999/xlink" x="0px" y="0px"
	 viewBox="0 0 530 424" style="enable-background:new 0 0 530 424;" xml:space="preserve">
<style type="text/css">
	.st0{fill:url(#SVGID_1_);}
</style>
<linearGradient id="SVGID_1_" gradientUnits="userSpaceOnUse" x1="265" y1="4.6959" x2="265" y2="521.2775">
	<stop  offset="0" style="stop-color:#FF95BB"/>
	<stop  offset="3.970275e-02" style="stop-color:#F48ABD"/>
	<stop  offset="0.1543" style="stop-color:#D870C1"/>
	<stop  offset="0.255" style="stop-color:#C761C4"/>
	<stop  offset="0.3303" style="stop-color:#C15BC5"/>
	<stop  offset="0.4353" style="stop-color:#B557BE"/>
	<stop  offset="0.6273" style="stop-color:#944CAA"/>
	<stop  offset="0.8827" style="stop-color:#5F3C8A"/>
	<stop  offset="1" style="stop-color:#44337A"/>
</linearGradient>
<path class="st0" d="M530,424V0L0,212.5L530,424z"/>
</svg>
