<robot name="object">
  <link name="object_link">
    <inertial>
      <origin xyz="0 0 0" />
      <mass value="0.39" />
      <inertia  ixx="1.66e-05" ixy="0.0"  ixz="0.0"
                iyy="1.66e-05"  iyz="0.0"
                izz="1.66e-05" />
    </inertial>
    <visual>
        <origin xyz=" 0 0 0 " rpy="0 0 0" />
        <geometry>
          <mesh filename="package://master_scene/models/objects/meshes/street-cola.dae"/>
        </geometry>
      </visual>
    <collision>
      <origin xyz="0 0 0"/>
      <geometry>
        <cylinder length="0.4" radius="0.033"/>
      </geometry>
    </collision>
  </link>
  <gazebo reference="object_link">
    <mu1 value="100.0" />
    <mu2 value="0.1" />
      <!-- kp value="10000000.0" / -->
    **<maxVel value="1.0"/>**
    <kp value="100000000.0" />
    <kd value="1.0" />
    <fdir1 value="1 0 0" />
    <turnGravityOff>false</turnGravityOff>
  </gazebo>
</robot>
