{
    "simulation": "False",
    "CV_DEBUG": "False",
    "aruco_marker": {
        "id": 4,
        "length": 0.064
    },
    "land_threshold": 0.5,
    "control_mode": "ARUCO_STABILIZATION_XY",
    "camera_ref": "ROBOT_FRAME",
    "control_params": {
        "ARUCO_STABILIZATION_XY": {
            "kp": [
                [0.05,  0.00, 0],
                [0.00,  0.05, 0],
                [0, 0, 0]
            ],
            "ki": [
                [0.005,  0.000, 0],
                [0.000,  0.005, 0],
                [0, 0, 0]
            ],
            "kd": [
                [0.01,  0.00, 0.0],
                [0.00,  0.01, 0.0],
                [0, 0, 0]
            ],
            "dimensions": 3
        },
        "ARUCO_STABILIZATION_XYZ": {
            "kp": [
                [0.05,    0.0,  0.0],
                [ 0.0,   0.05,  0.0],
                [ 0.0,    0.0, 0.01]
            ],
            "ki": [
                [0.0005,    0.0,    0.0],
                [   0.0, 0.0005,    0.0],
                [   0.0,    0.0, 0.0005]
            ],
            "kd": [
                [0.01,    0.0, 0.0],
                [  0.0,  0.01, 0.0],
                [  0.0,   0.0, 0.0]
            ],
            "dimensions": 3
        },
        "ARUCO_STABILIZATION_LAND": {
            "kp": [
                [0.05,    0.0, 0.0],
                [  0.0,  0.05, 0.0],
                [  0.0,    0.0,   0.01]
            ],
            "ki": [
                [0.0005,    0.0, 0.0],
                [  0.0,  0.0005, 0.0],
                [  0.0,    0.0,   0.0005]
            ],
            "kd": [
                [0.01,    0.0, 0.0],
                [  0.0,  0.01, 0.0],
                [  0.0,    0.0,   0.0]
            ],
            "dimensions": 3
        }
    },
    "topics":{
        "front_camera": {
            "topic": "/ardrone/front/image_raw",
            "camera_matrix": [
                [700.0,    0.0, 320],
                [  0.0,  700.0, 180],
                [  0.0,    0.0, 1.0]
            ],
            "distortion": [-0.111562, 0.328687, 0.000609, -0.001780, 0.000000],
            "fh": 700,
            "principal_point": [180, 320]
        },
        "bottom_camera": {
            "topic": "/ardrone/bottom/image_raw",
            "camera_matrix": [
                [650.0,    0.0, 320],
                [  0.0,  650.0, 180],
                [  0.0,    0.0, 1.0]
            ],
            "distortion": [-0.111562, 0.328687, 0.000609, -0.001780, 0.000000],
            "fh": 650,
            "principal_point": [180, 320]
        },
        "imu": {
            "topic": "/ardrone/imu"
        },
        "cmd_vel": {
            "topic": "/cmd_vel"
        },
        "land": {
            "topic": "/ardrone/land"
        },
        "setcamchannel":{
            "topic": "/ardrone/setcamchannel"
        }
    }
}