1. d2d4 c7c6
2. e2e4 d7d5
3. Jb1c3 d5xe4
4. Jc3xe4 Jg8f6
5. Dd1d3 e7e5
6. d4xe5 Dd8a5+
7. Sc1d2 Da5xe5
8. Ke1d1 h7h5
9. a2a4 h5h4
10. Va1a3 Jf6xe4
11. Dd3d8+ Ke8xd8
12. Va3e3 h4h3
13. Kd1c1 g7g6
14. Ve3e1 a7a6
15. Ve1d1 a6a5
16. Sd2g5+ Kd8e8
