\relax 
\@writefile{toc}{\contentsline {paragraph}{Solution.}{1}\protected@file@percent }
\@writefile{toc}{\contentsline {paragraph}{Solution.}{1}\protected@file@percent }
\@writefile{toc}{\contentsline {paragraph}{Solution.}{1}\protected@file@percent }
\@writefile{toc}{\contentsline {paragraph}{Solution.}{1}\protected@file@percent }
\@writefile{toc}{\contentsline {paragraph}{Solution.}{1}\protected@file@percent }
\@writefile{toc}{\contentsline {paragraph}{Solution.}{2}\protected@file@percent }
\@writefile{toc}{\contentsline {paragraph}{Solution.}{2}\protected@file@percent }
\@writefile{toc}{\contentsline {paragraph}{Solution.}{2}\protected@file@percent }
\@writefile{toc}{\contentsline {paragraph}{Solution.}{2}\protected@file@percent }
\@writefile{toc}{\contentsline {paragraph}{Solution.}{3}\protected@file@percent }
\@writefile{toc}{\contentsline {paragraph}{Solution.}{3}\protected@file@percent }
\@writefile{toc}{\contentsline {paragraph}{Solution.}{3}\protected@file@percent }
\@writefile{toc}{\contentsline {paragraph}{Solution.}{3}\protected@file@percent }
\@writefile{toc}{\contentsline {paragraph}{Solution.}{3}\protected@file@percent }
\@writefile{toc}{\contentsline {paragraph}{Solution.}{4}\protected@file@percent }
\@writefile{toc}{\contentsline {paragraph}{Solution.}{4}\protected@file@percent }
\@writefile{toc}{\contentsline {paragraph}{Solution.}{4}\protected@file@percent }
\@writefile{toc}{\contentsline {paragraph}{Note.}{4}\protected@file@percent }
\@writefile{toc}{\contentsline {paragraph}{Solution.}{4}\protected@file@percent }
\@writefile{toc}{\contentsline {paragraph}{Solution.}{4}\protected@file@percent }
\@writefile{toc}{\contentsline {paragraph}{Solution.}{4}\protected@file@percent }
\@writefile{toc}{\contentsline {paragraph}{Solution.}{4}\protected@file@percent }
\@writefile{toc}{\contentsline {paragraph}{Solution.}{5}\protected@file@percent }
