{
  "users": [
    {
      "email": "biaapatriota@gmail.com",
      "password": "$2a$10$uKjyDhVmRUes.ljyme4xkuCyWp9hFmJ0mle5vCs7E4BAM5N.FscrG",
      "name": "Beatriz",
      "id": 1
    },
    {
      "email": "beatriz.lp@usp.br",
      "password": "$2a$10$yHpvA1jWQxqbq3D2Su0k3e0ovp7n1dzIAFS9BkW/55ZsnXNPtVYAK",
      "username": "biapatriota",
      "id": 2
    },
    {
      "email": "bianca@gmail",
      "password": "$2a$10$8CPJxZUECy6wUFGWB6T9bOrYv3U8HZF8.MgZL4LU/A3xVnxZRfrE2",
      "username": "bia",
      "id": 3
    },
    {
      "email": "bianca_luca2000@hotmail.com",
      "password": "$2a$10$/TGv0JWRP.7c5.4cJjiwJeeNJMBxO.posFwicmXCrYKu7o2vjDZrm",
      "username": "biancap",
      "id": 4
    }
  ]
}