5bef99d494d3fddde61d5249bcccb7ade94a6bb2032c145fa3cebc233aade412 rockchip.hardware.outputmanager@1.0::types
d8b3408771e3adad3046e363a1e828819971fe97b2131e0c39decd454e2cc36b rockchip.hardware.outputmanager@1.0::IRkOutputManager

# hash for rockit hw
684a28083682439edf2a4c79ace62971aa43423108929f4d5424ab7d04e75d46 rockchip.hardware.rockit.hw@1.0::types
d7ee7fadb16fdf521d533482de1b0d3ae25e4eec5cf765a35ddda1721a5134b3 rockchip.hardware.rockit.hw@1.0::IRockitHwInterface
59ce21677e19ce15eb87e2a6f44a49bfbce8d123b050622c40407794a6ccabe1 rockchip.hardware.rockit.hw@1.0::IRockitHwService
628dd5baadd079ff0a71fe6b67da615a1d49d97198fcafe91ba24623c374cad4 rockchip.hardware.neuralnetworks@1.0::IGetResultCallback
d3f9e832e656fdd8b1ef978b3bdf0da519e0b4b3b558a136d386ed6211ab698c rockchip.hardware.neuralnetworks@1.0::ILoadModelCallback
c844fcf55a18b2a1e4628520e191faf70b28115ffa900cf2c0407cea433986cc rockchip.hardware.neuralnetworks@1.0::IRKNeuralnetworks
53d21b064355fb4915bea8543072d27a3df2b98da9457f9bfc4d704508faa922 rockchip.hardware.neuralnetworks@1.0::types
