{"blockNumber":1654795,"blockTimestamp":"2020-07-27T11:10:09Z","contract":"StableToken","eventName":"Transfer","from":"0xf7f551752A78Ce650385B58364225e5ec18D96cB","msg":"RECEIVED_EVENT_LOG","severity":"info","timestamp":"2020-07-27T11:10:09.760919184Z","to":"0xFF4266da099DFA24aBB79baBd6eD3CE4955e5959","txHash":"0x60a8fb37671a62b6b467c61592585ef3c28f56f43de7bb95358c7943da228b2a","value":"1023541435200"}
{"blockNumber":1654795,"blockTimestamp":"2020-07-27T11:10:09Z","comment":"Test comment 2","contract":"StableToken","eventName":"TransferComment","msg":"RECEIVED_EVENT_LOG","severity":"info","timestamp":"2020-07-27T11:10:09.761220051Z","txHash":"0x60a8fb37671a62b6b467c61592585ef3c28f56f43de7bb95358c7943da228b2a"}
{"blockNumber":1654795,"blockTimestamp":"2020-07-27T11:10:09Z","contract":"StableToken","eventName":"Transfer","from":"0xf7f551752A78Ce650385B58364225e5ec18D96cB","msg":"RECEIVED_EVENT_LOG","severity":"info","timestamp":"2020-07-27T11:10:09.761414719Z","to":"0xD533Ca259b330c7A88f74E000a3FaEa2d63B7972","txHash":"0x60a8fb37671a62b6b467c61592585ef3c28f56f43de7bb95358c7943da228b2a","value":"19510783234353"}
{"blockNumber":1654795,"blockTimestamp":"2020-07-27T11:10:09Z","contract":"StableToken","eventName":"Transfer","from":"0xf7f551752A78Ce650385B58364225e5ec18D96cB","msg":"RECEIVED_EVENT_LOG","severity":"info","timestamp":"2020-07-27T11:10:09.761792461Z","to":"0x02793fdE1Af95269779DfA8F1A8D5ddAFD7561D8","txHash":"0x60a8fb37671a62b6b467c61592585ef3c28f56f43de7bb95358c7943da228b2a","value":"78043132937412"}
{"blockNumber":1654795,"blockTimestamp":"2020-07-27T11:10:09Z","contract":"StableToken","eventName":"Transfer","from":"0xf7f551752A78Ce650385B58364225e5ec18D96cB","msg":"RECEIVED_EVENT_LOG","severity":"info","timestamp":"2020-07-27T11:10:09.762003205Z","to":"0xBdF824DD6104024ce9575C623F108628C8e99F4c","txHash":"0x60a8fb37671a62b6b467c61592585ef3c28f56f43de7bb95358c7943da228b2a","value":"0"}
