<svg width="93" height="108" viewBox="0 0 93 108" fill="none" xmlns="http://www.w3.org/2000/svg">
<path d="M48.6093 66.9791C48.7119 67.0693 48.866 67.1393 48.9171 67.2497C50.3105 70.4234 51.8553 73.5311 53.035 76.7966C53.3574 77.6981 53.8315 78.5472 54.218 79.3738C54.7279 79.4447 55.2468 79.3236 55.6733 79.034C57.0072 78.4767 58.2839 77.7915 59.4855 76.9879L59.5706 76.7303C60.3946 76.4617 60.3946 76.4617 60.0483 75.5934C60.04 75.4916 60.0019 75.3945 59.9389 75.3142C59.8758 75.2339 59.7905 75.1739 59.6934 75.1416C59.5594 74.9786 59.5214 74.6965 59.2089 74.7579L59.2259 74.7901C59.3609 74.7191 59.4005 74.6502 59.3597 74.507C59.2656 74.1445 58.9536 74.0889 58.6654 73.9865C58.6438 73.9457 58.6123 73.911 58.5737 73.8857C58.535 73.8604 58.4906 73.8453 58.4445 73.8418C58.583 73.7064 58.6645 73.5234 58.672 73.3304C58.6795 73.1374 58.6126 72.9491 58.4849 72.8044C57.8313 71.8368 57.1802 70.8611 56.5507 69.874C56.1488 69.2409 56.0059 68.4578 55.5014 67.8787C55.3868 67.5374 55.1856 67.2317 54.9174 66.9912C54.9728 66.8893 54.9906 66.7713 54.9675 66.6579C54.9444 66.5444 54.882 66.4429 54.7912 66.3711L54.0591 65.7263C53.8264 65.5329 53.599 65.3366 53.3745 65.1457L53.4602 65.0595L53.4797 64.9394L53.6907 64.5538C53.2106 63.9446 52.5757 63.475 51.8515 63.1937C51.2122 62.8434 50.4371 62.8116 49.8832 62.0731L50.8126 62.0443C50.9106 61.7456 50.5012 61.7275 50.5298 61.5065C50.5583 61.2855 50.5653 61.3642 50.7026 61.4156L51.955 61.8829C51.8661 60.7831 51.0509 60.0721 50.891 59.1126C50.9866 59.0554 51.0927 59.0179 51.203 59.0023C51.3133 58.9868 51.4255 58.9935 51.5329 59.0222C51.7054 59.1913 51.8515 59.3852 51.9665 59.5975C52.4007 60.7902 53.2048 61.7816 53.8145 62.8753C54.87 64.7643 55.9957 66.6164 57.0809 68.4829C58.3905 70.7372 59.693 72.9952 60.9883 75.257C61.257 75.7679 61.5527 76.2646 61.835 76.7752C63.1168 79.0944 64.4094 81.408 65.6804 83.7329C66.5828 85.3848 67.3355 87.1142 67.9294 88.9006C68.1702 89.5855 68.254 90.316 68.1746 91.0384C68.0953 91.7609 67.8548 92.4571 67.4708 93.0758C66.9434 93.0168 66.9167 93.0446 67.0298 93.548C66.4475 94.3314 65.6635 94.9431 64.7614 95.3177C63.3194 96.0761 61.9199 95.6176 60.665 94.7259C59.5366 93.8914 58.8974 92.6759 58.3261 91.4454C56.7694 88.1448 55.5044 84.6908 54.0008 81.3074C52.7874 78.5677 51.6741 75.7822 50.523 73.0167C49.8257 71.3237 48.9825 69.7075 48.3176 67.9976C48.1684 67.6995 48.1118 67.3636 48.1549 67.0327C48.2946 66.7739 48.4489 66.8575 48.6093 66.9791ZM63.2387 89.1844L63.6155 88.7734C64.485 88.3161 65.4584 88.017 65.9923 86.9741C65.6105 86.3923 65.7631 85.5156 65.069 85.0087C65.0541 84.8905 65.0155 84.7765 64.9555 84.6736C64.8955 84.5707 64.8152 84.481 64.7196 84.4098C64.569 83.77 64.2701 83.1747 63.8469 82.6718C63.809 82.5537 63.7433 82.4464 63.6554 82.3589C63.5674 82.2715 63.4596 82.2063 63.3411 82.1689C63.2238 81.3455 62.8442 80.5824 62.2583 79.9922C61.8319 78.9923 61.338 78.0226 60.7801 77.0897C60.4463 77.4844 60.0535 77.8253 59.6155 78.1004C59.1698 78.2942 58.7853 78.6056 58.5035 79.001C58.321 78.9738 58.1344 78.9972 57.964 79.0686C57.7936 79.14 57.6461 79.2568 57.5375 79.4061C56.6582 79.7793 55.6882 79.9668 54.8932 80.6183C55.1074 81.5171 55.442 82.3826 55.888 83.1915C56.7631 85.3447 57.6597 87.4866 58.578 89.6171C58.6349 89.8785 58.7488 90.124 58.9117 90.3362C59.0745 90.5483 59.2822 90.722 59.5202 90.8449C59.4677 91.0018 59.465 91.1708 59.5124 91.329C59.5597 91.4871 59.6549 91.6267 59.785 91.7286C59.718 92.519 60.3584 92.9237 60.7392 93.4511C61.291 94.2251 62.1751 94.3986 63.0503 94.5288C63.4072 94.6061 63.7788 94.5847 64.125 94.4667C64.4713 94.3487 64.779 94.1387 65.0148 93.8594C65.2868 93.657 65.5787 93.4828 65.8859 93.3395C66.2132 93.1267 66.4934 92.8493 66.7092 92.5244C66.925 92.1996 67.0717 91.8341 67.1403 91.4509C67.2066 91.0658 67.2293 90.6763 67.2684 90.2918C67.2933 90.2651 67.3096 90.2316 67.3152 90.1956C67.3209 90.1596 67.3156 90.1227 67.3001 90.0898C67.2889 89.2469 66.9669 88.4386 66.3955 87.8194C65.9711 88.0616 65.6109 88.4017 65.3452 88.8112C65.2014 89.0633 64.9969 89.2759 64.7503 89.4296C64.5036 89.5833 64.2226 89.6733 63.9327 89.6913C63.6869 89.5254 63.4601 89.3563 63.2387 89.1844Z" fill="#414141"/>
<path d="M35.4117 27.3995C34.9572 27.7758 34.4293 28.0534 33.8617 28.2147L33.0887 27.5708C34.344 26.8431 35.6623 26.2302 37.0276 25.7395C38.7186 25.0218 40.4689 24.4171 41.9392 23.2799C42.1782 23.2962 42.4151 23.2231 42.6035 23.0747C43.9213 22.3817 45.2195 21.6645 46.5319 20.9743C47.3312 20.5539 48.2709 20.3481 48.9584 19.7806C49.1387 19.7864 49.3184 19.7548 49.4861 19.6879C49.6538 19.621 49.8059 19.5201 49.9328 19.3917C50.7128 19.105 51.5579 18.942 52.1201 18.2413C53.1158 18.4041 53.7025 17.6974 54.5093 17.2388C54.1302 16.9507 53.8702 16.7579 53.6128 16.5568C53.6334 16.3694 53.5976 16.1803 53.51 16.0136C53.4223 15.847 53.2868 15.7103 53.1207 15.6211C53.0934 15.5388 53.0458 15.4648 52.9823 15.4058C52.9187 15.3469 52.8413 15.3049 52.7571 15.2837L52.7031 15.3121C52.6849 15.224 52.6428 15.1426 52.5815 15.0768C52.5202 15.0111 52.4419 14.9634 52.3552 14.9389C52.1466 14.8701 51.938 14.8013 51.7269 14.7407C51.8206 14.3611 51.7632 13.9606 51.5668 13.6235C51.1721 12.9654 50.9725 12.2087 50.9912 11.4409L50.2932 10.73L50.3882 10.4124C50.2349 10.3831 50.1883 10.5175 50.1135 10.598C50.0387 10.6786 50.0878 10.6802 50.0721 10.7159L50.0127 10.7471C49.773 10.475 49.6211 10.2254 50.0971 10.0162C50.2213 9.95087 50.2319 9.78742 50.1421 9.65611C50.7306 9.18873 50.8874 9.26413 51.2657 10.0882C52.0494 11.3031 52.7473 12.5907 52.6677 13.7241C52.8526 13.8397 53.054 13.9604 53.2692 14.0943C53.8748 14.9705 54.3569 15.9527 55.3369 16.5838C55.6563 16.3943 55.9041 16.1046 56.0413 15.7602L56.4191 15.4036C57.0584 15.8981 57.2109 16.7516 57.8018 17.2853C57.8165 17.8118 57.9885 18.3214 58.2957 18.7488C58.4554 18.9738 58.5785 19.2866 58.937 19.2079C58.5238 19.2742 58.524 19.5762 58.6299 19.8431C58.8686 20.4627 59.1469 21.0662 59.463 21.65C59.6469 21.9821 59.7406 22.3565 59.7349 22.7364C59.7291 23.1164 59.6241 23.4885 59.4302 23.8162C59.1889 24.3275 59.0109 24.8674 58.8054 25.3943C57.6719 27.4734 56.4448 29.5056 55.4214 31.6367C53.8995 34.8125 52.3169 37.9517 50.7538 41.1149C50.394 41.8465 50.0645 42.5965 49.7268 43.344C49.6866 43.4048 49.6612 43.474 49.6526 43.5462C49.6439 43.6184 49.6521 43.6916 49.6767 43.7599C49.7013 43.8283 49.7415 43.8899 49.7941 43.94C49.8468 43.99 49.9104 44.0271 49.98 44.0484L49.4813 44.6471C48.9058 44.785 48.85 44.8624 48.926 45.4265L48.8231 46.0436C48.5161 45.958 48.3561 46.152 48.2074 46.3675C48.0588 46.5829 47.9605 46.7239 48.0577 46.9611L47.9024 47.2556L47.5909 47.6597C47.3134 47.912 47.0976 48.2244 46.9604 48.5728C46.8232 48.9212 46.7682 49.2962 46.7997 49.6687C46.3052 49.6198 46.1408 50.0152 45.9641 50.3347C45.7218 50.7917 45.5402 51.2854 45.3365 51.7632C45.0695 52.1081 44.9186 52.5281 44.9058 52.963C44.8929 53.3979 45.0186 53.8251 45.2648 54.1833C45.5367 54.6877 45.7447 55.224 45.884 55.78L45.4599 56.2845C44.8332 55.6122 44.3791 54.7982 44.1361 53.9118C43.8817 53.2182 43.8896 52.455 44.1584 51.7649C44.3029 51.3002 44.4783 50.8455 44.6837 50.4039C46.098 47.7446 47.551 45.1062 48.9296 42.4313C49.7532 40.8379 50.5657 39.2366 51.3175 37.5985C52.3315 35.3969 53.4966 33.26 54.6067 31.0971C55.8958 28.5929 57.2014 26.0937 58.4792 23.568C58.6346 23.2735 58.7457 22.9473 58.9046 22.5547C57.8519 20.8153 57.4013 18.7524 56.1855 16.8996C55.6035 17.9952 54.6429 18.3974 53.6924 18.8973C51.6644 19.946 49.5765 20.8744 47.4396 21.6778C46.6249 22.0033 45.895 22.4901 45.1227 22.8963C44.0179 23.4172 42.9427 23.9987 41.9021 24.6382C41.0669 25.1308 40.186 25.5412 39.2717 25.8637C38.3168 26.3444 37.3236 26.745 36.3026 27.0614C35.8986 26.7521 35.6681 27.1136 35.4117 27.3995Z" fill="#414141"/>
<path d="M33.0943 27.5815L33.8673 28.2254C31.4262 29.5093 28.9699 30.7119 26.5439 32.077C23.3685 33.905 19.9872 35.2233 16.8645 37.0991C15.3452 37.9576 13.7792 38.7308 12.1739 39.415C11.4083 39.7308 10.6175 39.9813 9.80991 40.1639C9.38233 40.2802 8.92884 40.254 8.51857 40.0892C8.10829 39.9245 7.76373 39.6303 7.53738 39.2514C7.02261 38.2726 6.17478 37.5651 5.50673 36.7013C4.93209 36.0492 4.52195 35.2694 4.3103 34.4264C4.18191 33.7601 3.93924 33.1213 3.59295 32.538C3.06877 31.464 2.61169 30.3585 2.2243 29.2278C1.96316 28.6509 1.85271 28.017 1.90324 27.385C1.8934 26.9932 2.03685 26.6124 2.30322 26.3234C3.09998 25.6228 3.70516 24.7416 4.64593 24.1575C6.5164 22.9816 8.5576 22.1827 10.488 21.1468C15.5012 18.4347 20.8057 16.2765 25.8564 13.6751C26.8405 13.0619 27.8752 12.5337 28.9492 12.0966C28.8802 12.2425 28.8667 12.4083 28.9113 12.563C28.9558 12.7178 29.0554 12.8508 29.1914 12.9373C28.933 13.1544 28.6598 13.3532 28.3736 13.5322C25.521 14.9775 22.6629 16.4257 19.7962 17.8442C18.77 18.3838 17.659 18.7622 16.6188 19.275C13.3653 20.8671 10.114 22.4809 6.86503 24.1164C5.32942 24.8648 3.92584 25.8581 2.70974 27.057C2.64817 28.4213 3.4111 29.5442 3.83971 30.7262C4.09411 31.4535 4.42635 32.1512 4.83068 32.8071L5.53052 34.9243C5.36254 35.5619 5.89718 35.7132 6.27443 35.9062C6.51951 36.0313 6.78464 36.0635 6.84531 36.3886C6.8103 36.8464 7.15206 37.0374 7.44341 37.303C7.73476 37.5685 8.20023 37.667 8.22205 38.1018C8.26623 38.8543 8.87391 38.9741 9.37588 39.2731C9.78221 39.1281 10.1914 38.9884 10.5892 38.8272C10.6594 38.7903 10.7065 38.6831 10.7651 38.6111C11.2059 38.702 11.3052 38.3271 11.5462 38.0905C11.7033 38.1795 11.8399 38.3342 12.0405 38.2699C12.5398 38.176 13.011 37.9681 13.4171 37.6626C13.7617 37.7148 13.8849 37.4509 14.039 37.2326C14.3731 37.304 14.5891 37.0462 14.8514 36.9289C14.898 36.9408 14.9471 36.94 14.9934 36.9266C15.0397 36.9131 15.0815 36.8874 15.1145 36.8523L20.5898 33.9177L20.9147 33.6439C21.8475 33.4169 22.7273 33.0101 23.5047 32.4465C23.6214 32.4773 23.7451 32.4683 23.8564 32.421C23.9676 32.3737 24.06 32.2907 24.1188 32.1853C25.9497 31.2224 27.7636 30.2272 29.6114 29.2966C30.7132 28.6118 31.8799 28.0374 33.0943 27.5815Z" fill="#434343"/>
<path d="M29.213 12.9258C29.0759 12.843 28.9737 12.7134 28.9253 12.561C28.8768 12.4086 28.8853 12.2436 28.9492 12.0965C29.6351 11.7358 30.2924 11.3077 31.0069 11.0143C33.9842 9.67503 36.8374 8.11269 39.7075 6.58261C41.8863 5.29823 44.1853 4.22939 46.5715 3.3914C47.2554 3.10529 47.9878 2.95324 48.7284 2.94357C48.8331 2.99837 48.9545 3.07185 49.0866 3.13964C50.5317 3.86601 51.6428 5.11586 52.1932 6.63434C52.8021 8.26394 53.8597 9.68497 54.4004 11.3161C54.5189 11.3842 54.6136 11.4855 54.6786 11.465C55.7048 11.2136 56.3661 11.724 56.8503 12.5266C57.4978 13.6004 58.1939 14.6486 58.7416 15.7817C59.4965 17.3482 60.2856 18.8968 61.1089 20.4273C61.3026 20.8034 61.4703 21.1923 61.6108 21.5913C61.7423 21.9013 61.7966 22.2386 61.7692 22.5745C61.7418 22.9105 61.6335 23.2351 61.4536 23.5209C59.7905 26.2973 58.3972 29.2064 57.0093 32.1127C56.7122 32.9325 56.2764 33.6958 55.721 34.3694L55.1182 33.9312C55.4041 33.111 55.7491 32.3124 56.1504 31.5415C57.171 29.5492 58.1263 27.5639 59.1088 25.5779C59.5082 24.9216 59.866 24.2254 60.3207 23.6086C60.6627 23.2216 60.8413 22.7177 60.8189 22.2032C60.7965 21.6887 60.5748 21.2036 60.2006 20.8501C60.1967 20.7449 60.1693 20.6421 60.1204 20.549C60.0714 20.4559 60.0022 20.3751 59.9177 20.3123C59.6923 19.8449 59.3317 19.4559 58.8822 19.1954C58.9619 19.0849 59.1332 18.9124 59.1052 18.8722C58.693 18.272 58.626 17.4628 57.9766 17.0148C57.9813 16.8269 58.0721 16.5801 57.9826 16.4624C57.4234 15.6742 56.9716 14.8152 56.6391 13.9079C56.5005 13.6443 56.4118 13.1349 55.8746 13.1359L55.5521 13.3879C55.4623 13.3266 55.3928 13.2402 55.3521 13.1395C55.3114 13.0388 55.3014 12.9283 55.3232 12.8217C55.4189 12.689 55.6162 12.5921 55.5277 12.3846C55.4393 12.1771 55.1965 12.1744 54.982 12.2254C54.4184 11.8353 54.4184 11.8353 53.8829 12.2199C53.3927 11.5682 53.0107 10.8419 52.7515 10.0687C52.6808 9.8378 52.5302 9.6397 52.3265 9.50957C51.8909 7.96046 50.9796 6.6341 50.3008 5.19921C50.038 4.79344 49.6901 4.44946 49.281 4.19084C49.1075 4.05758 48.9025 3.97111 48.6856 3.93973C48.4687 3.90834 48.2472 3.9331 48.0422 4.01161C46.557 4.45585 45.12 5.0483 43.753 5.77997C43.213 6.06401 42.7071 6.282 42.1799 6.52495C40.978 7.05112 39.8197 7.67179 38.7159 8.38107C38.4413 8.56672 38.2841 8.76608 38.503 9.09039C38.3209 8.83599 38.0918 8.68874 37.7677 8.85917C37.1737 9.17161 36.5742 9.4869 35.9801 9.79935C34.6891 10.5334 33.34 11.1603 31.9465 11.6736C31.364 11.4444 31.3641 11.4444 31.3686 11.9775C31.3057 12.0823 31.2086 12.1623 31.0936 12.204C30.9786 12.2457 30.8528 12.2466 30.7375 12.2064C30.224 12.0165 30.1754 12.0421 30.1651 12.5075C30.0491 12.6455 29.9028 12.7551 29.7377 12.8277C29.5726 12.9002 29.393 12.9338 29.213 12.9258Z" fill="#414141"/>
<path d="M55.1182 33.9313L55.6991 34.3673C55.5329 35.0236 55.268 35.6514 54.9133 36.2292C53.5733 38.9249 52.2852 41.6277 50.9477 44.3153C49.8047 46.6122 48.6177 48.8911 47.4553 51.1776C47.3028 51.4775 47.1917 51.8037 47.0199 52.0931C46.8662 52.3805 46.7922 52.7034 46.8055 53.0284C46.8188 53.3533 46.919 53.6685 47.0956 53.9413C47.3785 54.4791 47.6783 55.0492 47.9809 55.6246C48.4839 55.8338 48.9083 55.487 49.3588 55.3737C50.7293 55.0168 51.1127 55.2476 51.3353 56.641C51.3443 56.8836 51.3214 57.1265 51.2671 57.3634L50.6954 57.8495C50.331 57.4713 50.6744 56.8787 50.2635 56.4907C50.0613 56.4219 49.8467 56.3965 49.6337 56.4163C49.4207 56.436 49.2141 56.5004 49.0275 56.6052C47.6475 57.18 46.2791 57.7898 44.9417 58.4588C44.218 58.8394 44.2185 59.4434 44.8601 59.916C45.1034 60.0902 45.5727 59.9601 45.5822 60.4631L45.2404 60.8489C44.3673 60.9716 43.8983 60.3945 43.467 59.7974C43.3666 59.6585 43.3065 59.4946 43.2932 59.3236C43.2799 59.1527 43.3139 58.9812 43.3915 58.8279C43.5783 58.2565 43.9412 57.7581 44.4283 57.4038L45.5395 56.7507C45.8479 56.7602 45.9608 56.5292 46.0876 56.3114C46.5024 56.6151 46.7968 56.4671 47.0823 55.9874C46.7458 55.3474 46.465 54.63 46.0844 53.972C45.7735 53.474 45.6729 52.8729 45.8048 52.2997C46.2954 51.6372 46.6314 50.874 46.7881 50.0661L46.9871 49.7761C47.4452 49.3361 47.4512 48.6395 47.7932 48.1232C47.9046 47.9548 47.6588 47.7889 47.5415 47.6446L47.853 47.2405C47.9651 47.257 48.0937 47.2786 48.121 47.1339C48.1482 46.9891 48.0531 47.0048 48.0191 46.9402C47.9003 46.7144 48.033 46.521 48.1688 46.3466C48.7845 46.5995 48.7845 46.5995 48.7845 46.0228L48.8874 45.4057L49.4427 44.6262L49.9414 44.0275C51.1034 42.3042 51.8682 40.3366 52.8203 38.4765C53.5992 36.9684 54.1743 35.3615 55.1182 33.9313Z" fill="#3F3F3F"/>
<path d="M45.2368 60.8027L45.5786 60.417C45.8757 60.577 46.1244 60.8134 46.299 61.1017C46.4737 61.39 46.5679 61.7197 46.5721 62.0571L46.1897 62.4573C46.0473 62.164 45.9249 61.8613 45.8236 61.5514C45.7841 61.3923 45.7114 61.2434 45.6103 61.1144C45.5092 60.9854 45.3819 60.8792 45.2368 60.8027Z" fill="#575757"/>
<path d="M47.6472 64.2584C47.93 64.7962 48.2327 65.3716 48.4484 65.9653C48.553 66.1643 48.6045 66.4325 48.3488 66.615C47.9692 66.7322 47.8155 66.5316 47.7574 66.1983C47.7914 66.1089 47.7896 66.01 47.7524 65.9222C47.7152 65.8343 47.6454 65.7643 47.5576 65.7267C47.3017 65.1747 46.8839 64.7079 46.9698 64.0585L47.6727 64.3068L47.6472 64.2584Z" fill="#414141"/>
<path d="M50.6918 57.8032L51.2636 57.3171C51.1792 58.0481 51.1792 58.0481 51.5054 59.0093C51.398 58.9806 51.2858 58.9739 51.1755 58.9894C51.0652 59.0049 50.9591 59.0425 50.8635 59.0997C50.6796 58.9433 50.5603 58.7245 50.5286 58.4851C50.4969 58.2458 50.5551 58.0029 50.6918 57.8032Z" fill="#575757"/>
<path d="M46.1038 56.3027C45.9657 56.499 45.8641 56.7515 45.5557 56.742C45.4794 56.5968 45.4598 56.4286 45.4051 56.272L45.8292 55.7675C45.91 55.8325 45.9762 55.9137 46.0235 56.0059C46.0708 56.0981 46.0981 56.1992 46.1038 56.3027Z" fill="#4B4B4B"/>
<path d="M46.1897 62.4571L46.5721 62.0569C46.7447 62.3849 47.1415 62.6019 47.0437 63.0584C46.8395 63.3649 46.6075 63.3564 46.4142 63.0805C46.3172 62.8814 46.242 62.6724 46.1897 62.4571Z" fill="#414141"/>
<path d="M35.4117 27.3995C35.6681 27.1136 35.8986 26.7521 36.3499 27.1121C36.2318 27.2372 36.0832 27.3296 35.9186 27.38C35.7541 27.4304 35.5793 27.4372 35.4117 27.3995Z" fill="#434343"/>
<path d="M67.013 93.5294C66.8891 93.0316 66.9159 93.0038 67.4541 93.0571C67.4606 93.1179 67.454 93.1794 67.4345 93.2375C67.4151 93.2955 67.3834 93.3488 67.3415 93.3936C67.2997 93.4384 67.2487 93.4737 67.192 93.4972C67.1353 93.5206 67.0743 93.5316 67.013 93.5294Z" fill="#575757"/>
<path d="M47.6727 64.3068L46.9699 64.0586C47.1566 63.8368 47.3598 63.7643 47.6174 63.9789L47.7028 64.3116L47.6727 64.3068Z" fill="#575757"/>
<path d="M47.5576 65.7266C47.6455 65.7643 47.7152 65.8343 47.7524 65.9221C47.7897 66.01 47.7914 66.1089 47.7574 66.1982C47.688 66.142 47.6335 66.0696 47.5987 65.9874C47.5638 65.9052 47.5498 65.8157 47.5576 65.7266Z" fill="#575757"/>
<path d="M55.4852 67.8873C56.0005 68.4608 56.1434 69.2438 56.5345 69.8826C57.164 70.8697 57.8151 71.8454 58.4687 72.813C58.5964 72.9577 58.6633 73.146 58.6558 73.339C58.6483 73.532 58.5668 73.715 58.4283 73.8504L55.6553 72.4321C56.5446 72.3008 57.0211 72.8397 57.6805 72.6645C56.8407 71.8018 55.5373 71.8144 54.6913 70.9137C55.4034 70.7864 55.9725 71.3178 56.7304 71.1595C55.8515 70.2487 54.544 70.1879 53.6332 69.4655C53.7723 69.1795 54.0927 69.3955 54.2473 69.2043L54.9789 69.6777C54.6248 69.2667 54.6248 69.2667 54.2478 69.2315C53.7119 68.5796 52.7424 68.6501 52.1232 67.9185C53.3005 67.7318 54.1713 68.496 55.1907 68.6121C54.7438 67.7623 53.6184 67.956 53.0871 67.1163C53.5609 67.1371 54.0178 67.2952 54.402 67.5713C54.551 67.6952 54.724 67.7871 54.9104 67.8415C55.0967 67.8958 55.2923 67.9114 55.4852 67.8873Z" fill="#787878"/>
<path d="M59.6934 75.1416C59.7904 75.174 59.8758 75.234 59.9388 75.3143C60.0019 75.3946 60.0399 75.4917 60.0482 75.5935C59.837 75.6852 59.6692 75.8548 59.5802 76.0667C59.4911 76.2787 59.4877 76.5165 59.5706 76.7304L59.4855 76.988C59.0465 76.7039 58.605 76.4281 58.1686 76.1358C58.0511 76.0567 57.9494 75.9566 57.8685 75.8405C57.2642 74.8882 57.2696 74.8854 56.727 74.6009C56.6643 74.3112 56.59 73.9864 56.5188 73.6806C56.6832 73.6267 56.8583 73.6144 57.0283 73.6449C57.1984 73.6753 57.358 73.7474 57.4929 73.8548C57.6332 73.9486 57.7985 73.9982 57.9676 73.9973C58.1367 73.9965 58.3019 73.9452 58.4419 73.85C58.488 73.8536 58.5324 73.8687 58.5711 73.894C58.6097 73.9193 58.6412 73.954 58.6628 73.9947C58.6136 74.4257 58.9682 74.5756 59.2233 74.7984L59.2063 74.7661C59.185 75.2237 59.257 75.2819 59.6934 75.1416Z" fill="#787878"/>
<path d="M46.0215 59.8957C45.8235 59.8076 45.752 59.6323 45.7386 59.3579C46.7538 58.674 47.8403 58.1025 48.9791 57.6536C49.0817 57.5893 49.2023 57.5597 49.3229 57.5693C49.4435 57.5788 49.5576 57.6271 49.6482 57.7068C49.6913 57.7648 49.7106 57.837 49.7023 57.9089C49.6941 57.9808 49.6588 58.0469 49.6037 58.0941C48.5073 58.8717 47.2995 59.4792 46.0215 59.8957Z" fill="#6A6A6A"/>
<path d="M54.04 65.7296L54.7721 66.3744C54.8629 66.4462 54.9254 66.5478 54.9484 66.6612C54.9715 66.7746 54.9538 66.8926 54.8984 66.9946C54.7482 66.9843 54.5825 67.0234 54.4668 66.9606C53.5025 66.438 52.5652 65.9011 51.5782 65.3354C52.0589 65.0827 52.4767 65.5494 52.9016 65.2299C53.2199 65.4812 53.4982 65.9185 54.04 65.7296Z" fill="#858585"/>
<path d="M53.4607 64.9426L53.4411 65.0628L53.3555 65.149L52.8609 65.2443C52.0522 64.5849 50.9402 64.4763 49.9312 63.6064C51.3656 63.8956 52.556 64.114 53.4607 64.9426Z" fill="#858585"/>
<path d="M61.8905 83.7765C61.3425 83.2065 60.5538 83.0309 59.8839 82.6486C60.086 82.2333 59.8315 81.8935 59.7533 81.5089C60.7794 81.4018 61.5434 82.2907 62.6521 82.2225C61.8661 81.5904 60.9428 81.1498 59.9553 80.9359C58.9786 80.6257 58.3401 79.8836 57.5233 79.3794C57.6319 79.2301 57.7795 79.1134 57.9498 79.0419C58.1202 78.9705 58.3068 78.9471 58.4893 78.9744C59.5212 79.4328 60.5967 79.7871 61.7 80.032C61.8832 80.0865 62.0808 80.0664 62.2498 79.9763C62.8357 80.5664 63.2153 81.3296 63.3325 82.153C63.3189 82.73 63.3382 82.7405 63.8384 82.6559C64.2616 83.1588 64.5605 83.754 64.711 84.3939L64.1062 84.712C63.6705 84.4606 63.382 83.912 62.752 84.0511C62.4868 83.8748 62.2652 83.5451 61.8979 83.7382L61.8905 83.7765ZM61.091 82.5973C61.0874 82.549 61.0735 82.5021 61.0502 82.4598C61.0269 82.4174 60.9949 82.3805 60.9561 82.3515C60.9174 82.3225 60.8729 82.302 60.8255 82.2916C60.7782 82.2811 60.7292 82.2809 60.6816 82.2908C60.687 82.5763 60.8305 82.6656 61.091 82.5973Z" fill="#DADADA"/>
<path d="M61.9474 86.0739L61.5396 85.7048C62.3602 85.5479 63.0553 85.965 63.7239 86.2793C64.293 86.5223 64.8436 86.7957 65.4075 87.0553C65.2858 86.8175 65.1159 86.6077 64.9085 86.4391C64.7011 86.2704 64.4608 86.1466 64.2028 86.0755C63.8318 85.9617 63.4922 85.7645 63.2101 85.499C63.116 85.425 63.1309 85.3485 63.2279 85.2837C63.3248 85.219 63.5483 85.4997 63.7448 85.362L63.6988 84.8026C63.7668 84.8319 63.8417 84.8411 63.9149 84.8294C63.9881 84.8176 64.0565 84.7854 64.1121 84.7363C64.397 84.9504 64.659 85.2519 65.0772 85.0114C65.7713 85.5183 65.6187 86.395 66.0005 86.9768C65.4666 88.0197 64.4988 88.3296 63.6237 88.7761C63.6163 88.0934 62.971 88.0071 62.6313 87.6365C62.7749 87.2933 63.2308 87.4654 63.4163 87.1757C62.9212 86.8113 62.4316 86.444 61.9474 86.0739Z" fill="#C0C0C0"/>
<path d="M66.1795 90.6862C66.0499 91.3311 66.1674 92.0657 65.3824 92.5266C64.8503 92.2821 64.3734 91.9327 63.9804 91.4995C63.9496 91.0214 64.4395 91.2581 64.5653 90.986C64.2492 90.7128 63.925 90.4371 63.6007 90.1613L63.9109 89.6893C64.2007 89.6712 64.4818 89.5813 64.7284 89.4276C64.9751 89.2739 65.1796 89.0613 65.3233 88.8091C65.5891 88.3996 65.9493 88.0595 66.3737 87.8173C66.945 88.4365 67.267 89.2448 67.2782 90.0878C66.9064 89.892 66.6883 89.4643 66.202 89.418L65.0653 89.8785L66.1795 90.6862Z" fill="#A2A2A2"/>
<path d="M62.2442 79.9655C62.0752 80.0557 61.8775 80.0757 61.6943 80.0212C60.5911 79.7763 59.5156 79.422 58.4837 78.9636C58.7655 78.5682 59.1501 78.2567 59.5957 78.0629C60.0337 77.7878 60.4265 77.4469 60.7603 77.0523C61.3206 77.9885 61.8164 78.9618 62.2442 79.9655Z" fill="#CBCBCB"/>
<path d="M63.925 89.7161L63.6148 90.1881C62.3745 90.8027 61.0887 91.3206 59.7688 91.7372C59.6388 91.6353 59.5436 91.4957 59.4962 91.3376C59.4488 91.1794 59.4515 91.0104 59.504 90.8535C60.1266 90.6084 60.7492 90.3633 61.3775 90.129C61.9287 89.9745 62.4331 89.6856 62.8452 89.2885L63.2528 89.2114C63.4601 89.3564 63.6869 89.5255 63.925 89.7161Z" fill="#4D4D4D"/>
<path d="M66.1796 90.6861L65.0568 89.8623L66.1935 89.4018C66.6798 89.4481 66.8979 89.8758 67.2697 90.0716C67.2853 90.1045 67.2905 90.1413 67.2849 90.1773C67.2793 90.2133 67.263 90.2468 67.2381 90.2736C67.1883 90.2428 67.1326 90.2227 67.0745 90.2146C67.0165 90.2066 66.9573 90.2107 66.9008 90.2269C66.8444 90.243 66.7919 90.2707 66.7467 90.3082C66.7016 90.3457 66.6648 90.3922 66.6386 90.4447C66.593 90.5243 66.5255 90.5893 66.4442 90.6321C66.3628 90.6749 66.271 90.6936 66.1796 90.6861Z" fill="#6A6A6A"/>
<path d="M63.2387 89.1846L62.8311 89.2617C62.6502 89.1219 62.5069 88.9396 62.414 88.7309C62.3211 88.5222 62.2815 88.2937 62.2986 88.0656L62.6314 87.6366C62.9711 88.0072 63.6248 88.1096 63.6237 88.7761L63.2387 89.1846Z" fill="#E2E2E2"/>
<path d="M49.1199 12.4319C49.4275 12.1123 49.4224 11.6962 49.5212 11.2941L49.9908 10.745L50.0502 10.7137C50.084 10.7313 50.1211 10.7417 50.1592 10.7441C50.1973 10.7465 50.2355 10.741 50.2714 10.7279L51.0423 11.4072C51.0237 12.175 51.2233 12.9317 51.618 13.5897C51.8144 13.9269 51.8718 14.3274 51.7781 14.707C51.727 14.7407 51.6728 14.7692 51.6161 14.7922C51.259 14.5039 50.8458 14.2925 50.4024 14.1713C49.9589 14.0501 49.4949 14.0216 49.0393 14.0877C49.629 14.3877 50.1754 14.7653 50.664 15.2105C50.1257 15.5897 50.7254 15.8648 50.7743 16.1412C50.7048 16.3631 50.3422 16.3684 50.3699 16.6834C50.393 16.7495 50.4299 16.81 50.478 16.8609C50.5262 16.9117 50.5846 16.9519 50.6494 16.9787C50.7142 17.0055 50.784 17.0183 50.8543 17.0164C50.9245 17.0144 50.9936 16.9977 51.0571 16.9673C51.3541 16.8111 51.5979 17.0125 51.8376 17.1404C51.7378 17.344 51.6434 17.5446 51.5379 17.7374C51.3401 18.0955 51.0516 18.1236 50.7715 17.8796C50.7093 17.7613 50.732 17.5159 50.6744 17.4982C49.9841 17.3394 49.3096 17.0007 48.5749 17.2292C47.5002 16.3527 46.1123 16.2176 44.8887 15.6871L45.6532 13.9943C45.8026 14.108 45.9654 14.2077 46.115 14.335C46.4699 14.6427 46.6783 13.8328 47.1195 14.2392C47.2609 14.349 47.4241 14.4275 47.5983 14.4696C47.7726 14.5117 47.954 14.5164 48.1304 14.4834C48.4473 13.9322 47.808 13.8703 47.6758 13.5141L48.1346 13.5474C48.5286 13.1823 48.2844 12.5212 48.8941 12.4614C48.8771 12.5734 48.8584 12.7343 49.0242 12.7088C49.1901 12.6834 49.1765 12.5395 49.1199 12.4319ZM49.8968 15.4561C49.5392 15.143 49.335 14.7286 48.8255 15.0446C48.7031 15.5072 48.7199 15.9951 48.8738 16.4473L49.7561 16.5256C49.6758 16.355 49.6464 16.1648 49.6714 15.9776C49.6964 15.7904 49.7747 15.6141 49.8971 15.4697L49.8968 15.4561ZM47.2948 15.1494C47.3138 15.1203 47.3266 15.0877 47.3326 15.0535C47.3385 15.0194 47.3374 14.9844 47.3294 14.9508C47.3213 14.9171 47.3065 14.8855 47.2858 14.8577C47.2651 14.83 47.239 14.8068 47.209 14.7895C47.0711 14.7109 46.9246 14.7468 46.9335 14.9343C46.9589 15.0612 47.0064 15.1826 47.0739 15.293L47.2948 15.1494ZM47.9719 15.4798C47.9295 15.3992 47.8871 15.3185 47.8475 15.2432C47.8079 15.1679 47.7603 15.2479 47.714 15.2516C47.748 15.3161 47.704 15.4422 47.7454 15.4685C47.7868 15.4948 47.8933 15.5006 47.975 15.4988L47.9719 15.4798Z" fill="#A2A2A2"/>
<path d="M41.9502 23.2877C41.6815 22.7768 42.1157 22.5142 42.3307 22.202C42.5457 21.8898 42.6416 21.6265 42.2958 21.3622C42.4228 21.3293 42.5537 21.3136 42.6849 21.3154C43.5453 21.3915 43.633 21.2699 43.3752 20.3207C43.47 20.2121 43.5908 20.1291 43.7262 20.0795C43.8617 20.0299 44.0074 20.0152 44.1498 20.0369C44.4743 20.0981 44.8063 20.1109 45.135 20.0749C45.2441 20.0756 45.352 20.0509 45.45 20.0028C45.548 19.9547 45.6335 19.8844 45.6997 19.7976C45.7658 19.7108 45.8108 19.6099 45.8311 19.5028C45.8513 19.3958 45.8463 19.2856 45.8163 19.1811C45.8405 19.1171 45.8704 19.0555 45.9056 18.9968C46.5917 19.0822 46.8785 18.5263 47.2887 18.1527C47.7349 18.4213 48.2609 18.5278 48.7779 18.4542C48.8341 18.5556 48.86 18.6711 48.8525 18.7869C48.8451 18.9028 48.8045 19.0142 48.7357 19.108C48.6824 19.1856 48.6575 19.279 48.6653 19.3725C48.673 19.466 48.7128 19.5539 48.7781 19.6212C48.8521 19.6641 48.9171 19.7208 48.9694 19.7884C48.2549 20.3701 47.3152 20.576 46.5429 20.9821C45.2305 21.6724 43.9182 22.3626 42.6145 23.0825C42.4261 23.2309 42.1892 23.3041 41.9502 23.2877Z" fill="#CBCBCB"/>
<path d="M55.1182 33.9312C54.1658 35.3452 53.5907 36.9522 52.8226 38.4546C51.8761 40.3255 51.1274 42.2709 49.9437 44.0056C49.8741 43.9844 49.8105 43.9473 49.7578 43.8972C49.7052 43.8472 49.665 43.7855 49.6404 43.7172C49.6158 43.6488 49.6076 43.5757 49.6163 43.5035C49.625 43.4313 49.6504 43.362 49.6905 43.3012C50.0282 42.5538 50.3577 41.8038 50.7175 41.0721C52.2752 37.9118 53.8578 34.7726 55.3851 31.5939C56.4085 29.4629 57.6356 27.4307 58.7691 25.3516L59.1142 25.5751C58.1317 27.5611 57.1602 29.555 56.1558 31.5387C55.7525 32.3104 55.4058 33.11 55.1182 33.9312Z" fill="#E2E2E2"/>
<path d="M49.9854 10.7476L49.5157 11.2967C49.206 11.257 48.9078 11.1547 48.6394 10.996C48.371 10.8374 48.1381 10.6256 47.9548 10.3738C47.5604 9.77141 47.1145 9.20426 46.622 8.6787C46.8306 8.17079 47.2403 8.63504 47.3835 8.27821C47.4248 8.36136 47.4847 8.43391 47.5586 8.49027C47.6324 8.54663 47.7183 8.58532 47.8096 8.60335C48.136 8.69947 48.243 8.58828 48.136 8.26693C48.3032 8.02109 48.4704 7.77526 48.6458 7.53197C49.2594 7.38775 49.2594 7.38776 48.8433 6.87196C49.2448 6.3244 49.592 6.65674 49.954 6.91257C49.9738 7.06676 49.9569 7.22354 49.9047 7.37026C49.8525 7.51697 49.7665 7.6495 49.6536 7.75713C49.2743 7.7438 48.9574 7.86237 49.0965 8.29727C49.1863 8.57276 49.4833 8.41653 49.6945 8.33295L50.1223 9.61836C50.1958 9.75818 50.2071 9.92388 50.0772 9.97845C49.5938 10.2259 49.7457 10.4755 49.9854 10.7476Z" fill="#787878"/>
<path d="M59.1173 25.5941L58.7722 25.3705C58.9777 24.8436 59.1557 24.3037 59.397 23.7924C59.5909 23.4647 59.6959 23.0925 59.7017 22.7126C59.7075 22.3327 59.6137 21.9583 59.4298 21.6262C59.1137 21.0424 58.8354 20.4389 58.5968 19.8193C58.4638 19.5666 58.4906 19.2504 58.9039 19.1841C59.3531 19.442 59.7145 19.828 59.942 20.2927C59.8411 20.4419 59.6722 20.5925 59.7493 20.7785C59.8264 20.9645 60.0229 20.971 60.2091 20.8662C60.5873 21.2194 60.8121 21.7063 60.8356 22.2234C60.8591 22.7406 60.6795 23.2471 60.3349 23.6355C59.8745 24.2415 59.5168 24.9377 59.1173 25.5941Z" fill="#DADADA"/>
<path d="M51.2356 10.0835C51.4645 9.64042 52.0351 9.82089 52.3157 9.51541C52.5194 9.64554 52.67 9.84365 52.7408 10.0745C53 10.8477 53.3819 11.574 53.8721 12.2257L53.9487 12.6729C53.5388 13.0601 53.6933 13.7341 53.2283 14.0953C53.0187 13.9721 52.8174 13.8515 52.6268 13.7251C52.7172 12.586 52.0193 11.2984 51.2356 10.0835Z" fill="#9B9B9B"/>
<path d="M53.2334 14.0789C53.7254 13.7035 53.5439 13.0437 53.9539 12.6565L54.1298 12.8729C54.8341 13.7795 55.0804 14.9819 56.0056 15.7448C55.8683 16.0892 55.6206 16.3789 55.3011 16.5684C54.3211 15.9373 53.839 14.955 53.2334 14.0789Z" fill="#858585"/>
<path d="M46.1038 56.3028C46.1028 56.1979 46.0795 56.0944 46.0354 55.9992C45.9913 55.9041 45.9274 55.8194 45.848 55.7508C45.7087 55.1949 45.5007 54.6585 45.2288 54.1541C44.9826 53.796 44.8569 53.3687 44.8698 52.9338C44.8826 52.499 45.0335 52.0789 45.3005 51.7341L45.8182 52.2857C45.6863 52.8589 45.7869 53.46 46.0978 53.958C46.4784 54.616 46.8078 55.3079 47.0957 55.9734C46.8131 56.4585 46.5186 56.6065 46.1038 56.3028Z" fill="#E2E2E2"/>
<path d="M55.5549 13.3933L55.8774 13.1413C56.4147 13.1403 56.5249 13.6384 56.6419 13.9133C56.9745 14.8206 57.4263 15.6796 57.9854 16.4678C58.0533 16.5969 57.9841 16.8324 57.9795 17.0202L57.7498 17.2783C57.1589 16.7446 57.0173 15.8854 56.3672 15.3966C56.109 14.7222 55.8293 14.0592 55.5549 13.3933Z" fill="#787878"/>
<path d="M55.555 13.3933C55.8293 14.0591 56.1091 14.7221 56.3834 15.388L56.0056 15.7446C55.0804 14.9817 54.8341 13.7793 54.1298 12.8727L53.9539 12.6563L53.8773 12.2091C54.4014 11.803 54.4014 11.803 54.9764 12.2146C54.9193 12.5124 55.132 12.6546 55.296 12.8223C55.2761 12.9327 55.2902 13.0463 55.3364 13.1483C55.3826 13.2502 55.4589 13.3357 55.555 13.3933Z" fill="#2B2B2B"/>
<path d="M50.7903 17.8628C51.092 18.0955 51.3589 18.0787 51.5567 17.7206C51.6621 17.5279 51.7565 17.3272 51.8563 17.1236C52.1882 16.7333 52.3822 16.2452 52.4083 15.7348C52.4086 15.4601 52.4035 15.1882 52.4066 14.9188C52.4933 14.9432 52.5716 14.9909 52.6329 15.0567C52.6943 15.1225 52.7363 15.2038 52.7545 15.2919L52.7828 15.3457L52.8414 15.2736C52.9257 15.2948 53.0031 15.3369 53.0666 15.3958C53.1302 15.4548 53.1778 15.5288 53.205 15.611C52.9722 16.1879 52.6869 16.7424 52.3527 17.2677C52.1771 17.552 52.1098 17.8896 52.1633 18.2186C51.6067 18.9301 50.7617 19.0931 49.976 19.3689C49.9217 19.3217 49.8613 19.2819 49.7965 19.2505L50.4051 18.1135L50.7903 17.8628Z" fill="#E2E2E2"/>
<path d="M45.8209 52.291L45.3033 51.7394C45.5124 51.2587 45.694 50.7649 45.9309 50.3108C46.1019 49.9806 46.2503 49.6073 46.7665 49.6448L46.8017 50.0657C46.6446 50.8704 46.3095 51.6307 45.8209 52.291Z" fill="#575757"/>
<path d="M53.6486 16.5724C53.906 16.7734 54.1745 16.9824 54.545 17.2544C53.7382 17.713 53.1516 18.4197 52.1559 18.2569C52.3537 18.1201 52.5226 17.9458 52.6531 17.7441C52.7836 17.5423 52.8731 17.317 52.9164 17.0811C53.0134 16.728 53.2101 16.4597 53.6486 16.5724Z" fill="#E2E2E2"/>
<path d="M57.766 17.2697L57.9957 17.0116C58.645 17.4597 58.7121 18.2689 59.1243 18.8691C59.1469 18.9121 58.981 19.0817 58.9013 19.1923C58.5369 19.2466 58.4196 18.9582 58.2599 18.7332C57.9527 18.3058 57.7808 17.7962 57.766 17.2697Z" fill="#AAAAAA"/>
<path d="M53.6485 16.5724C53.2101 16.4597 53.0349 16.7166 52.9218 17.0782C52.8784 17.3142 52.789 17.5395 52.6585 17.7412C52.528 17.943 52.359 18.1172 52.1612 18.254C52.1077 17.925 52.175 17.5875 52.3506 17.3031C52.6828 16.7786 52.9663 16.225 53.1975 15.6493C53.3538 15.7434 53.4795 15.8804 53.5595 16.0441C53.6395 16.2079 53.6704 16.3913 53.6485 16.5724Z" fill="#A2A2A2"/>
<path d="M47.5631 47.6332C47.6479 47.7946 47.9208 47.9463 47.8148 48.1119C47.4727 48.6282 47.483 49.3162 47.0087 49.7647C46.9237 49.7347 46.8445 49.6904 46.7745 49.6339C46.7439 49.263 46.7991 48.8897 46.9359 48.5429C47.0726 48.196 47.2872 47.8848 47.5631 47.6332Z" fill="#575757"/>
<path d="M49.7644 19.2812C49.8292 19.3126 49.8896 19.3524 49.9439 19.3996C49.817 19.528 49.6649 19.6289 49.4972 19.6958C49.3294 19.7628 49.1497 19.7943 48.9694 19.7885C48.9134 19.7219 48.8447 19.6671 48.7673 19.6271C48.9787 19.2687 49.1901 18.9104 49.3933 18.5495C49.5965 18.1886 49.7418 17.7963 50.2574 18.095C50.0326 18.4673 49.4669 18.6893 49.7644 19.2812Z" fill="#DADADA"/>
<path d="M52.4066 14.9188C52.4035 15.1882 52.4086 15.4601 52.4083 15.7349L51.4254 15.3867L51.6135 14.8004C51.6702 14.7774 51.7244 14.7488 51.7755 14.7152L52.4066 14.9188Z" fill="#A2A2A2"/>
<path d="M48.7953 46.0169C48.7953 46.5937 48.7953 46.5937 48.1796 46.3407C48.3283 46.1252 48.4883 45.9313 48.7953 46.0169Z" fill="#575757"/>
<path d="M49.4535 44.6205L48.8982 45.4C48.8222 44.8358 48.8862 44.7609 49.4535 44.6205Z" fill="#575757"/>
<path d="M50.2932 10.73C50.2574 10.7431 50.2192 10.7486 50.1811 10.7462C50.143 10.7438 50.1059 10.7334 50.0721 10.7158C50.0721 10.7158 50.0924 10.6365 50.1135 10.5979C50.1346 10.5594 50.2349 10.3831 50.3881 10.4123L50.2932 10.73Z" fill="#787878"/>
<path d="M48.0299 46.9346C48.0638 46.9991 48.1469 47.0653 48.1317 47.1282C48.1165 47.1911 47.9759 47.2514 47.8637 47.2348L48.0299 46.9346Z" fill="#575757"/>
<path d="M52.8198 15.285L52.7612 15.357L52.7545 15.2919L52.8198 15.285Z" fill="#A2A2A2"/>
<path d="M15.1117 36.8469C15.0787 36.8821 15.0368 36.9077 14.9905 36.9212C14.9442 36.9347 14.8952 36.9355 14.8486 36.9235C14.7711 36.8317 14.6681 36.765 14.5524 36.7317C14.4367 36.6985 14.3137 36.7002 14.1987 36.7366L13.0498 35.9678C12.7461 35.7705 12.5223 35.9088 12.3194 36.1391C12.2417 36.0701 12.1723 36.0036 12.0975 35.94C11.861 35.1101 11.1093 34.8738 10.4535 34.5184L9.61545 34.0392C9.54211 33.9923 9.45507 33.9714 9.36823 33.9798C9.28138 33.9881 9.19974 34.0252 9.13634 34.0852L8.46158 33.4446C8.57888 33.0121 7.7521 32.8428 8.15127 32.317C9.19763 32.9957 10.2975 33.6187 11.3359 34.3083C11.8731 34.7427 12.5431 34.9812 13.2358 34.9843C12.6873 34.4877 12.0652 34.0785 11.3912 33.7712C11.0018 33.5796 10.6411 33.3349 10.3194 33.0442C10.2609 33.0117 10.2116 32.965 10.1762 32.9083C10.1408 32.8516 10.1204 32.7869 10.117 32.7201C10.1136 32.6533 10.1272 32.5867 10.1565 32.5264C10.1859 32.4662 10.2301 32.4144 10.285 32.3757C11.0639 33.002 11.9251 33.5191 12.8447 33.913C12.9337 33.9489 13.0313 33.9584 13.1257 33.9404C13.2202 33.9224 13.3075 33.8776 13.3773 33.8114L14.3728 34.3932C14.7428 34.638 15.0568 35.0908 15.5953 34.7251C15.6504 34.851 15.6632 34.9914 15.6318 35.1254C15.6004 35.2594 15.5265 35.3799 15.4212 35.469C15.2423 35.6451 15.118 35.8688 15.0631 36.1132C15.0083 36.3576 15.0251 36.6123 15.1117 36.8469Z" fill="#787878"/>
<path d="M15.1117 36.8469C15.0253 36.6097 15.0101 36.3523 15.068 36.1061C15.1258 35.8599 15.2542 35.6355 15.4374 35.4605C15.5428 35.3714 15.6166 35.2509 15.648 35.1169C15.6794 34.9829 15.6666 34.8425 15.6115 34.7166L15.6601 34.6911C15.6902 34.6528 15.7264 34.6198 15.7674 34.5935C16.3414 34.374 17.0494 34.6058 17.3763 33.864C17.4576 33.6908 17.7119 33.7287 17.9117 33.7678C18.0555 33.7917 18.2033 33.7762 18.3391 33.7229C18.475 33.6695 18.594 33.5804 18.6832 33.465C18.7532 33.1261 18.5362 32.6086 18.8392 32.1884L19.218 32.3187C19.5502 32.7276 19.5502 32.7276 19.891 32.2874C20.303 32.009 20.8323 31.8748 21.082 31.3796C21.1324 31.4883 21.1459 31.6105 21.1206 31.7279C21.0952 31.8452 21.0324 31.9513 20.9415 32.0301C20.6399 32.4638 20.4284 32.9533 20.3196 33.4695C20.2363 33.6781 20.435 33.8069 20.5685 33.9427L15.1117 36.8469Z" fill="#CBCBCB"/>
<path d="M4.8307 32.8071L5.45585 33.1306C6.25134 34.1413 7.24049 34.9839 8.36602 35.6095C8.40756 35.671 8.4593 35.7251 8.51903 35.7693L9.14212 36.1281C9.4165 36.3614 9.69088 36.5947 9.95986 36.8309C9.81891 37.0217 9.69237 37.253 9.40229 37.1996C9.01822 37.154 8.65475 37.0029 8.35231 36.7632C7.81046 36.2893 7.24026 35.8487 6.64481 35.4437C6.30794 35.2227 6.06187 34.7548 5.53054 34.9244L4.8307 32.8071Z" fill="#B7B7B7"/>
<path d="M24.4628 29.8899C24.5978 30.2514 24.3069 30.4456 24.1398 30.6914C23.7554 31.1978 23.533 31.8077 23.5019 32.4412C22.7245 33.0048 21.8446 33.4116 20.9118 33.6386L21.1091 33.2534C21.2673 32.9642 21.6397 32.7546 21.4191 32.3352C21.7993 31.9186 22.0966 31.4337 22.2948 30.9065C22.3474 30.886 22.402 30.8711 22.4576 30.8621C22.624 31.008 22.7929 31.1457 22.9565 31.2863C22.8678 31.4977 22.5483 31.6245 22.7057 32.0155C22.9631 31.784 23.1205 31.5982 22.9701 31.286C23.1586 31.0152 23.2381 30.7468 22.9362 30.5005L23.448 30.1627C23.6753 30.359 23.8744 30.3573 24.0357 30.0871C24.1118 29.9303 24.2291 29.7863 24.4628 29.8899Z" fill="#EEEEEE"/>
<path d="M5.53054 34.9243C6.06186 34.7547 6.29945 35.2065 6.64481 35.4436C7.24025 35.8486 7.81046 36.2893 8.3523 36.7632C8.65414 36.9957 9.01434 37.141 9.3938 37.1835C9.68388 37.2369 9.81043 37.0055 9.95137 36.8147L10.0095 36.7155L10.1067 36.6644L10.3507 36.8793C10.1424 37.1124 9.90118 37.3354 10.0935 37.7011C10.2208 37.9431 10.4522 37.9244 10.6796 37.8323C10.929 38.0444 11.2477 38.021 11.5166 38.1129C11.3001 38.3435 11.1548 38.7358 10.7356 38.6336C10.6608 38.5699 10.599 38.4788 10.5114 38.4563C9.1428 38.0544 7.88097 37.3561 6.81575 36.411C6.75509 36.0859 6.48995 36.0537 6.24488 35.9286C5.8972 35.7133 5.36256 35.5619 5.53054 34.9243Z" fill="#787878"/>
<path d="M10.3507 36.8794L10.1067 36.6644L10.5712 35.5551C10.8251 35.4216 11.0087 35.6134 11.22 35.6876C11.31 35.7608 11.4149 35.8136 11.5276 35.8421C11.6402 35.8706 11.7578 35.8742 11.8722 35.8526L12.0975 35.9401C12.1723 36.0037 12.2417 36.0702 12.3194 36.1392C12.3254 36.2877 12.3665 36.4325 12.4394 36.5618C12.5122 36.6912 12.6148 36.8014 12.7386 36.8835C12.8625 36.9657 13.0041 37.0173 13.1521 37.0344C13.3 37.0514 13.4499 37.0333 13.5897 36.9815C13.8096 36.9276 13.9323 37.0691 14.0917 37.1363L14.0447 37.2434C13.8906 37.4618 13.7674 37.7257 13.4228 37.6735C13.276 37.5476 13.1031 37.4558 12.9164 37.4044C12.7297 37.3531 12.5338 37.3435 12.3427 37.3765C11.8197 37.3768 11.299 37.3116 10.7928 37.1824L10.3507 36.8794Z" fill="#4B4B4B"/>
<path d="M6.84247 36.3832C7.90769 37.3282 9.16952 38.0265 10.5381 38.4284C10.6258 38.4509 10.6875 38.542 10.7623 38.6057C10.7037 38.6777 10.6623 38.7956 10.5864 38.8218C10.1885 38.983 9.77938 39.1226 9.37304 39.2677C8.87107 38.9687 8.26339 38.8489 8.21922 38.0963C8.19739 37.6616 7.72061 37.5416 7.44058 37.2975C7.16054 37.0535 6.80206 36.8438 6.84247 36.3832Z" fill="#B7B7B7"/>
<path d="M10.7843 37.1662C11.2905 37.2955 11.8112 37.3607 12.3342 37.3603C12.5272 37.3237 12.7259 37.3307 12.9155 37.3806C13.1052 37.4305 13.2812 37.5221 13.4305 37.6488C13.0243 37.9543 12.5532 38.1621 12.0538 38.2561C11.8532 38.3204 11.7167 38.1657 11.5596 38.0767C11.269 37.9961 10.9503 38.0195 10.7225 37.796L10.7843 37.1662Z" fill="#919191"/>
<path d="M21.1204 33.2748L20.9232 33.6601L20.5983 33.9339C20.4649 33.7981 20.2661 33.6692 20.3494 33.4606C20.4582 32.9445 20.6697 32.455 20.9714 32.0213C21.0623 31.9425 21.1251 31.8364 21.1504 31.719C21.1757 31.6017 21.1622 31.4795 21.1119 31.3707C21.0157 31.1879 20.7089 31.1158 20.829 30.8329L21.2538 31.0901C21.4596 31.2977 21.6735 31.5079 21.4806 31.8359C21.426 31.9151 21.3932 32.0071 21.3854 32.1028C21.3776 32.1984 21.3952 32.2944 21.4363 32.381C21.2445 32.6192 20.9572 32.8595 21.1204 33.2748Z" fill="#EBEBEB"/>
<path d="M23.5018 32.4411C23.533 31.8076 23.7553 31.1977 24.1398 30.6913C24.3619 31.1924 23.8583 31.6769 24.116 32.1799C24.0571 32.2853 23.9648 32.3683 23.8535 32.4156C23.7423 32.4629 23.6185 32.4719 23.5018 32.4411Z" fill="#CBCBCB"/>
<path d="M14.1988 36.7366C14.3137 36.7002 14.4368 36.6985 14.5524 36.7317C14.6681 36.765 14.7712 36.8317 14.8486 36.9235C14.5948 37.057 14.3595 37.3044 14.0362 37.2272L14.0833 37.1201L14.1988 36.7366Z" fill="#CBCBCB"/>
<path d="M41.6611 10.979C41.7711 11.6077 40.9953 11.5352 40.8862 11.9702C40.6251 11.9932 40.3626 11.9509 40.1225 11.847C39.8824 11.743 39.6724 11.5808 39.5114 11.375C39.3129 10.8272 38.8053 10.6616 38.3293 10.4383C38.2445 10.2769 38.2303 10.1059 38.3885 9.96088C38.516 10.0723 38.6464 10.1891 38.8416 10.1276C38.8406 9.92908 38.6917 9.84261 38.5374 9.75898C38.5197 9.54175 38.502 9.32451 38.476 9.10473C39.0855 9.3197 39.5851 9.78467 40.2661 9.88652C40.7392 10.2487 41.1988 10.6112 41.6611 10.979ZM40.5759 10.9868C40.3038 10.7317 40.1786 10.5985 40.0428 10.4845C39.907 10.3706 39.7679 10.224 39.4907 10.2737C39.6039 10.4683 39.7607 10.6339 39.949 10.7576C40.1372 10.8813 40.3518 10.9598 40.5759 10.9868Z" fill="#9B9B9B"/>
<path d="M30.746 12.2226L30.1736 12.5237C30.1726 12.0368 30.2212 12.0112 30.746 12.2226Z" fill="#434343"/>
<path d="M31.9494 11.6789C31.8815 11.769 31.7944 11.843 31.6945 11.8955C31.5945 11.9481 31.4842 11.9779 31.3715 11.9828C31.3669 11.4497 31.3669 11.4497 31.9494 11.6789Z" fill="#434343"/>
<path d="M60.2091 20.8663C60.0201 20.9657 59.8349 20.9807 59.7493 20.7786C59.6637 20.5764 59.8411 20.4419 59.942 20.2928C60.0283 20.3608 60.0974 20.4481 60.1438 20.5477C60.1902 20.6473 60.2125 20.7564 60.2091 20.8663Z" fill="#AAAAAA"/>
<path d="M55.3176 12.811C55.1319 12.6546 54.9193 12.5125 54.998 12.2033C55.2125 12.1523 55.4352 12.1038 55.5437 12.3626C55.6522 12.6213 55.4133 12.6783 55.3176 12.811Z" fill="#787878"/>
<path d="M46.7691 49.6367C46.8392 49.6932 46.9184 49.7374 47.0034 49.7675L46.8043 50.0576L46.7691 49.6367Z" fill="#414141"/>
<path d="M63.7313 84.7857L63.7772 85.3451C63.5666 85.4559 63.4481 85.2436 63.2603 85.2668C63.0726 85.29 63.1485 85.408 63.2426 85.4821C63.5247 85.7475 63.8643 85.9447 64.2352 86.0585C64.4933 86.1297 64.7336 86.2535 64.9409 86.4221C65.1483 86.5907 65.3182 86.8005 65.44 87.0383C64.876 86.7788 64.3254 86.5054 63.7563 86.2623C63.0522 85.9461 62.3926 85.5309 61.572 85.6879C61.0903 85.5979 60.5493 85.5392 60.5264 84.9059C60.5059 84.5391 60.1399 84.3677 60.0739 84.0454C60.6392 83.652 61.2983 83.8958 61.8959 83.7737C62.1611 83.9501 62.3799 84.2744 62.75 84.0866L63.7313 84.7857ZM62.4842 85.0365L62.2705 84.9841C62.2875 85.0164 62.2643 85.0903 62.2836 85.1008C62.3546 85.1242 62.4269 85.1435 62.5002 85.1585L62.4842 85.0365Z" fill="#E2E2E2"/>
<path d="M61.9474 86.0738C62.4316 86.4439 62.9184 86.8057 63.408 87.173C63.2226 87.4628 62.7774 87.2849 62.6231 87.6339L62.1834 87.309C61.5624 86.7706 61.5624 86.7706 61.9474 86.0738Z" fill="#E2E2E2"/>
<path d="M62.1916 87.3116L62.6313 87.6364L62.2985 88.0655C61.9429 87.8612 61.938 87.6028 62.1916 87.3116Z" fill="#C0C0C0"/>
<path d="M64.7191 92.9302C64.5085 93.041 64.3671 92.9162 64.2845 92.7331C64.202 92.5499 64.0768 92.4167 64.1575 92.2163C64.6153 92.4836 64.6153 92.4836 64.7191 92.9302Z" fill="#C0C0C0"/>
<path d="M33.6045 24.9858C33.7917 25.2238 33.7665 25.4773 33.4733 25.5491C32.9384 25.6725 32.4446 25.8087 32.5042 26.5119L31.0044 26.3739C30.4677 26.5463 30.3183 27.0094 29.9369 27.3198C28.7238 27.3468 27.5102 28.0674 26.2105 27.5495C25.7123 27.278 25.1778 27.0783 24.623 26.9564C24.5779 26.943 24.5359 26.9208 24.4995 26.891C24.4631 26.8612 24.4331 26.8244 24.4112 26.7828C24.3894 26.7412 24.3761 26.6957 24.3721 26.6488C24.3682 26.602 24.3737 26.5548 24.3883 26.51C24.7576 26.4256 25.0751 26.7804 25.4488 26.6388C25.6005 26.7306 25.7469 26.8253 25.9387 26.7313C25.8788 26.4469 25.679 26.4079 25.4316 26.4487C24.8481 26.021 24.2567 25.6043 23.6812 25.1655C23.5473 25.1053 23.44 24.9989 23.3789 24.8658C23.3177 24.7327 23.3069 24.5819 23.3484 24.4411C26.897 26.2067 26.897 26.2067 28.1388 25.9723L25.295 23.8293C25.9562 23.8392 26.6081 23.982 27.2119 24.2492C30.252 25.6642 30.7864 25.802 32.1381 25.606C30.4619 24.9359 28.9591 24.4905 27.5684 23.7733C27.5201 23.7045 27.4588 23.6458 27.3878 23.6005L27.7075 23.199L28.7951 23.6019C30.0514 24.2593 31.3928 24.7412 32.7818 25.034C32.914 25.0859 33.0561 25.1085 33.1982 25.1002C33.3402 25.0919 33.4789 25.0528 33.6045 24.9858ZM28.5416 26.0695L28.4135 26.0751L28.443 26.1968L28.5925 26.1663L28.5416 26.0695Z" fill="#858585"/>
<path d="M47.2938 18.1363C46.8836 18.5099 46.5968 19.0658 45.9107 18.9804C46.0318 18.7519 46.1995 18.5333 46.0383 18.2268C46.1088 18.0593 46.2559 17.9064 46.1222 17.6128C45.6293 17.2954 45.0408 17.1585 44.4568 17.2254C45.0457 17.7945 45.7187 17.7632 45.9931 18.2849L44.585 18.5311C44.8193 19.0945 45.3634 19.028 45.7947 19.1925C45.8247 19.297 45.8297 19.4072 45.8095 19.5143C45.7892 19.6213 45.7443 19.7222 45.6781 19.809C45.6119 19.8958 45.5264 19.9661 45.4284 20.0142C45.3304 20.0624 45.2225 20.087 45.1134 20.0863C44.7848 20.1223 44.4527 20.1096 44.1282 20.0484C43.9858 20.0266 43.8401 20.0413 43.7046 20.0909C43.5692 20.1405 43.4484 20.2235 43.3536 20.3322C43.034 20.0537 42.6334 19.8844 42.21 19.8489C41.7147 19.8193 41.2288 19.703 40.7745 19.5053C40.5804 19.3328 40.3618 19.1663 40.476 18.8591L41.1547 18.8386C41.6014 18.0887 40.6712 18.0767 40.5098 17.6124C41.146 17.5112 41.7562 17.9111 42.3735 17.6689C42.3174 17.205 42.1219 16.7693 41.8127 16.4191C42.5266 16.2427 43.0908 16.8042 43.761 16.7675C44.1444 16.5659 44.038 16.2717 43.7914 16.065C43.4007 15.7418 42.9541 15.4824 42.5652 15.1102C43.3604 15.1666 44.1404 15.3524 44.8746 15.6601C46.0981 16.1906 47.4946 16.3418 48.5607 17.2022C48.4766 17.3701 48.4149 17.5673 48.2027 17.5965C47.8355 17.6455 47.4623 17.6701 47.0894 17.7083C46.9737 17.7093 46.8623 17.7524 46.7759 17.8294C46.6895 17.9065 46.6341 18.0122 46.62 18.1268L47.2938 18.1363ZM44.0622 19.1494C43.0801 18.4095 42.979 18.4008 42.2381 19.024C42.8193 19.2287 43.4455 19.2739 44.0514 19.155L44.0622 19.1494ZM44.3585 17.7989C44.3207 17.8188 44.2441 17.8042 44.2335 17.8234C44.2106 17.8859 44.1962 17.9512 44.1908 18.0175C44.2232 18.0005 44.2973 18.0233 44.3079 18.0041C44.3308 17.9373 44.3478 17.8686 44.3585 17.7989ZM44.6179 16.5091C44.5801 16.529 44.4952 16.5118 44.4846 16.5311C44.4617 16.6012 44.4466 16.6736 44.4396 16.747C44.4774 16.7271 44.5623 16.7443 44.5728 16.725C44.6019 16.6514 44.6242 16.5753 44.6395 16.4977L44.6179 16.5091ZM43.4394 17.5065L43.2926 17.5288C43.3211 17.596 43.3551 17.6608 43.3944 17.7224C43.3944 17.7224 43.4788 17.7124 43.5305 17.7058L43.4394 17.5065Z" fill="#787878"/>
<path d="M13.3989 33.8001C13.3291 33.8663 13.2418 33.911 13.1473 33.9291C13.0529 33.9471 12.9553 33.9376 12.8663 33.9017C11.9406 33.5173 11.0722 33.0085 10.2852 32.3894C10.2304 32.428 10.1862 32.4799 10.1568 32.5401C10.1274 32.6003 10.1138 32.6669 10.1172 32.7337C10.1207 32.8005 10.1411 32.8653 10.1765 32.922C10.2119 32.9786 10.2611 33.0254 10.3196 33.0578C10.6413 33.3486 11.002 33.5932 11.3915 33.7848C12.0568 34.0989 12.6697 34.5128 13.209 35.0122C12.513 35.0043 11.8415 34.7591 11.306 34.3172C10.2569 33.6332 9.1948 32.9903 8.12143 32.3259C7.71147 32.8573 8.54905 33.021 8.43175 33.4534C8.06298 33.2766 7.69859 33.0426 7.32696 33.4372C7.07212 33.2279 6.84429 33.0045 6.45158 33.1492C6.05887 33.294 5.84673 33.0348 5.61324 32.8006C5.7505 32.6193 5.93395 32.4781 6.14438 32.3916C6.35481 32.305 6.58448 32.2765 6.80936 32.3088C6.76415 31.646 6.08036 31.3946 6.24475 30.7109C7.09545 30.847 7.52254 31.6591 8.35677 31.9344C8.36709 31.7281 8.32461 31.5228 8.23334 31.3378C8.14207 31.1528 8.005 30.9941 7.83506 30.8769C7.71744 30.792 7.6367 30.6656 7.60921 30.5233C7.58172 30.3809 7.60952 30.2333 7.68699 30.1103L8.18099 30.4203C8.3369 30.6013 8.52568 30.7512 8.73746 30.8622C9.58914 31.1883 10.3816 31.6502 11.084 32.2302C11.1586 32.3037 11.2511 32.3567 11.3524 32.384C11.4537 32.4113 11.5605 32.412 11.6624 32.386C10.8295 31.6577 10.1096 30.8101 9.52602 29.8708C10.6768 30.3023 11.3413 30.9758 12.2835 30.9059C13.3548 31.7499 14.7186 32.1929 15.6494 33.255C14.5107 33.3183 13.8823 31.9531 12.6862 32.3007C12.708 32.7354 13.0238 32.8508 13.1914 33.0647C13.0397 33.4054 13.3452 33.5537 13.3989 33.8001Z" fill="#B7B7B7"/>
<path d="M15.3849 31.6639C15.0472 31.4746 14.7233 31.2619 14.4157 31.0271C14.0246 30.6767 13.3904 30.4542 13.8063 29.6587C13.9432 29.3945 13.2753 29.121 13.3921 28.6614C14.197 28.6843 14.5465 29.4274 15.2182 29.7606C15.8899 30.0939 16.406 30.564 17.2634 30.3327C17.1063 28.9461 15.5387 28.9673 15.0157 27.8418C15.9037 27.9309 16.4761 28.4949 17.1722 28.678C17.8675 28.8901 18.5483 29.1467 19.2102 29.4461C19.1205 28.1614 17.7905 28.0576 17.1695 27.0867C18.3079 27.3825 19.413 27.7927 20.4678 28.311L21.3892 29.0142C21.4415 29.4803 21.407 29.9523 21.2873 30.4065C20.6726 30.3522 20.1319 29.8745 19.366 30.0439C19.5928 30.213 19.7342 30.3377 19.8973 30.451C20.0603 30.5644 20.3134 30.6785 20.5312 30.8042C19.8435 31.3581 19.1301 30.985 18.4296 30.8591C18.3577 30.6753 18.2322 30.5176 18.0691 30.4062C17.906 30.2949 17.7131 30.2351 17.5151 30.2346L17.521 30.8357C16.9676 31.2778 16.5003 30.7958 15.9896 30.6113L15.8702 31.2233L15.3849 31.6639Z" fill="#787878"/>
<path d="M15.842 31.1694L15.9613 30.5574C16.472 30.7419 16.9393 31.2239 17.4927 30.7818C17.5383 30.7877 17.5815 30.8055 17.6179 30.8333C17.6543 30.8612 17.6827 30.8981 17.7003 30.9404C17.6683 31.0463 17.6712 31.1596 17.7085 31.2635C17.7458 31.3675 17.8155 31.4567 17.9075 31.518C18.2089 31.7371 18.5154 31.9397 18.8194 32.1506C18.5164 32.5708 18.7334 33.0883 18.6634 33.4272C18.5742 33.5426 18.4552 33.6317 18.3193 33.6851C18.1834 33.7384 18.0357 33.7539 17.8919 33.73C17.6921 33.6909 17.4377 33.653 17.3565 33.8262C17.054 34.562 16.3 34.3475 15.7476 34.5557C15.7066 34.582 15.6703 34.615 15.6403 34.6533C15.4071 34.3179 15.081 34.0577 14.7017 33.9043L13.1588 33.068C12.9911 32.8541 12.6753 32.7387 12.6535 32.3039C13.8766 31.9421 14.5163 33.3289 15.6353 33.2279C14.7157 32.1874 13.352 31.7443 12.2694 30.8788C12.0508 30.5681 11.8377 30.2546 11.5741 29.8714C12.2404 30.0633 12.6346 30.5769 13.1798 30.8531C13.725 31.1294 14.2578 31.4739 14.8086 31.7609C15.084 31.9044 15.3165 32.2284 15.7033 32.0593C16.1474 32.2784 16.6245 32.424 17.1159 32.4904C17.2222 32.4308 17.3039 32.3353 17.3462 32.2212C17.3886 32.107 17.3888 31.9817 17.3468 31.8678L15.842 31.1694Z" fill="#6A6A6A"/>
<path d="M12.6397 24.622C12.7879 24.091 12.0717 24.0008 12.0949 23.4943C12.1373 23.1424 12.5784 23.1027 12.6463 22.7992C13.373 22.8701 13.7611 23.4899 14.361 23.6343C14.9952 23.136 14.1494 22.9698 14.1777 22.5911L15.3174 23.4471C15.4645 23.7268 15.1685 23.9374 15.1775 24.1249C15.2402 25.1355 14.3262 25.2592 13.7753 25.6931C13.7159 25.7243 13.5171 25.5955 13.3852 25.5413C13.4642 24.9573 13.0273 24.7821 12.6197 24.5708L12.6397 24.622Z" fill="#919191"/>
<path d="M24.4628 29.8898C24.2291 29.7861 24.1118 29.9302 24.0146 30.1255C23.8533 30.3957 23.6543 30.3974 23.4269 30.2011C23.0268 29.9516 22.7218 29.5422 22.1646 29.492C22.0308 29.4868 21.9701 29.3059 21.9892 29.1585C22.4766 28.6825 23.2657 29.4621 23.7025 28.7587C23.6841 28.7113 23.6604 28.6662 23.6318 28.6242C23.4237 28.2942 23.0375 28.3463 22.724 28.2091C22.4105 28.0719 22.0001 27.8552 22.1133 27.3494L22.4574 27.3744C23.062 27.6194 23.6691 27.8562 24.2685 28.1177C24.5316 28.2739 24.843 28.329 25.1446 28.2727C25.4461 28.2164 25.7172 28.0526 25.9072 27.8119L26.6486 28.2253C26.6741 28.2737 26.6646 28.3473 26.6684 28.4071L26.0591 29.0708L24.4508 28.9624C24.7329 29.3152 24.8206 29.6261 24.4628 29.8898Z" fill="#787878"/>
<path d="M33.4025 23.3826C32.8692 22.7225 31.9886 22.5951 31.3635 22.1275C31.5605 21.5845 31.9023 22.0638 32.1258 21.912C32.2086 21.532 31.6575 21.5198 31.6889 21.16C31.9063 21.0881 32.1424 21.0983 32.3521 21.1888C33.2494 21.5535 34.1968 21.7819 35.1629 21.8663C35.3375 21.8705 35.5044 22.0437 35.6726 22.1406C35.6486 22.2763 35.6652 22.416 35.7205 22.542C35.7757 22.6681 35.8671 22.7749 35.9832 22.8491L36.0349 23.2751C35.17 23.2562 34.4039 22.6911 33.4887 22.7468C33.4874 22.9672 33.4817 23.1006 33.4843 23.2366C33.4459 23.2782 33.4179 23.3282 33.4025 23.3826Z" fill="#858585"/>
<path d="M25.9669 27.7944C25.777 28.0351 25.5059 28.1989 25.2043 28.2551C24.9027 28.3114 24.5913 28.2563 24.3283 28.1001C23.7288 27.8387 23.1217 27.6019 22.5171 27.3569L22.6467 26.8562C22.5043 26.2445 21.8398 26.2919 21.6197 25.7554C22.6388 25.7138 23.4931 26.1844 24.3829 26.5129C24.3683 26.5577 24.3628 26.6049 24.3667 26.6517C24.3707 26.6986 24.384 26.7441 24.4059 26.7857C24.4277 26.8273 24.4577 26.8641 24.4941 26.8939C24.5305 26.9237 24.5725 26.9459 24.6177 26.9593C25.1724 27.0812 25.7069 27.2809 26.2051 27.5524L25.9669 27.7944Z" fill="#919191"/>
<path d="M40.6982 21.969C40.5354 22.3017 40.2175 22.2218 39.9586 22.2275C39.7947 22.1983 39.6257 22.2141 39.4698 22.2731C39.3139 22.3322 39.1768 22.4323 39.0731 22.5627C38.7854 22.3433 38.5076 22.0775 38.0972 22.2934C37.9141 22.1288 37.7336 21.9559 37.5505 21.7913C37.4779 21.7492 37.394 21.7304 37.3102 21.7376C37.2264 21.7448 37.1467 21.7777 37.0822 21.8317C37.0326 21.8178 36.9895 21.787 36.9605 21.7446C36.6946 21.5274 36.4946 21.1864 36.0471 21.3188C35.0401 20.9563 34.0779 20.4813 33.1788 19.9026C34.7053 19.8687 35.6475 20.6639 36.7603 20.8132C37.6115 21.1171 38.4882 21.3452 39.3803 21.495C39.8603 21.5043 40.3234 21.6708 40.6982 21.969Z" fill="#787878"/>
<path d="M35.9245 23.9305C35.8476 24.1906 35.9052 24.4967 35.5502 24.7658C35.0256 24.8563 34.3794 24.5714 33.7565 24.8029C33.6457 24.7102 33.5449 24.5709 33.4189 24.5411C32.075 24.1959 30.758 23.7551 29.4779 23.2222C29.3624 23.1731 29.1947 23.2475 29.0504 23.2616C28.844 23.1574 28.5948 23.1031 28.5246 22.8517C28.585 22.5864 28.7676 22.5797 28.9512 22.6273C29.5957 22.817 30.2298 23.0396 30.8766 23.2075C31.5234 23.3754 32.2655 23.5411 32.9663 23.6806C33.1962 23.7245 33.285 23.513 33.3855 23.3503C33.4122 23.2995 33.4506 23.2557 33.4977 23.2227C33.5742 23.4556 33.7299 23.6542 33.9381 23.7842C34.1462 23.9142 34.3935 23.9674 34.6374 23.9346C35.0537 23.8872 35.4963 23.9291 35.9245 23.9305Z" fill="#AAAAAA"/>
<path d="M40.4675 18.843C40.3533 19.1502 40.5719 19.3167 40.766 19.4893C40.4913 19.6749 40.5458 19.9621 40.5345 20.2289L40.4139 20.3404C40.1848 19.9048 39.7159 20.2063 39.4305 19.9651C39.439 19.6929 39.5481 19.4021 39.2714 19.1906C39.017 19.4411 39.017 19.4411 39.0515 19.8212L38.5888 20.0164C38.4229 19.8977 38.2625 19.7761 38.0992 19.6492L38.4978 19.0962C38.3912 18.5001 37.659 18.7204 37.5433 18.2252C37.5994 18.1613 37.6706 18.0346 37.7035 18.0448C38.6444 18.239 39.5685 18.5059 40.4675 18.843Z" fill="#9B9B9B"/>
<path d="M29.0505 23.2617C29.1947 23.2476 29.3624 23.1732 29.4779 23.2223C30.7598 23.7545 32.0787 24.1943 33.4243 24.5383C33.5503 24.5682 33.6511 24.7074 33.7619 24.8002L33.6873 24.8943L33.6099 24.9831C33.4838 25.0514 33.3443 25.0913 33.2012 25.1001C33.0582 25.109 32.915 25.0864 32.7818 25.0341C31.3928 24.7413 30.0514 24.2595 28.7951 23.602L29.0505 23.2617Z" fill="#E2E2E2"/>
<path d="M22.173 27.3319C22.0598 27.8377 22.4504 28.0167 22.7837 28.1916C23.117 28.3665 23.4618 28.2881 23.6915 28.6067C23.7201 28.6487 23.7438 28.6938 23.7622 28.7411C23.3254 29.4446 22.5363 28.665 22.0489 29.141C21.8475 29.0204 21.6488 28.8915 21.399 28.9542L20.4777 28.251L20.9733 27.6333C21.2824 27.3952 21.8327 27.7992 22.0295 27.2426C22.0872 27.2526 22.1387 27.2846 22.173 27.3319Z" fill="#B7B7B7"/>
<path d="M41.6611 10.9789C41.1988 10.6111 40.7392 10.2486 40.2823 9.87787C40.4124 9.40435 39.7464 9.37018 39.7549 8.95377C40.0676 8.76344 40.435 8.68346 40.7979 8.72672C41.1609 8.76998 41.4983 8.93396 41.7557 9.19224C42.2646 9.56994 42.7681 9.9505 43.2741 10.3228L43.0933 10.569L41.0145 9.51339C41.2973 10.0512 41.8304 10.121 41.9505 10.559L41.6611 10.9789Z" fill="#CBCBCB"/>
<path d="M5.61605 32.806C5.84954 33.0403 6.05936 33.3212 6.45439 33.1547C6.84941 32.9881 7.07493 33.2334 7.32976 33.4426C7.66353 33.6945 7.93174 34.0227 8.11201 34.3997C8.29227 34.7766 8.37935 35.1915 8.36598 35.6095C7.24045 34.9839 6.25129 34.1414 5.45581 33.1306L5.61605 32.806Z" fill="#787878"/>
<path d="M40.6982 21.969C40.3306 21.6662 39.8733 21.4919 39.3962 21.4729C38.5042 21.3232 37.6274 21.095 36.7762 20.7912L37.3063 20.121L38.4638 20.3293C38.8541 21.0714 39.4548 21.1125 40.1096 20.8368C40.4313 21.1207 40.9922 20.9287 41.2383 21.3966L40.6542 21.9509L40.6982 21.969Z" fill="#C0C0C0"/>
<path d="M37.5505 21.7913L38.0944 22.2879L37.7062 23.11C37.6255 23.1605 37.5577 23.229 37.5082 23.3102C37.395 23.0951 37.2572 23.0166 37.0957 23.2732C36.873 22.7449 36.3808 22.9626 35.983 22.8354C35.8679 22.7621 35.7769 22.6568 35.7213 22.5323C35.6656 22.4079 35.6477 22.2698 35.6698 22.1351L36.099 21.7583C36.2397 21.8154 36.3909 21.8426 36.5429 21.8383C36.6949 21.834 36.8445 21.7982 36.9821 21.7332C37.0111 21.7756 37.0542 21.8064 37.1038 21.8203C37.1723 21.8609 37.2517 21.8799 37.3314 21.8747C37.4111 21.8695 37.4875 21.8405 37.5505 21.7913Z" fill="#454545"/>
<path d="M27.563 23.7762C28.9537 24.4934 30.4565 24.9388 32.1327 25.6088C30.7869 25.8292 30.2466 25.6671 27.2065 24.252L27.563 23.7762Z" fill="#DADADA"/>
<path d="M49.9409 6.94015C49.5789 6.68432 49.2209 6.35766 48.8302 6.89954C48.6914 6.76661 48.4738 6.65447 48.4355 6.50298C48.3198 6.00771 48.2638 5.4948 48.1893 5.01223C48.6267 4.78215 48.9937 4.86377 49.077 5.23189C49.1192 5.50691 49.2241 5.76842 49.3834 5.9964C49.5427 6.22438 49.7524 6.41278 49.9963 6.54718C50.0348 6.56809 49.9602 6.80643 49.9409 6.94015Z" fill="#6A6A6A"/>
<path d="M43.2741 10.3228C42.7681 9.95048 42.2646 9.56993 41.7557 9.19222C41.866 9.06211 42.0106 8.96527 42.1729 8.91263C42.3353 8.85998 42.5091 8.85364 42.6745 8.89432C43.056 8.96582 43.407 9.14936 43.6826 9.42144C43.9415 9.70405 43.832 9.96764 43.2741 10.3228Z" fill="#636363"/>
<path d="M38.4476 20.3378L37.3063 20.121C36.827 19.7209 35.9968 19.8074 35.7377 18.9344C36.6481 18.9088 37.3195 19.5168 38.1154 19.6406C38.2787 19.7675 38.4392 19.8891 38.605 20.0078L38.4476 20.3378Z" fill="#919191"/>
<path d="M15.842 31.1694L17.3666 31.9054C17.4086 32.0194 17.4084 32.1447 17.366 32.2588C17.3237 32.373 17.242 32.4684 17.1357 32.5281C16.6442 32.4617 16.1672 32.3161 15.7231 32.097L15.3849 31.6638L15.842 31.1694Z" fill="#4B4B4B"/>
<path d="M21.9971 27.2597C21.8003 27.8163 21.25 27.4123 20.9409 27.6504C20.2278 27.2908 19.4354 27.069 18.9037 26.2021L21.9971 27.2597Z" fill="#919191"/>
<path d="M13.3852 25.5411C13.2607 25.737 13.2085 26.0048 12.781 26.0442C12.2699 25.5043 11.8379 24.8947 11.4979 24.2337C12.0578 24.1315 12.2884 24.5045 12.6397 24.6219C12.5769 25.1973 13.1293 25.2775 13.4052 25.5924L13.3852 25.5411Z" fill="#A2A2A2"/>
<path d="M8.18097 30.4202L7.68698 30.1102C7.34194 29.0215 7.34194 29.0215 8.26084 28.5794C8.39837 29.2211 8.61949 29.812 8.18097 30.4202Z" fill="#636363"/>
<path d="M47.3977 8.30531C46.9205 7.86977 46.8843 7.25032 46.7339 6.50555L48.1024 7.35111L47.578 8.03198L47.3705 8.30592L47.3977 8.30531Z" fill="#787878"/>
<path d="M41.9343 10.5676C41.8142 10.1296 41.2623 10.0766 40.9983 9.52203L43.0771 10.5776C43.1959 10.8035 43.2031 11.04 42.9387 11.1928C42.6743 11.3455 42.5571 11.2012 42.4185 11.0819C42.248 10.9192 42.0864 10.7475 41.9343 10.5676Z" fill="#919191"/>
<path d="M39.3216 11.7219C39.3367 11.8098 39.342 11.899 39.3375 11.9881C39.3545 12.0204 39.301 12.076 39.2406 12.197C38.8903 12.1026 38.564 11.936 38.2826 11.708C38.0012 11.48 37.7709 11.1956 37.6066 10.8732C37.7897 10.6052 37.9505 10.7404 38.1153 10.8047L39.3216 11.7219Z" fill="#9B9B9B"/>
<path d="M5.88952 28.6458C5.77604 28.5361 5.68625 28.4044 5.62564 28.2587C5.56503 28.1131 5.53487 27.9565 5.537 27.7986C5.53913 27.6407 5.5735 27.4848 5.63803 27.3404C5.70255 27.1959 5.79587 27.0661 5.91228 26.9586C6.22134 27.5856 6.22134 27.5856 5.88952 28.6458Z" fill="#9B9B9B"/>
<path d="M39.3216 11.7219L38.1451 10.7959C38.2218 10.6664 38.2984 10.5368 38.3833 10.4098C38.8323 10.6473 39.3399 10.8129 39.5654 11.3465L39.3216 11.7219Z" fill="#CBCBCB"/>
<path d="M49.6842 8.36594C49.4844 8.47103 49.1873 8.62725 49.0863 8.33026C48.9472 7.89536 49.264 7.77678 49.6434 7.79012C49.7076 7.87059 49.7459 7.96865 49.7532 8.07141C49.7605 8.17417 49.7364 8.27684 49.6842 8.36594Z" fill="#6A6A6A"/>
<path d="M47.578 8.0319L48.1024 7.35103L48.6327 7.5596C48.4573 7.80289 48.2901 8.04872 48.1229 8.29455L47.578 8.0319Z" fill="#6A6A6A"/>
<path d="M36.9605 21.7446C36.8251 21.8047 36.6789 21.8369 36.5309 21.8393C36.3828 21.8417 36.2359 21.8141 36.099 21.7583L36.0795 21.3017C36.4892 21.1892 36.673 21.5388 36.9605 21.7446Z" fill="#858585"/>
<path d="M27.7022 23.2018L27.3825 23.6033C27.2001 23.4795 26.9142 23.3553 27.0996 23.0655C27.2851 22.7758 27.5219 23.0426 27.7022 23.2018Z" fill="#DADADA"/>
<path d="M39.8412 17.4423L39.7925 17.4679L39.7501 17.3872L39.8412 17.4423Z" fill="#787878"/>
<path d="M38.5644 9.74476C38.7133 9.83122 38.8676 9.91484 38.8686 10.1134C38.6734 10.1749 38.543 10.0581 38.4155 9.94666C38.4705 9.88348 38.5203 9.81596 38.5644 9.74476Z" fill="#CBCBCB"/>
<path d="M46.4036 13.4417L46.4262 13.6289C46.4076 13.607 46.3941 13.5813 46.3866 13.5536C46.3936 13.5168 46.4049 13.481 46.4201 13.4467L46.4036 13.4417Z" fill="#A2A2A2"/>
<path d="M46.4255 13.4439C46.4028 13.4009 46.3632 13.3256 46.3604 13.3202C46.3576 13.3148 46.4306 13.2833 46.4198 13.4332L46.4255 13.4439Z" fill="#A2A2A2"/>
<path d="M45.6635 13.9615C45.6437 13.9238 45.6041 13.8485 45.6012 13.8432C45.5984 13.8378 45.6715 13.8062 45.6606 13.9561L45.6635 13.9615Z" fill="#A2A2A2"/>
<path d="M40.6763 21.9669L41.2604 21.4126C41.0143 20.9447 40.4375 21.1588 40.1317 20.8528L40.4139 20.3405L40.5345 20.229C40.6844 20.514 40.9794 20.5374 41.2636 20.5664C41.8104 20.5686 42.3516 20.6729 42.8593 20.8738L43.397 20.3232C43.6549 21.2723 43.5672 21.3939 42.7067 21.3179C42.5756 21.316 42.4447 21.3318 42.3176 21.3646C42.0575 21.4742 41.8467 21.6755 41.7256 21.93C41.3912 22.4216 41.0351 22.3343 40.6763 21.9669Z" fill="#787878"/>
<path d="M35.9245 23.9305C35.4963 23.9292 35.065 23.9088 34.6317 23.9239C34.3879 23.9567 34.1405 23.9035 33.9324 23.7735C33.7243 23.6435 33.5685 23.4449 33.492 23.212C33.4894 23.076 33.4951 22.9426 33.4964 22.7222C34.4117 22.6665 35.1422 23.2297 36.0426 23.2505C36.2 23.3531 36.3545 23.4503 36.5065 23.5558L36.4923 23.8173L35.9245 23.9305Z" fill="#4B4B4B"/>
<path d="M37.709 23.1154L38.0972 22.2933C38.5076 22.0775 38.8069 22.332 39.0731 22.5627C39.0242 22.6918 38.949 22.8095 38.8523 22.9083C38.7557 23.0071 38.6396 23.0849 38.5114 23.1369C38.3833 23.1888 38.2458 23.2137 38.1077 23.21C37.9696 23.2063 37.8338 23.1741 37.709 23.1154Z" fill="#858585"/>
<path d="M37.0051 23.9664L36.4924 23.8172L36.4875 23.5589C36.659 23.4 36.9867 23.5641 37.0762 23.2493C37.1196 23.3042 37.179 23.3443 37.2462 23.3643C37.3134 23.3842 37.3853 23.3829 37.4519 23.3607C37.4466 23.3873 37.4468 23.4147 37.4525 23.4412C37.4581 23.4678 37.4691 23.4929 37.4848 23.515C37.2348 23.5641 37.1569 23.7698 37.0051 23.9664Z" fill="#4B4B4B"/>
<path d="M37.0051 23.9662C37.1353 23.781 37.2348 23.5639 37.4802 23.5584C37.511 23.8924 37.3639 24.0452 37.0051 23.9662Z" fill="#B7B7B7"/>
<path d="M37.4742 23.3899C37.4076 23.4122 37.3358 23.4134 37.2685 23.3935C37.2013 23.3736 37.1419 23.3334 37.0985 23.2785C37.26 23.022 37.4009 23.1195 37.511 23.3156L37.4742 23.3899Z" fill="#B7B7B7"/>
<path d="M26.7083 28.2078C26.8163 28.151 26.9567 28.0771 26.9927 28.2504C27.0287 28.4237 26.851 28.4005 26.7281 28.3896C26.7242 28.3298 26.715 28.2729 26.7083 28.2078Z" fill="#787878"/>
<path d="M47.2938 18.1363L46.6067 18.1407C46.6207 18.0261 46.6761 17.9204 46.7625 17.8434C46.8489 17.7663 46.9604 17.7233 47.076 17.7222C47.4489 17.684 47.8221 17.6594 48.1893 17.6104C48.4015 17.5812 48.4632 17.384 48.5473 17.2162C49.2906 17.0038 49.9867 17.3311 50.6468 17.4851C50.7044 17.5029 50.7088 17.734 50.744 17.8665L50.3266 18.1478L50.2276 18.1038C49.7063 17.7944 49.5561 18.2166 49.3635 18.5582C49.1683 18.4755 48.9672 18.3685 48.7373 18.4688C48.2318 18.5226 47.7235 18.4055 47.2938 18.1363Z" fill="#636363"/>
<path d="M51.4254 15.3867L52.4083 15.7348C52.3782 16.2421 52.1823 16.7261 51.8506 17.1128C51.6056 16.9877 51.3759 16.8133 51.0701 16.9397C51.0067 16.9701 50.9376 16.9868 50.8674 16.9888C50.7971 16.9907 50.7273 16.9779 50.6625 16.9511C50.5976 16.9243 50.5392 16.8841 50.4911 16.8333C50.4429 16.7824 50.4061 16.7219 50.383 16.6558C50.328 16.3414 50.6963 16.3468 50.7873 16.1136C50.7243 15.8103 50.1388 15.5622 50.6771 15.1829L50.8368 15.2637C50.9016 15.3218 50.983 15.3582 51.0696 15.368C51.1563 15.3777 51.244 15.3604 51.3205 15.3183L51.4254 15.3867Z" fill="#858585"/>
<path d="M50.8155 15.2888L50.6558 15.208C50.1672 14.7628 49.6208 14.3851 49.0311 14.0852C49.4867 14.0191 49.9507 14.0475 50.3941 14.1688C50.8375 14.29 51.2507 14.5014 51.6078 14.7897L51.4198 15.376L51.2992 15.3433C51.2395 15.2766 51.1573 15.2341 51.0681 15.224C50.9789 15.214 50.8889 15.237 50.8155 15.2888Z" fill="#919191"/>
<path d="M49.8971 15.4695C49.7749 15.6158 49.6977 15.794 49.6746 15.9828C49.6515 16.1716 49.6837 16.3628 49.7672 16.5333L48.8848 16.455C48.7309 16.0028 48.7141 15.515 48.8366 15.0524C49.3352 14.742 49.5394 15.1564 49.8971 15.4695Z" fill="#575757"/>
<path d="M45.8163 19.1812C45.385 19.0167 44.838 19.0778 44.6066 18.5198L46.0147 18.2736C46.1646 18.5587 45.9969 18.7773 45.887 19.0273C45.8597 19.0768 45.8361 19.1283 45.8163 19.1812Z" fill="#6A6A6A"/>
<path d="M48.7779 18.4542C48.9994 18.3377 49.2089 18.4609 49.4041 18.5436C49.2009 18.9045 48.9895 19.2629 48.7781 19.6212C48.7129 19.5538 48.673 19.466 48.6653 19.3725C48.6576 19.279 48.6824 19.1856 48.7357 19.108C48.8045 19.0142 48.8451 18.9028 48.8526 18.7869C48.8601 18.6711 48.8342 18.5556 48.7779 18.4542Z" fill="#AAAAAA"/>
<path d="M50.2739 18.1001L50.3729 18.1441L49.7644 19.2812C49.4669 18.6893 50.0327 18.4673 50.2739 18.1001Z" fill="#AAAAAA"/>
<path d="M8.36599 35.6094C8.37936 35.1913 8.29228 34.7765 8.11201 34.3995C7.93175 34.0226 7.66353 33.6944 7.32977 33.4425C7.70141 33.0479 8.0658 33.2819 8.43456 33.4587L9.13633 34.0852C9.42649 34.4801 9.79017 34.8156 10.2076 35.0733C10.328 35.2366 10.4537 35.397 10.5769 35.5657L10.0982 36.6482L10.001 36.6993L9.94285 36.7985C9.67387 36.5624 9.39949 36.3291 9.12511 36.0958C9.09611 35.4245 9.09611 35.4245 8.50202 35.7369C8.4508 35.7011 8.405 35.6582 8.36599 35.6094Z" fill="#2B2B2B"/>
<path d="M14.1987 36.7366L14.0833 37.12C13.9238 37.0528 13.8012 36.9114 13.5813 36.9652C13.4415 37.017 13.2915 37.0351 13.1436 37.0181C12.9957 37.0011 12.854 36.9494 12.7302 36.8673C12.6063 36.7851 12.5038 36.6749 12.4309 36.5456C12.3581 36.4162 12.3169 36.2714 12.3109 36.1229C12.5139 35.8926 12.7376 35.7544 13.0413 35.9516L14.1987 36.7366Z" fill="#919191"/>
<path d="M10.5627 35.5389C10.4694 35.3614 10.3166 35.2152 10.1935 35.0466L10.4422 34.497C11.0923 34.8416 11.8496 35.0887 12.0862 35.9186L11.8609 35.8311C11.6747 35.6475 11.4914 35.4693 11.2087 35.666C10.9786 35.6086 10.8166 35.4054 10.5627 35.5389Z" fill="#919191"/>
<path d="M14.389 34.3846L14.7017 33.9043C15.0845 34.0597 15.4128 34.3239 15.646 34.6641L15.5974 34.6896C15.073 35.0821 14.759 34.6294 14.389 34.3846Z" fill="#B7B7B7"/>
<path d="M10.4451 34.5023L10.1963 35.0519C9.78491 34.7993 9.42527 34.4714 9.13637 34.0852C9.20314 34.0257 9.28827 33.9908 9.37753 33.9864C9.4668 33.9819 9.55479 34.0081 9.62679 34.0607L10.4451 34.5023Z" fill="#EEEEEE"/>
<path d="M18.8253 32.1752C18.5213 31.9643 18.2148 31.7616 17.9134 31.5425C17.8215 31.4812 17.7517 31.3921 17.7144 31.2881C17.6771 31.1842 17.6742 31.0709 17.7062 30.965L18.4072 30.8297C19.1078 30.9556 19.8211 31.3288 20.5088 30.7748L20.8208 30.8305C20.6927 31.1244 21.0103 31.1908 21.1036 31.3683C20.8539 31.8635 20.3246 31.9977 19.9126 32.2761C19.814 32.2039 19.6934 32.1676 19.571 32.1733C19.4485 32.179 19.3316 32.2263 19.2396 32.3074L18.8253 32.1752Z" fill="#4B4B4B"/>
<path d="M19.2095 32.3026C19.3015 32.2215 19.4184 32.1741 19.5409 32.1684C19.6633 32.1627 19.7839 32.199 19.8825 32.2713C19.5502 32.7275 19.5502 32.7275 19.2095 32.3026Z" fill="#6A6A6A"/>
<path d="M8.52466 35.78C9.11874 35.4676 9.11874 35.4676 9.14775 36.1389L8.52466 35.78Z" fill="#787878"/>
<path d="M21.3666 28.9712C21.6163 28.9085 21.8151 29.0374 22.0165 29.1581C21.9758 29.3167 22.0365 29.4977 22.1918 29.4915C22.735 29.5148 23.0399 29.9242 23.4542 30.2007L22.9424 30.5385C22.8346 30.5498 22.7317 30.5895 22.6442 30.6536C22.5568 30.7177 22.4879 30.8039 22.4448 30.9032C22.3891 30.9122 22.3345 30.9271 22.282 30.9476L21.7623 30.7198L21.268 30.3961C21.3907 29.9313 21.4241 29.4478 21.3666 28.9712Z" fill="#2F2F2F"/>
<path d="M21.7589 30.6871L22.2787 30.9149C22.0874 31.4443 21.7967 31.9328 21.4222 32.354C21.381 32.2674 21.3635 32.1715 21.3712 32.0758C21.379 31.9802 21.4118 31.8881 21.4665 31.809C21.6594 31.4809 21.4454 31.2708 21.2343 31.066L21.7589 30.6871Z" fill="#C0C0C0"/>
<path d="M22.4415 30.8705C22.4846 30.7712 22.5534 30.685 22.6409 30.6209C22.7284 30.5568 22.8313 30.5171 22.9391 30.5058C23.241 30.7521 23.1615 31.0204 22.973 31.2912C22.7768 31.1541 22.6078 31.0164 22.4415 30.8705Z" fill="#CBCBCB"/>
<path d="M21.1205 33.2749C20.9685 32.8811 21.2558 32.6408 21.4304 32.3567C21.6397 32.7547 21.2673 32.9643 21.1205 33.2749Z" fill="#C0C0C0"/>
<path d="M22.9567 31.2999C23.1179 31.6064 22.9497 31.7979 22.6923 32.0294C22.5349 31.6384 22.8544 31.5116 22.9431 31.3002L22.9567 31.2999Z" fill="#CBCBCB"/>
<path d="M10.7843 37.1663L10.6847 37.8159C10.4687 37.9295 10.2421 37.9183 10.0986 37.6848C9.90348 37.3137 10.1339 37.0964 10.3559 36.8629L10.7843 37.1663Z" fill="#CBCBCB"/>
<path d="M11.2116 35.6713C11.4942 35.4746 11.6775 35.6528 11.8637 35.8364C11.7494 35.8579 11.6317 35.8543 11.5191 35.8258C11.4065 35.7973 11.3015 35.7446 11.2116 35.6713Z" fill="#787878"/>
<path d="M21.7589 30.6872L21.2612 31.0519L20.8364 30.7947L20.5245 30.7391C20.3152 30.6295 20.1004 30.5227 19.8906 30.3859C19.6808 30.2491 19.5918 30.1586 19.3593 29.9788C20.1167 29.7933 20.6575 30.2709 21.2806 30.3414L21.7589 30.6872Z" fill="#4D4D4D"/>
<path d="M40.5759 10.9868C40.3539 10.9564 40.1421 10.8755 39.9567 10.7504C39.7714 10.6253 39.6175 10.4593 39.5069 10.2651C39.7841 10.2155 39.9178 10.3648 40.059 10.4759C40.2002 10.5871 40.3038 10.7317 40.5759 10.9868Z" fill="#CBCBCB"/>
<path d="M62.4842 85.0364L62.5001 85.1585C62.4269 85.1434 62.3546 85.1241 62.2836 85.1007C62.2836 85.1007 62.2496 85.0362 62.2705 84.984L62.4842 85.0364Z" fill="#C0C0C0"/>
<path d="M43.3971 20.3231L42.8593 20.8737C42.3516 20.6728 41.8104 20.5685 41.2636 20.5663C40.9794 20.5373 40.6952 20.5082 40.5345 20.2289C40.5459 19.962 40.4914 19.6749 40.766 19.4892C41.2361 19.6953 41.7401 19.8141 42.2535 19.8398C42.6769 19.8753 43.0775 20.0446 43.3971 20.3231Z" fill="#CBCBCB"/>
<path d="M45.9931 18.2848C45.667 17.7697 44.9971 17.82 44.4414 17.2747C45.0254 17.2077 45.6139 17.3446 46.1068 17.662C46.2567 17.9471 46.0934 18.1085 46.0229 18.276L45.9931 18.2848Z" fill="#636363"/>
<path d="M37.1121 23.2784C37.0141 23.5771 36.6865 23.4129 36.5235 23.588C36.3715 23.4825 36.2169 23.3853 36.0595 23.2827L35.9832 22.8491C36.3859 22.9463 36.8895 22.7501 37.1121 23.2784Z" fill="#B7B7B7"/>
<path d="M37.5505 21.7913C37.4868 21.847 37.4069 21.8809 37.3227 21.8882C37.2384 21.8954 37.1542 21.8756 37.0822 21.8316C37.1467 21.7776 37.2264 21.7448 37.3102 21.7376C37.394 21.7304 37.4779 21.7491 37.5505 21.7913Z" fill="#858585"/>
<path d="M40.4139 20.3403L40.1318 20.8526C39.4387 21.121 38.8325 21.0828 38.4859 20.3451L38.6272 20.0237L39.0898 19.8284C39.1304 19.8884 39.1885 19.9344 39.2564 19.9601C39.3242 19.9859 39.3984 19.9901 39.4689 19.9723C39.716 20.2062 40.2118 19.8905 40.4139 20.3403Z" fill="#2B2B2B"/>
<path d="M50.8155 15.2886C50.8889 15.2369 50.9789 15.2138 51.0681 15.2239C51.1573 15.2339 51.2395 15.2764 51.2992 15.3431C51.2227 15.3852 51.135 15.4026 51.0483 15.3928C50.9617 15.3831 50.8803 15.3466 50.8155 15.2886Z" fill="#A2A2A2"/>
</svg>
