<svg width="58" height="85" viewBox="0 0 58 85" fill="none" xmlns="http://www.w3.org/2000/svg">
<g clip-path="url(#clip0_381_6299)">
<path d="M51.656 45.1937C51.5905 45.194 51.5272 45.1707 51.4777 45.1281C51.4282 45.0854 51.396 45.0263 51.387 44.9617C51.378 44.8972 51.3928 44.8316 51.4287 44.7771C51.4647 44.7226 51.5192 44.683 51.5823 44.6656C52.1523 44.503 52.695 44.2575 53.1929 43.937C53.6952 43.6044 54.1082 43.1545 54.3959 42.6264C56.36 38.9296 54.9557 36.2695 53.4138 34.6509C53.3888 34.6263 53.3688 34.597 53.3552 34.5647C53.3416 34.5324 53.3346 34.4977 53.3346 34.4626C53.3346 34.4276 53.3416 34.3929 53.3552 34.3606C53.3688 34.3282 53.3888 34.2989 53.4138 34.2744C53.4389 34.2492 53.4688 34.2293 53.5016 34.2157C53.5345 34.2021 53.5697 34.1951 53.6053 34.1951C53.6409 34.1951 53.6762 34.2021 53.709 34.2157C53.7419 34.2293 53.7717 34.2492 53.7968 34.2744C55.432 35.9956 56.9394 38.8856 54.8378 42.8661C54.5119 43.4753 54.0375 43.9933 53.458 44.3722C52.9172 44.7272 52.3242 44.9961 51.7002 45.1692L51.656 45.1937Z" fill="#414043"/>
<path d="M55.535 35.9368C55.535 33.8879 49.1517 32.2253 41.3198 32.2253C33.488 32.2253 27.1046 33.8879 27.1046 35.9368C27.1046 37.9857 33.488 39.6483 41.3444 39.6483C49.2008 39.6483 55.535 37.9857 55.535 35.9368Z" fill="white"/>
<path d="M41.3199 39.9174C34.2 39.9174 26.8346 38.4504 26.8346 35.937C26.8346 33.4235 34.2 31.9565 41.3199 31.9565C48.4397 31.9565 55.8051 33.4235 55.8051 35.937C55.8051 38.4504 48.4397 39.9174 41.3199 39.9174ZM41.3199 32.4944C32.9724 32.4944 27.3747 34.2744 27.3747 35.9174C27.3747 37.5604 32.9822 39.3404 41.3199 39.3404C49.6575 39.3404 55.265 37.5604 55.265 35.9174C55.265 34.2744 49.6624 32.4944 41.3199 32.4944Z" fill="#414043"/>
<path d="M47.9045 40.7243C49.1377 40.5363 50.3578 40.2717 51.5578 39.9321C52.1566 39.7592 52.7437 39.5485 53.3157 39.3013C53.8845 39.0726 54.4107 38.7503 54.8722 38.3477C54.8979 38.3229 54.9322 38.3091 54.968 38.3091C55.0037 38.3091 55.0381 38.3229 55.0637 38.3477C55.0766 38.3601 55.0869 38.3749 55.0939 38.3912C55.101 38.4076 55.1046 38.4253 55.1046 38.4431C55.1046 38.4609 55.101 38.4785 55.0939 38.4949C55.0869 38.5113 55.0766 38.5261 55.0637 38.5384C54.5682 38.9445 54.007 39.2636 53.404 39.4822C52.817 39.7133 52.215 39.9044 51.602 40.0543C50.3854 40.3575 49.1503 40.5813 47.9045 40.7243Z" fill="#414043"/>
<path d="M50.3989 41.0567C51.1335 40.9231 51.8585 40.7418 52.5693 40.5139C52.9232 40.3995 53.2693 40.2623 53.6053 40.1031C53.9299 39.9525 54.2322 39.7583 54.5039 39.5261C54.5313 39.5087 54.564 39.5015 54.5963 39.5059C54.6285 39.5102 54.6581 39.5258 54.6799 39.5498C54.7017 39.5739 54.7142 39.6048 54.7153 39.6372C54.7163 39.6695 54.7058 39.7012 54.6856 39.7266C54.3859 39.957 54.0553 40.1446 53.7035 40.2841C53.3508 40.4226 52.99 40.5402 52.6233 40.6361C51.8915 40.823 51.1486 40.9635 50.3989 41.0567Z" fill="#414043"/>
<path d="M41.3199 39.6484C38.1862 39.6818 35.0581 39.3769 31.9904 38.7389C31.7792 37.8832 31.1409 36.4406 30.0705 36.514C29.3241 36.5678 29.2063 37.3502 29.2112 37.8832C28.2046 37.4626 27.5171 36.9785 27.2471 36.4651L31.7842 58.3673C31.7842 58.3673 32.8939 61.4822 41.315 61.4822C49.7361 61.4822 50.8458 58.3673 50.8458 58.3673L55.3829 36.4651C54.4106 38.2646 48.4839 39.6484 41.3199 39.6484Z" fill="white"/>
<path d="M41.3199 61.7511C32.8055 61.7511 31.5828 58.5873 31.5337 58.4553C31.5366 58.4441 31.5366 58.4323 31.5337 58.421L27.0065 36.5189C26.9951 36.4556 27.006 36.3905 27.0373 36.3343C27.0686 36.2782 27.1184 36.2346 27.1783 36.2108C27.2389 36.1898 27.3049 36.1905 27.365 36.2128C27.425 36.2351 27.4754 36.2777 27.5073 36.333C27.8755 36.8496 28.3877 37.2474 28.9804 37.4773C29.0737 36.734 29.4714 36.289 30.0705 36.245C31.1704 36.1668 31.9167 37.3942 32.231 38.5091C35.2232 39.1159 38.2713 39.4076 41.3248 39.3795C48.9455 39.3795 54.3419 37.8294 55.157 36.333C55.1865 36.275 55.2359 36.2294 55.2962 36.2043C55.3565 36.1792 55.4237 36.1763 55.486 36.1961C55.547 36.2183 55.5981 36.2616 55.6296 36.3182C55.6612 36.3748 55.6712 36.4408 55.6578 36.5042L51.1207 58.4064C51.1201 58.4178 51.1201 58.4292 51.1207 58.4406C51.0667 58.5873 49.8343 61.7511 41.3199 61.7511ZM32.0493 58.289C32.1426 58.4895 33.5224 61.223 41.3199 61.223C49.1174 61.223 50.4971 58.5091 50.5904 58.289L54.9311 37.3501C52.913 38.8758 47.5657 39.9223 41.3199 39.9223C38.1715 39.9509 35.0291 39.6443 31.9462 39.0078C31.8977 38.9954 31.8534 38.9703 31.818 38.935C31.7826 38.8997 31.7573 38.8557 31.7449 38.8074C31.5681 38.0934 30.9936 36.7193 30.1048 36.7878C29.6924 36.8171 29.4861 37.1839 29.496 37.888C29.496 37.9322 29.4853 37.9758 29.4648 38.0149C29.4443 38.0541 29.4145 38.0877 29.3781 38.113C29.3386 38.1331 29.2948 38.1437 29.2505 38.1437C29.2061 38.1437 29.1623 38.1331 29.1228 38.113C28.6224 37.9131 28.149 37.6519 27.7135 37.3355L32.0493 58.289Z" fill="#414043"/>
<path d="M57.5384 34.0004C57.3787 33.7617 57.1794 33.5517 56.9492 33.3794C57.2539 33.1622 57.4783 32.8512 57.5875 32.4943C57.6735 32.1855 57.6735 31.8593 57.5875 31.5505C57.5029 31.2341 57.3331 30.9467 57.0965 30.7192C56.9153 30.5484 56.7016 30.4154 56.468 30.328C56.7883 29.9754 57.0323 29.5609 57.1849 29.1104C57.3833 28.5076 57.4189 27.8633 57.288 27.2424C57.1535 26.6205 56.8553 26.0453 56.4238 25.5761C55.9923 25.1069 55.4432 24.7605 54.8329 24.5725C54.2227 24.392 53.5752 24.3768 52.9571 24.5285C52.651 24.6032 52.3568 24.72 52.0831 24.8757C51.9271 24.185 51.611 23.5403 51.16 22.9931C50.6252 22.353 49.9285 21.8668 49.1419 21.5847C48.3553 21.3047 47.5086 21.2355 46.6867 21.3842C46.0478 21.4987 45.4397 21.7443 44.9012 22.1055C44.3628 22.4666 43.9056 22.9354 43.5589 23.482C43.3799 23.4 43.1943 23.333 43.0041 23.2816C42.4817 23.1609 41.9368 23.1777 41.4229 23.3305L41.2118 23.4136C41.1757 22.8293 40.9897 22.264 40.6716 21.7718C40.3535 21.2795 39.914 20.8767 39.395 20.6019C38.8486 20.3196 38.2374 20.1847 37.6224 20.2107C37.0112 20.2394 36.4191 20.432 35.9087 20.7681C35.4032 21.0953 34.9986 21.5557 34.7401 22.0982C34.6871 22.2093 34.6412 22.3236 34.6026 22.4405C33.8905 21.9642 33.067 21.6789 32.2117 21.6124C31.3565 21.5459 30.4985 21.7004 29.7208 22.0608C28.9431 22.4213 28.2719 22.9755 27.7723 23.67C27.2727 24.3644 26.9615 25.1755 26.8689 26.0248C26.7731 26.8903 26.9139 27.7655 27.2765 28.5578C27.3649 28.7388 27.4631 28.9148 27.5662 29.086H27.4631C26.8454 29.1394 26.2495 29.3389 25.7248 29.6679C25.1878 29.9968 24.7381 30.4497 24.4138 30.9882C24.0842 31.5264 23.8858 32.1342 23.8347 32.7626C23.7835 33.391 23.8809 34.0226 24.1192 34.6067C24.3591 35.187 24.7305 35.7042 25.2044 36.1177C25.9372 36.7674 26.8897 37.1168 27.8706 37.0957C28.2389 37.4918 29.491 38.3378 33.704 39.0908C34.9184 39.2964 36.1427 39.4384 37.372 39.5163C37.4046 39.6313 37.449 39.7428 37.5046 39.8488C37.6413 40.0829 37.8389 40.2759 38.0765 40.4076C38.3142 40.5393 38.5831 40.6047 38.8549 40.597C39.1264 40.5907 39.3911 40.5113 39.6209 40.3671C39.8352 40.2218 40.0051 40.0205 40.1119 39.7852L40.1414 39.707C40.2296 39.9036 40.3435 40.0878 40.4802 40.2547C40.7697 40.6117 41.1506 40.8842 41.5827 41.0434C42.0149 41.2026 42.4822 41.2427 42.9353 41.1593C43.3975 41.088 43.8318 40.8937 44.1923 40.597C44.5357 40.2995 44.7933 39.9164 44.9387 39.4869C48.4348 39.2473 51.705 38.6899 53.6593 37.7852C54.1144 38.123 54.6679 38.3033 55.2355 38.2987C55.7304 38.2963 56.2155 38.1611 56.6398 37.9075C57.0687 37.6453 57.4196 37.2739 57.6563 36.8317C57.8886 36.3926 57.9988 35.8996 57.9754 35.4038C57.9624 34.9048 57.8111 34.4192 57.5384 34.0004Z" fill="white"/>
<path d="M30.4093 51.7119C33.0117 52.9197 37.0381 53.883 41.5605 53.883C45.1944 53.9201 48.8011 53.2559 52.1814 51.927L52.8934 48.504C50.3007 49.7559 46.1909 50.7681 41.5605 50.7681C36.6011 50.7681 32.231 49.6043 29.6924 48.2351L30.4093 51.7119Z" fill="#414043"/>
<path d="M41.5605 54.152C37.4752 54.152 33.2622 53.3305 30.2964 51.9564C30.2579 51.9392 30.2243 51.9128 30.1986 51.8795C30.1729 51.8462 30.1559 51.8071 30.1491 51.7657L29.4272 48.2938C29.4177 48.2439 29.4222 48.1923 29.4405 48.1448C29.4587 48.0972 29.4898 48.0557 29.5304 48.0249C29.5737 47.9975 29.6239 47.9829 29.6752 47.9829C29.7265 47.9829 29.7768 47.9975 29.8201 48.0249C32.0591 49.2327 36.3212 50.5236 41.5605 50.5236C45.6802 50.5236 49.8687 49.6875 52.7755 48.2889C52.821 48.2667 52.8718 48.2577 52.9221 48.2629C52.9725 48.2681 53.0204 48.2873 53.0603 48.3183C53.0992 48.3493 53.1288 48.3902 53.1461 48.4368C53.1634 48.4833 53.1677 48.5336 53.1585 48.5823L52.4465 52.0053C52.4368 52.047 52.4176 52.0858 52.3903 52.1189C52.3631 52.152 52.3285 52.1784 52.2894 52.196C48.8718 53.5259 45.2296 54.19 41.5605 54.152ZM30.6499 51.5261C33.5371 52.8366 37.6028 53.6141 41.5605 53.6141C45.1092 53.6501 48.6327 53.018 51.9457 51.751L52.5202 48.9784C49.574 50.2743 45.528 51.0371 41.5605 51.0371C36.5913 51.0371 32.4716 49.8928 30.0705 48.7339L30.6499 51.5261Z" fill="#414043"/>
<path d="M41.5605 52.4747C37.2837 52.4747 32.9577 51.5945 29.9968 50.1226C29.9806 50.1144 29.9662 50.103 29.9545 50.0891C29.9427 50.0753 29.9339 50.0593 29.9284 50.042C29.9229 50.0247 29.9209 50.0065 29.9226 49.9884C29.9242 49.9704 29.9294 49.9528 29.9379 49.9368C29.9547 49.9055 29.983 49.8819 30.0168 49.8709C30.0507 49.86 30.0876 49.8626 30.1196 49.8781C33.0657 51.3451 37.3229 52.2058 41.5605 52.2058C45.5525 52.2058 49.5348 51.4478 52.476 50.1275C52.5086 50.1123 52.5459 50.1105 52.5799 50.1223C52.6139 50.1342 52.6418 50.1589 52.6577 50.1911C52.6714 50.2243 52.6719 50.2615 52.6591 50.295C52.6463 50.3286 52.6213 50.3561 52.5889 50.372C49.5937 51.707 45.5918 52.4747 41.5605 52.4747Z" fill="white"/>
<path d="M52.9522 49.3599C51.1691 50.153 49.2911 50.7151 47.3644 51.0323C45.449 51.3733 43.5061 51.537 41.5604 51.5213C43.5014 51.4998 45.4363 51.2985 47.3398 50.9198C49.2398 50.5612 51.0861 49.9631 52.8344 49.1399L52.9522 49.3599Z" fill="white"/>
<path d="M48.7786 53.7999C49.3695 53.7029 49.9511 53.5556 50.5168 53.3598C51.0729 53.1494 51.6087 52.8892 52.1175 52.5823L52.2403 52.8219C51.699 53.0924 51.1356 53.3165 50.5561 53.4918C49.9731 53.643 49.3786 53.746 48.7786 53.7999Z" fill="#414043"/>
<path d="M36.4783 52.9734C35.3886 52.816 34.3096 52.5923 33.2474 52.3035C32.1794 52.0195 31.1379 51.6449 30.1343 51.1837L30.257 50.9441C31.2293 51.4411 32.243 51.8534 33.2867 52.1763C34.3335 52.5056 35.3993 52.7718 36.4783 52.9734Z" fill="white"/>
<path d="M30.7138 37.7951C30.7007 37.8674 30.6672 37.9344 30.6173 37.9884C30.5673 38.0424 30.5029 38.0811 30.4317 38.1C30.3604 38.1188 30.2852 38.1171 30.215 38.0949C30.1447 38.0728 30.0822 38.0311 30.0348 37.9749C29.9874 37.9186 29.9571 37.8501 29.9474 37.7773C29.9378 37.7045 29.9491 37.6305 29.9802 37.5639C30.0113 37.4973 30.0607 37.4409 30.1228 37.4013C30.1849 37.3617 30.257 37.3406 30.3308 37.3403C30.4415 37.3515 30.5435 37.4053 30.6151 37.4902C30.6866 37.5751 30.722 37.6845 30.7138 37.7951Z" fill="#414043"/>
<path d="M29.6826 37.8733C29.649 37.778 29.6352 37.6768 29.6419 37.5759C29.6487 37.4751 29.6759 37.3766 29.7219 37.2865C29.7664 37.1885 29.8345 37.1028 29.9201 37.0371C30.0057 36.9714 30.1063 36.9278 30.2129 36.91C30.3218 36.9001 30.4314 36.9167 30.5324 36.9584C30.6333 37.0002 30.7226 37.0658 30.7923 37.1496C30.8578 37.227 30.9071 37.3166 30.9374 37.4131C30.9678 37.5097 30.9785 37.6113 30.9691 37.712C30.9323 37.5428 30.8389 37.3912 30.7042 37.2819C30.5695 37.1726 30.4014 37.1121 30.2276 37.1105C30.148 37.1233 30.0719 37.1526 30.0043 37.1963C29.9366 37.2401 29.8789 37.2975 29.8348 37.3648C29.7398 37.5179 29.6873 37.6934 29.6826 37.8733Z" fill="#414043"/>
<path d="M54.2289 43.6923C54.2289 43.2033 53.9147 42.8121 53.3942 42.9833C53.0505 43.0957 52.7264 43.438 52.4121 43.5456C52.0979 43.6532 51.4301 43.3744 50.5462 43.5749C49.6624 43.7754 49.3236 44.5529 48.3906 44.4502C47.4577 44.3476 47.4086 44.5236 47.4086 44.5236L47.767 46.1862C48.258 46.1079 48.5428 45.7901 49.0142 45.6727C49.4856 45.5554 50.556 45.7167 51.0471 45.6043C51.8425 45.4185 52.0831 44.9833 52.4121 44.8023C52.6627 44.6574 52.9578 44.6088 53.242 44.6654C53.4441 44.702 53.6524 44.6852 53.8459 44.6165C54.2289 44.4356 54.224 44.1079 54.2289 43.6923Z" fill="#414043"/>
<path d="M47.7573 46.465C47.6955 46.4649 47.6357 46.4433 47.5882 46.4041C47.5407 46.3648 47.5084 46.3102 47.497 46.2498L47.1386 44.5774C47.1288 44.5406 47.1288 44.5018 47.1386 44.465C47.2073 44.1569 47.6836 44.1569 47.8849 44.1569C48.0862 44.1569 48.2041 44.1569 48.3759 44.1862C48.7606 44.2016 49.136 44.0665 49.4218 43.8097C49.7269 43.5818 50.0739 43.4156 50.4432 43.3207C50.6865 43.266 50.9352 43.2381 51.1846 43.2376C51.3982 43.2416 51.6113 43.258 51.823 43.2865C51.9759 43.3106 52.1316 43.3106 52.2845 43.2865C52.4408 43.2255 52.5879 43.1432 52.7215 43.042C52.8938 42.9114 53.084 42.806 53.2862 42.729C53.4379 42.6698 53.6037 42.6558 53.7632 42.6888C53.9228 42.7218 54.0693 42.8004 54.1848 42.9148C54.3825 43.1269 54.4883 43.408 54.4794 43.6972C54.4794 44.1324 54.4794 44.6117 53.9295 44.861C53.774 44.9248 53.6063 44.9532 53.4384 44.9442C53.3551 44.9507 53.2714 44.9507 53.188 44.9442C52.9581 44.8989 52.7195 44.9371 52.5153 45.0517C52.4245 45.1111 52.3391 45.1782 52.26 45.2522C51.9324 45.5621 51.527 45.7783 51.0864 45.8782C50.8881 45.9209 50.6852 45.9389 50.4824 45.9319H49.9914H49.5299C49.3654 45.9253 49.2007 45.9368 49.0388 45.9662C48.867 46.02 48.7022 46.0938 48.5478 46.1862C48.3111 46.3313 48.0499 46.4323 47.7769 46.4845L47.7573 46.465ZM47.7131 44.7095L47.9635 45.8635C48.083 45.8134 48.1994 45.7562 48.3121 45.6923C48.5087 45.5752 48.72 45.4848 48.9406 45.4234C49.1421 45.3799 49.3484 45.3618 49.5544 45.3696H50.0454H50.5365C50.7011 45.3748 50.8658 45.3617 51.0275 45.3305C51.3809 45.2569 51.7071 45.0877 51.9703 44.8415C52.079 44.7435 52.1975 44.6566 52.3238 44.5823C52.6212 44.4133 52.9685 44.3528 53.3058 44.4112C53.4575 44.4477 53.6157 44.4477 53.7674 44.4112C53.9786 44.3134 53.9982 44.1911 54.0031 43.7461C54.0123 43.5952 53.9631 43.4464 53.8656 43.3305C53.8186 43.2895 53.7609 43.2626 53.6992 43.2531C53.6374 43.2436 53.5742 43.2518 53.517 43.2767C53.3643 43.341 53.2207 43.4248 53.0898 43.5261C52.9145 43.6576 52.721 43.763 52.5153 43.839C52.2884 43.8841 52.0548 43.8841 51.8279 43.839C51.4297 43.7841 51.0253 43.7924 50.6298 43.8635C50.3253 43.9485 50.0402 44.0913 49.7901 44.284C49.4045 44.6241 48.9002 44.7997 48.3858 44.773C48.1638 44.7309 47.9389 44.7064 47.7131 44.6997V44.7095Z" fill="#414043"/>
<path d="M48.042 45.2522C48.1402 45.7118 48.042 46.1324 47.7572 46.1862C47.4724 46.24 47.2171 45.9123 47.114 45.4527C47.0109 44.993 47.1434 44.5774 47.3988 44.5236C47.6541 44.4698 47.9438 44.7974 48.042 45.2522Z" fill="#414043"/>
<path d="M47.7032 46.4649C47.3251 46.4649 46.9715 46.0737 46.8537 45.5163C46.7919 45.269 46.7919 45.0105 46.8537 44.7632C46.8836 44.6452 46.9451 44.5374 47.0315 44.4513C47.118 44.3652 47.2262 44.304 47.3447 44.2742C47.3822 44.2696 47.4202 44.2696 47.4577 44.2742C47.8407 44.2742 48.1893 44.6605 48.312 45.2229C48.3763 45.4698 48.3763 45.729 48.312 45.9759C48.2821 46.094 48.2206 46.2018 48.1342 46.2878C48.0478 46.3739 47.9395 46.4351 47.821 46.4649H47.7032ZM47.4527 44.7877C47.4085 44.7877 47.2956 45.0273 47.3791 45.4038C47.4626 45.7803 47.6393 45.927 47.7032 45.927C47.767 45.927 47.8554 45.6728 47.7768 45.3158C47.6983 44.9588 47.5166 44.7828 47.4527 44.7828V44.7877Z" fill="#414043"/>
<path d="M47.6836 45.3206C47.7179 45.5162 47.6836 45.6923 47.5461 45.7118C47.4086 45.7314 47.3202 45.5847 47.2858 45.3891C47.2515 45.1935 47.2858 45.0126 47.4233 44.9979C47.5608 44.9832 47.6296 45.1201 47.6836 45.3206Z" fill="white"/>
<path d="M47.1631 44.7389C47.1765 44.6865 47.2016 44.6378 47.2364 44.5963C47.2713 44.5548 47.315 44.5217 47.3644 44.4993C47.4195 44.4806 47.4783 44.4757 47.5357 44.4851C47.593 44.4945 47.6472 44.5178 47.6934 44.553C47.8715 44.6815 48.0012 44.8657 48.0617 45.0763C48.1304 45.2791 48.1505 45.4951 48.1206 45.7071C48.1031 45.8138 48.0665 45.9164 48.0126 46.0103C47.9863 46.057 47.9496 46.0972 47.9053 46.1277C47.8611 46.1582 47.8104 46.1782 47.7572 46.1863C47.8028 46.1667 47.8438 46.1379 47.8776 46.1017C47.9114 46.0655 47.9373 46.0227 47.9536 45.976C47.9922 45.8862 48.0138 45.79 48.0175 45.6924C48.0239 45.4967 47.9956 45.3014 47.934 45.1154C47.8822 44.9276 47.7784 44.7581 47.6345 44.6264C47.6016 44.595 47.5619 44.5715 47.5185 44.558C47.475 44.5444 47.429 44.541 47.384 44.5482C47.3363 44.5637 47.2922 44.5886 47.2543 44.6214C47.2164 44.6541 47.1854 44.6941 47.1631 44.7389Z" fill="white"/>
<path d="M47.3939 45.5946C40.9173 45.2963 31.6811 41.6827 30.1 37.8978C30.0789 37.8648 30.0654 37.8276 30.0603 37.7888C30.0552 37.75 30.0586 37.7106 30.0704 37.6733C30.0821 37.636 30.1019 37.6016 30.1284 37.5727C30.1548 37.5438 30.1873 37.521 30.2235 37.5058C30.2597 37.4907 30.2988 37.4836 30.338 37.485C30.3773 37.4865 30.4157 37.4964 30.4507 37.5142C30.4857 37.532 30.5164 37.5571 30.5406 37.5879C30.5648 37.6187 30.582 37.6544 30.591 37.6924C31.9168 40.9589 40.5785 44.7438 47.4086 45.0567C47.4803 45.0567 47.5489 45.0851 47.5996 45.1355C47.6502 45.1859 47.6787 45.2544 47.6787 45.3257C47.6787 45.397 47.6502 45.4654 47.5996 45.5159C47.5489 45.5663 47.4803 45.5946 47.4086 45.5946H47.3939Z" fill="#414043"/>
<path d="M32.4912 59.4038L31.4846 53.5359L32.7564 59.3501L32.4912 59.4038Z" fill="#414043"/>
<path d="M33.0609 59.844L32.2163 54.8025L33.326 59.7951L33.0609 59.844Z" fill="#414043"/>
<path d="M43.6376 60.2939C44.9994 60.2312 46.3445 59.9693 47.6296 59.5164C48.9078 59.088 50.0715 58.3756 51.0324 57.4333C51.0448 57.4204 51.0597 57.4102 51.0761 57.4032C51.0926 57.3962 51.1103 57.3926 51.1282 57.3926C51.1461 57.3926 51.1638 57.3962 51.1802 57.4032C51.1967 57.4102 51.2116 57.4204 51.2239 57.4333C51.2488 57.4588 51.2627 57.493 51.2627 57.5286C51.2627 57.5642 51.2488 57.5984 51.2239 57.624C50.2086 58.5709 48.9867 59.2705 47.6542 59.668C47.0131 59.881 46.3564 60.0445 45.6901 60.157C45.0104 60.2549 44.3242 60.3007 43.6376 60.2939Z" fill="#414043"/>
<path d="M47.0354 58.9099C47.7797 58.757 48.4976 58.4967 49.1665 58.1373C49.8313 57.7807 50.4539 57.351 51.0225 56.8561C51.0349 56.8433 51.0498 56.833 51.0662 56.826C51.0827 56.819 51.1004 56.8154 51.1183 56.8154C51.1362 56.8154 51.1539 56.819 51.1704 56.826C51.1868 56.833 51.2017 56.8433 51.214 56.8561C51.2379 56.8822 51.251 56.9162 51.251 56.9515C51.251 56.9867 51.2379 57.0207 51.214 57.0468C50.6072 57.5165 49.9482 57.9152 49.2499 58.2351C48.5494 58.5682 47.8031 58.7956 47.0354 58.9099Z" fill="#414043"/>
<path d="M49.4856 44.191C49.6644 44.0408 49.8586 43.9097 50.065 43.7999C50.2724 43.6878 50.496 43.6086 50.7279 43.5651C50.9598 43.5263 51.1951 43.5116 51.4301 43.5211C51.6646 43.5227 51.8983 43.5489 52.1273 43.5994C51.6672 43.5972 51.2076 43.6299 50.7524 43.6972C50.5307 43.7378 50.3147 43.8052 50.1092 43.8976C49.8981 43.9857 49.6918 44.0835 49.4856 44.191Z" fill="white"/>
<path d="M50.2173 44.1373C50.3946 44.0152 50.5925 43.9257 50.8016 43.8732C51.0096 43.8286 51.2231 43.8155 51.435 43.8341C51.2288 43.8684 51.0177 43.8928 50.8163 43.9417C50.6117 43.9906 50.4113 44.056 50.2173 44.1373Z" fill="white"/>
<path d="M52.9375 43.2327C53.0533 43.1242 53.1859 43.035 53.3303 42.9687C53.4071 42.9325 53.4909 42.9138 53.5758 42.9138C53.6607 42.9138 53.7446 42.9325 53.8214 42.9687C53.9762 43.0432 54.0959 43.1747 54.1553 43.3354C54.2185 43.4903 54.2437 43.6579 54.2289 43.8244C54.1907 43.6747 54.138 43.5289 54.0718 43.3892C54.0092 43.2569 53.9083 43.1462 53.7821 43.0714C53.715 43.041 53.6422 43.0252 53.5685 43.0252C53.4948 43.0252 53.4219 43.041 53.3549 43.0714C53.21 43.1091 53.07 43.1633 52.9375 43.2327Z" fill="white"/>
<path d="M54.1897 44.1912C54.1739 44.3326 54.1035 44.4624 53.9933 44.553C53.9352 44.5971 53.8666 44.6253 53.7942 44.6347C53.7219 44.6442 53.6483 44.6345 53.5808 44.6068C53.6486 44.6022 53.7159 44.5924 53.7821 44.5775C53.8442 44.5663 53.903 44.5412 53.954 44.5041C54.0601 44.4235 54.1417 44.3152 54.1897 44.1912Z" fill="white"/>
<path d="M28.455 37.4136L30.4142 47.3402L28.1898 37.4674L28.455 37.4136Z" fill="#414043"/>
<path d="M29.1424 37.7705L30.3307 44.0541L28.8822 37.8243L29.1424 37.7705Z" fill="#414043"/>
<path d="M49.5053 22.8072C49.1772 22.6232 48.8253 22.485 48.4594 22.3965C47.7134 22.2193 46.9316 22.2635 46.2105 22.5236C45.4888 22.7783 44.8586 23.2393 44.3986 23.8488C44.3691 23.8879 44.3446 23.9368 44.3151 23.9808C44.2857 24.0248 44.2169 24.1226 44.1727 24.196C44.1285 24.2693 44.0843 24.3427 44.0451 24.4209C43.9733 24.554 43.9094 24.6912 43.8536 24.8317C43.724 25.1836 43.6479 25.5528 43.6277 25.927C43.7263 25.442 43.9073 24.9773 44.1629 24.553L44.3053 24.328C44.3544 24.2596 44.4035 24.1911 44.4575 24.1275C44.4891 24.0783 44.5235 24.0309 44.5606 23.9857C45.0257 23.4399 45.6264 23.0253 46.3029 22.7833C46.9793 22.5413 47.7077 22.4804 48.4152 22.6067C49.1351 22.7415 49.81 23.0524 50.3793 23.5114C50.1234 23.2362 49.829 22.999 49.5053 22.8072Z" fill="#414043"/>
<path d="M33.1246 22.7926C32.1551 22.496 31.1104 22.5607 30.1853 22.9745C29.2602 23.3884 28.5178 24.1232 28.0965 25.042C27.9305 25.4023 27.8164 25.7843 27.7577 26.1764C27.6984 26.5654 27.6984 26.9611 27.7577 27.35C27.7304 26.5806 27.8994 25.8168 28.2487 25.13C28.6038 24.4574 29.1298 23.8893 29.7743 23.4826C30.4189 23.0758 31.1593 22.8447 31.9216 22.8121C32.6957 22.7865 33.4638 22.9546 34.1558 23.3011C33.839 23.0821 33.4915 22.9108 33.1246 22.7926Z" fill="#414043"/>
<path d="M57.5384 34.0004C57.3787 33.7617 57.1794 33.5517 56.9492 33.3794C57.2539 33.1622 57.4783 32.8512 57.5875 32.4943C57.6735 32.1855 57.6735 31.8593 57.5875 31.5505C57.5029 31.2341 57.3331 30.9467 57.0965 30.7192C56.9153 30.5484 56.7016 30.4154 56.468 30.328C56.7883 29.9754 57.0323 29.5609 57.1849 29.1104C57.3833 28.5076 57.4189 27.8633 57.288 27.2424C57.1535 26.6205 56.8553 26.0453 56.4238 25.5761C55.9923 25.1069 55.4432 24.7605 54.8329 24.5725C54.2227 24.392 53.5752 24.3768 52.9572 24.5285C52.651 24.6032 52.3568 24.72 52.0831 24.8757C51.9271 24.185 51.611 23.5403 51.16 22.9931C50.6252 22.353 49.9285 21.8668 49.1419 21.5847C48.3553 21.3047 47.5086 21.2355 46.6867 21.3842C46.0478 21.4987 45.4397 21.7443 44.9012 22.1055C44.3628 22.4666 43.9056 22.9354 43.5589 23.482C43.3799 23.4 43.1943 23.333 43.0041 23.2816C42.4817 23.1609 41.9368 23.1777 41.4229 23.3305L41.2118 23.4136C41.1757 22.8293 40.9897 22.264 40.6716 21.7718C40.3535 21.2795 39.914 20.8767 39.395 20.6019C38.8486 20.3196 38.2374 20.1847 37.6224 20.2107C37.0112 20.2394 36.4191 20.432 35.9087 20.7681C35.4032 21.0953 34.9986 21.5557 34.7401 22.0982C34.6871 22.2093 34.6412 22.3236 34.6026 22.4405C33.8905 21.9642 33.067 21.6789 32.2117 21.6124C31.3565 21.5459 30.4985 21.7004 29.7208 22.0608C28.9431 22.4213 28.2719 22.9755 27.7723 23.67C27.2727 24.3644 26.9615 25.1755 26.8689 26.0248C26.7731 26.8903 26.9139 27.7655 27.2765 28.5578C27.3649 28.7388 27.4631 28.9148 27.5662 29.086H27.4631C26.8454 29.1394 26.2495 29.3389 25.7248 29.6679C25.1878 29.9968 24.7381 30.4497 24.4138 30.9882C24.0842 31.5264 23.8858 32.1342 23.8347 32.7626C23.7835 33.391 23.8809 34.0226 24.1192 34.6067C24.3591 35.187 24.7305 35.7042 25.2044 36.1177C25.6655 36.5257 26.2192 36.8162 26.8178 36.9644C27.4164 37.1126 28.0422 37.1141 28.6415 36.9686C28.0669 37.0059 27.4907 36.922 26.9509 36.7223C26.411 36.5226 25.9196 36.2116 25.5088 35.8097C25.1162 35.4178 24.8142 34.9455 24.6236 34.4255C24.433 33.9056 24.3585 33.3505 24.4052 32.799C24.452 32.2474 24.6188 31.7127 24.8942 31.2319C25.1696 30.7511 25.5469 30.3359 25.9998 30.0151C26.5255 29.6432 27.1336 29.4033 27.7724 29.3158C27.851 29.4283 27.9296 29.5407 28.0179 29.6483C27.5569 29.6966 27.1098 29.8345 26.702 30.0542C26.2999 30.2706 25.9447 30.5638 25.6565 30.917C25.3684 31.2703 25.153 31.6766 25.0227 32.1129C25.0613 32.0008 25.1072 31.8914 25.1602 31.7852C25.4286 31.2038 25.8582 30.7109 26.3984 30.3644C26.9386 30.0179 27.5669 29.8322 28.2094 29.8292C28.3492 29.9791 28.5002 30.118 28.6612 30.2449C28.7545 30.3182 28.8429 30.4014 28.9411 30.4649C28.8576 30.3916 28.7839 30.3085 28.7005 30.2253C28.5765 30.1002 28.4601 29.968 28.3518 29.8292C28.3213 29.7955 28.2934 29.7596 28.2684 29.7217L28.1898 29.6239C28.1098 29.5106 28.036 29.393 27.9688 29.2718L27.905 29.174L27.8461 29.0664C27.3634 28.1457 27.1913 27.0946 27.355 26.0688C27.4732 25.2962 27.7842 24.5655 28.2595 23.9436C28.7348 23.3217 29.3592 22.8286 30.0756 22.5093C30.7919 22.1901 31.5772 22.055 32.3596 22.1165C33.1419 22.1779 33.8963 22.4339 34.5535 22.861L34.6271 22.905L34.691 22.9442C35.3115 23.39 35.8165 23.9767 36.1641 24.6556C36.576 25.4208 36.7744 26.282 36.7386 27.1495C36.8671 26.3781 36.7944 25.5867 36.5274 24.8512C36.5274 24.7828 36.493 24.7143 36.4685 24.6508C36.1256 23.8432 35.5711 23.1423 34.8628 22.6214L34.7695 22.5627C34.8239 22.4446 34.8863 22.3302 34.9561 22.2204C35.2437 21.7657 35.6402 21.3893 36.11 21.1251C36.5669 20.8653 37.0822 20.7244 37.6082 20.7152C38.1342 20.706 38.654 20.8289 39.1198 21.0725C39.5856 21.3161 39.9822 21.6726 40.2732 22.1091C40.5641 22.5456 40.74 23.048 40.7846 23.5701C40.6794 23.6329 40.5778 23.7014 40.4802 23.7754C40.4576 23.5042 40.3964 23.2374 40.2985 22.9833C40.0344 22.2883 39.5048 21.7257 38.8254 21.4185C39.1463 21.5849 39.4312 21.8126 39.6637 22.0886C39.8963 22.3647 40.0719 22.6836 40.1807 23.0273C40.2821 23.3311 40.3238 23.6515 40.3034 23.971C40.2347 24.0346 40.1659 24.0982 40.1021 24.1666C39.7494 24.5542 39.5115 25.0316 39.4147 25.5456C39.3729 25.8261 39.3729 26.1111 39.4147 26.3916C39.4367 26.6066 39.4896 26.8174 39.5718 27.0175C39.5448 26.833 39.535 26.6464 39.5423 26.46C39.549 26.1691 39.5986 25.8808 39.6896 25.6043C39.7958 25.2737 39.9623 24.9653 40.1807 24.6948C40.2492 24.6119 40.323 24.5335 40.4016 24.46L40.49 24.3867C40.5844 24.3048 40.6845 24.2296 40.7895 24.1618C40.8561 24.1174 40.9249 24.0766 40.9958 24.0395L41.202 23.9417C41.7327 23.7124 42.3243 23.6626 42.8862 23.7999C43.0251 23.836 43.1613 23.8817 43.2938 23.9368C43.201 24.1181 43.1222 24.306 43.0581 24.4992C42.7937 25.2737 42.7445 26.105 42.9157 26.905C42.9951 27.2429 43.1121 27.5709 43.2643 27.883C43.455 28.2913 43.7084 28.6675 44.0156 28.9979C43.5615 28.3689 43.2722 27.6371 43.1736 26.8687C43.075 26.1002 43.1703 25.3195 43.4509 24.597C43.518 24.4287 43.5967 24.2653 43.6866 24.108C43.7308 24.0297 43.7799 23.9564 43.829 23.883C43.8781 23.8097 43.9174 23.7363 43.9665 23.6679C44.3479 23.1304 44.8455 22.685 45.4226 22.3644C45.9997 22.0438 46.6417 21.8562 47.3013 21.8153C47.9609 21.7745 48.6213 21.8815 49.2338 22.1285C49.8464 22.3755 50.3955 22.7561 50.8408 23.2424C51.2942 23.7408 51.6298 24.334 51.8229 24.9784L51.872 25.13L51.9162 25.2962C51.9506 25.4576 51.9849 25.619 52.0046 25.7852C52.0046 25.839 52.0046 25.8977 52.0046 25.9515C52.0046 26.0053 52.0046 26.0542 52.0046 26.1031C52.007 26.1275 52.007 26.152 52.0046 26.1764C52.0281 26.6309 51.98 27.0863 51.8622 27.5261C52.0348 27.1121 52.1377 26.6726 52.1666 26.2253V25.9564C52.4137 25.764 52.6978 25.6242 53.0013 25.5456C53.4372 25.4334 53.8954 25.4405 54.3276 25.5661C54.7597 25.6918 55.1498 25.9314 55.4565 26.2596C55.7721 26.5936 55.9924 27.0055 56.0948 27.4527C56.0144 26.9934 55.8108 26.5642 55.5056 26.2107C55.1977 25.8533 54.7992 25.5848 54.3517 25.4331C53.8987 25.2762 53.4108 25.2474 52.9424 25.35C52.6641 25.4076 52.3982 25.5135 52.1568 25.663C52.1568 25.4967 52.1568 25.3305 52.1126 25.174C52.3925 25.0379 52.6899 24.9408 52.9964 24.8855C53.5393 24.7888 54.0978 24.8297 54.6206 25.0045C55.1434 25.1793 55.6135 25.4824 55.9877 25.8857C56.362 26.2891 56.6282 26.7798 56.7619 27.3126C56.8956 27.8454 56.8925 28.4031 56.7528 28.9344C56.6259 29.3932 56.4052 29.8211 56.1046 30.1911C55.8357 30.1451 55.5597 30.1636 55.2993 30.2449C55.0003 30.3332 54.7317 30.5025 54.5235 30.7339C54.4305 30.8427 54.3513 30.9626 54.2878 31.0909C54.2185 31.2309 54.1721 31.3812 54.1503 31.5358C54.2088 31.4092 54.2813 31.2895 54.3664 31.1789C54.6146 30.8472 54.9762 30.6176 55.3828 30.5334C55.5201 30.5055 55.6606 30.4973 55.8002 30.5089L55.9524 30.5334C56.0113 30.5334 56.0703 30.5334 56.1243 30.5627C56.3809 30.6339 56.6144 30.7704 56.8019 30.9588C56.9848 31.14 57.1199 31.3633 57.1953 31.609C57.2707 31.8547 57.284 32.1151 57.234 32.3671C57.1592 32.6946 56.9883 32.9925 56.743 33.2229C56.3501 32.9552 55.8881 32.8058 55.4123 32.7926C55.2847 32.7853 55.1568 32.7853 55.0293 32.7926C55.1958 32.8163 55.3601 32.854 55.5203 32.905C55.7768 32.9798 56.0214 33.0901 56.247 33.2327C56.3272 33.287 56.4042 33.3458 56.4778 33.4087L56.522 33.4429C56.5322 33.4555 56.5437 33.467 56.5564 33.4772C56.7723 33.6693 56.9548 33.8957 57.0965 34.1471C57.3018 34.5065 57.4122 34.9119 57.4174 35.3254C57.4225 35.7388 57.3223 36.1468 57.1261 36.5113C56.9299 36.8757 56.6441 37.1846 56.2954 37.4091C55.9468 37.6336 55.5466 37.7664 55.1324 37.795C54.6986 37.828 54.2633 37.7563 53.8632 37.5861C53.4632 37.4158 53.1103 37.152 52.8344 36.817C53.0518 37.241 53.3842 37.5959 53.7938 37.8414C54.2035 38.0868 54.674 38.2131 55.152 38.2058C55.6469 38.2034 56.1321 38.0682 56.5564 37.8146C56.9853 37.5524 57.3361 37.181 57.5728 36.7388C57.8052 36.2997 57.9154 35.8067 57.892 35.3109C57.8877 34.8513 57.766 34.4003 57.5384 34.0004Z" fill="#414043"/>
<path d="M56.9934 36.1961C57.1505 35.9101 57.2202 35.5846 57.1941 35.2597C57.1679 34.9348 57.047 34.6246 56.8461 34.3672C56.6528 34.1142 56.3823 33.9306 56.0752 33.844C56.3164 34.0149 56.5202 34.2328 56.6742 34.4846C56.8174 34.7279 56.903 35.0005 56.9247 35.2816C56.9453 35.5691 56.9018 35.8576 56.7974 36.1264C56.693 36.3953 56.5302 36.6378 56.3207 36.8366C56.6107 36.7042 56.8476 36.4786 56.9934 36.1961Z" fill="#414043"/>
<path d="M44.4134 36.9785C44.6513 37.3284 44.7981 37.7317 44.8406 38.1521C44.888 38.555 44.834 38.9634 44.6834 39.3404C44.5314 39.7057 44.2899 40.0274 43.9809 40.2758C43.6719 40.5243 43.3053 40.6917 42.9146 40.7627C42.5239 40.8337 42.1215 40.806 41.7443 40.6823C41.3671 40.5586 41.0271 40.3426 40.7552 40.0543C40.5467 39.8298 40.3804 39.5697 40.2642 39.2866C40.2642 39.2572 40.2642 39.2279 40.2642 39.1986C40.2622 39.1856 40.2622 39.1724 40.2642 39.1594C40.2642 39.1105 40.2298 39.0665 40.2151 39.0176C40.1093 38.6037 40.1093 38.17 40.2151 37.756C40.0574 38.1141 39.9932 38.506 40.0285 38.8954C40.0259 38.9426 40.0259 38.9899 40.0285 39.0372C40.051 39.1921 40.0889 39.3444 40.1415 39.492C39.9931 39.7685 39.7539 39.986 39.4638 40.1081C39.2762 40.1983 39.0692 40.241 38.8611 40.2324C38.653 40.2239 38.4502 40.1644 38.2707 40.0592C38.0948 39.9579 37.9456 39.8163 37.8355 39.6463C37.7254 39.4762 37.6574 39.2825 37.6372 39.0812C37.6224 38.8582 37.6589 38.6348 37.744 38.428C37.8291 38.2212 37.9606 38.0365 38.1283 37.888C37.8986 37.9874 37.7012 38.1484 37.5581 38.3531C37.415 38.5577 37.3319 38.798 37.3181 39.047C37.3068 39.3177 37.3696 39.5865 37.4997 39.8245C37.6337 40.0639 37.8307 40.2623 38.0695 40.3984C38.3083 40.5346 38.5799 40.6033 38.855 40.5971C39.1265 40.5908 39.3912 40.5114 39.621 40.3673C39.8353 40.222 40.0052 40.0206 40.112 39.7853L40.1415 39.7071C40.2297 39.9037 40.3436 40.0879 40.4803 40.2548C40.7698 40.6118 41.1507 40.8843 41.5828 41.0435C42.015 41.2028 42.4823 41.2428 42.9354 41.1594C43.3869 41.0741 43.8071 40.8699 44.1525 40.568C44.4979 40.2662 44.7559 39.8777 44.8995 39.4431C45.0447 39.0127 45.0685 38.551 44.9682 38.1081C44.8853 37.6898 44.6941 37.3004 44.4134 36.9785Z" fill="#414043"/>
<path d="M42.2283 40.2499C42.6537 40.2869 43.0792 40.1801 43.4362 39.9467C43.7853 39.7181 44.0385 39.3703 44.1482 38.9687C43.9524 39.301 43.6688 39.5734 43.3282 39.756C42.9986 39.9309 42.6247 40.0057 42.2528 39.9712C41.8773 39.9294 41.5215 39.7821 41.2268 39.5466C40.9321 39.3112 40.7106 38.9971 40.5883 38.6411C40.623 39.0537 40.8102 39.4387 41.1137 39.7218C41.4134 40.02 41.8069 40.2064 42.2283 40.2499Z" fill="#414043"/>
<path d="M47.0305 31.4674C46.9615 31.722 46.8503 31.9633 46.7015 32.1814C46.3496 32.6932 45.8155 33.0528 45.2074 33.1872C44.5993 33.3216 43.9626 33.2207 43.4263 32.9051C42.8742 32.5745 42.4648 32.0518 42.2773 31.4381C42.3269 31.7641 42.4421 32.0768 42.6162 32.3574C42.8467 32.7156 43.1654 33.0091 43.542 33.21C43.9186 33.4109 44.3406 33.5125 44.7678 33.5052C45.1949 33.4978 45.6131 33.3817 45.9825 33.168C46.3519 32.9543 46.6603 32.65 46.8783 32.284C47.0225 32.0323 47.1221 31.7577 47.1729 31.4723C47.185 31.4305 47.1948 31.3881 47.2023 31.3452C47.2446 31.017 47.2162 30.6836 47.1189 30.3672C47.1652 30.7361 47.1352 31.1105 47.0305 31.4674Z" fill="#414043"/>
<path d="M51.7935 34.9588C51.3873 34.9011 51.0184 34.6912 50.7623 34.372C50.4991 34.054 50.3658 33.6489 50.3891 33.2375C50.4125 32.8119 50.5865 32.4082 50.8802 32.0981C50.6867 32.2223 50.5224 32.3866 50.3986 32.5799C50.2749 32.7732 50.1946 32.9908 50.1633 33.2179C50.1281 33.4521 50.1422 33.6909 50.2047 33.9193C50.2673 34.1477 50.3768 34.3607 50.5264 34.5446C50.6761 34.7286 50.8625 34.8795 51.0739 34.9879C51.2852 35.0962 51.5169 35.1596 51.7542 35.1739C51.9845 35.187 52.2149 35.15 52.4294 35.0656C52.6439 34.9811 52.8374 34.8513 52.9965 34.6849C52.6407 34.9152 52.2144 35.0122 51.7935 34.9588Z" fill="#414043"/>
<path d="M36.2525 31.7169L36.3457 31.668C36.4817 31.5855 36.5988 31.4756 36.6895 31.3453C36.7911 31.1994 36.861 31.0341 36.8949 30.8598C36.9287 30.6855 36.9256 30.5061 36.8859 30.333C36.8462 30.1587 36.7696 29.9948 36.6612 29.8523C36.5528 29.7098 36.4151 29.5919 36.2574 29.5066C36.1091 29.4229 35.9437 29.3737 35.7737 29.3627C35.6036 29.3517 35.4332 29.3792 35.2753 29.4431C35.5872 29.4207 35.8973 29.5052 36.1542 29.6827C36.3924 29.854 36.5603 30.1052 36.627 30.39C36.6938 30.6749 36.655 30.9742 36.5176 31.2328C36.4249 31.398 36.2976 31.5414 36.1444 31.6533C36.0215 31.5954 35.8933 31.5495 35.7614 31.5164C35.5587 31.4599 35.348 31.4368 35.1378 31.4479C35.3614 31.4685 35.5802 31.5247 35.786 31.6142L35.9873 31.712H36.0315L36.0708 31.7365H36.1101C36.3937 31.9189 36.6267 32.1694 36.7877 32.4651C36.9445 32.7553 37.0252 33.0803 37.0222 33.4099C37.0191 33.7395 36.9325 34.0629 36.7704 34.3503C36.6082 34.6376 36.3758 34.8795 36.0947 35.0534C35.8136 35.2274 35.4929 35.3278 35.1624 35.3453C34.8231 35.3663 34.4838 35.3037 34.1746 35.1629C33.8654 35.0222 33.5958 34.8077 33.3898 34.5384C33.5555 34.8551 33.8051 35.1207 34.1116 35.3061C34.5158 35.5392 34.9864 35.6315 35.4491 35.5685C35.9119 35.5055 36.3404 35.2908 36.6669 34.9583C36.9935 34.6258 37.1996 34.1944 37.2525 33.7323C37.3055 33.2702 37.2024 32.8036 36.9595 32.4064C36.78 32.1256 36.5381 31.8897 36.2525 31.7169Z" fill="#414043"/>
<path d="M41.5605 54.152C37.4752 54.152 33.2622 53.3305 30.2964 51.9564C30.2579 51.9392 30.2243 51.9128 30.1986 51.8795C30.1729 51.8462 30.1559 51.8071 30.1491 51.7657L29.4272 48.2938C29.4177 48.2439 29.4222 48.1923 29.4405 48.1448C29.4587 48.0972 29.4898 48.0557 29.5304 48.0249C29.5737 47.9975 29.6239 47.9829 29.6752 47.9829C29.7265 47.9829 29.7768 47.9975 29.8201 48.0249C32.0591 49.2327 36.3212 50.5236 41.5605 50.5236C45.6802 50.5236 49.8687 49.6875 52.7755 48.2889C52.821 48.2667 52.8718 48.2577 52.9221 48.2629C52.9725 48.2681 53.0204 48.2873 53.0603 48.3183C53.0992 48.3493 53.1288 48.3902 53.1461 48.4368C53.1634 48.4833 53.1677 48.5336 53.1585 48.5823L52.4465 52.0053C52.4368 52.047 52.4176 52.0858 52.3903 52.1189C52.3631 52.152 52.3285 52.1784 52.2894 52.196C48.8718 53.5259 45.2296 54.19 41.5605 54.152ZM30.6499 51.5261C33.5371 52.8366 37.6028 53.6141 41.5605 53.6141C45.1092 53.6501 48.6327 53.018 51.9457 51.751L52.5202 48.9784C49.574 50.2743 45.528 51.0371 41.5605 51.0371C36.5913 51.0371 32.4716 49.8928 30.0705 48.7339L30.6499 51.5261Z" fill="#414043"/>
<path d="M37.3966 39.2474C35.6631 39.1292 33.9402 38.8889 32.2408 38.5286C31.9265 37.4137 31.1802 36.1863 30.0803 36.2645C29.4665 36.3085 29.0982 36.7535 28.9902 37.4968C28.6783 37.3531 28.3821 37.1778 28.1064 36.9736C27.9025 37.0172 27.6916 37.0172 27.4877 36.9736C27.4904 37.0012 27.4904 37.0291 27.4877 37.0567C27.6202 37.0567 27.7479 37.223 27.8707 37.2181C28.0671 37.4283 28.5041 37.6142 29.4714 37.9907C29.4782 37.9568 29.4782 37.9219 29.4714 37.888C29.4714 37.1838 29.6678 36.8171 30.0803 36.7878C30.915 36.7242 31.465 37.9173 31.681 38.6606C32.2604 38.7975 32.9184 39.0812 33.6795 39.2181C34.7549 39.4088 36.0021 39.4039 37.3475 39.4968C37.3475 39.5604 37.3966 39.6191 37.4211 39.6826V39.3159C37.4145 39.2925 37.4063 39.2697 37.3966 39.2474Z" fill="#414043"/>
<path d="M53.7674 37.7169L53.6201 37.487C51.8573 38.3037 48.7638 38.998 44.8111 39.2621C44.7742 39.4412 44.7496 39.6225 44.7374 39.8049H44.816C44.87 39.6973 44.9191 39.7315 44.9584 39.6142C48.4545 39.3795 51.7247 38.6753 53.679 37.7707L53.7576 37.8196C53.7625 37.7853 53.7625 37.7462 53.7674 37.7169Z" fill="#414043"/>
<path d="M30.2473 65.2864C30.2473 65.2864 31.7842 67.9465 34.4554 68.0737C37.0529 68.2008 37.8926 69.1592 36.8221 70.2546C36.8221 70.2546 39.2281 70.5578 39.3411 71.7558C39.454 72.9539 37.0038 72.4942 37.0038 72.4942C37.0038 72.4942 38.7568 73.257 38.197 74.2497C37.6372 75.2424 35.4227 74.2497 35.4227 74.2497C36.1634 74.7751 36.9469 75.2379 37.7649 75.6336C39.1299 76.2937 38.8697 78.0248 37.0971 77.5896C37.1694 77.6636 37.2257 77.7517 37.2624 77.8484C37.299 77.945 37.3154 78.0482 37.3103 78.1514C37.3052 78.2546 37.2789 78.3556 37.2329 78.4483C37.1869 78.5409 37.1223 78.6231 37.0431 78.6898C36.5128 79.1152 34.9218 78.4209 33.9496 77.3548C33.9496 77.3548 35.5798 79.0125 35.1232 79.5749C34.5388 80.3035 33.4831 79.0859 33.4831 79.0859C33.4831 79.0859 34.1902 80.3964 33.4831 80.7045C32.7761 81.0125 31.519 79.6336 31.519 79.6336C31.519 79.6336 32.1917 80.6849 31.578 81.0761C31.578 81.0761 31.9904 82.2448 31.4208 82.6018C30.8512 82.9588 29.4567 81.2326 29.4567 81.2326C29.4567 81.2326 29.8201 82.5089 28.9657 82.5431C28.1113 82.5773 27.4926 81.1397 27.3453 80.7485C27.3453 80.7485 27.9002 82.5187 26.9132 82.7045C25.9263 82.8903 25.5334 81.1201 25.5334 81.1201C25.5334 81.1201 25.9557 83.0077 24.9638 83.1739C23.972 83.3402 23.3238 80.9294 23.3238 80.9294C23.3238 80.9294 23.7068 82.7729 22.6364 82.8512C21.5659 82.9294 21.5217 81.1397 21.5217 81.1397C21.5217 81.1397 21.1928 83.4086 20.3335 83.702C19.4742 83.9954 19.2876 82.8267 19.43 82.0981C19.43 82.0981 19.0863 83.8389 17.731 83.702C16.3758 83.5651 17.5837 81.6923 17.731 79.9367C17.731 79.9367 16.8177 82.7387 15.3348 82.4942C14.5541 82.3671 14.8045 80.5382 14.8045 80.5382C14.8045 80.5382 13.9207 82.8756 12.9533 82.6165C11.986 82.3573 12.59 80.5187 12.59 80.5187C12.59 80.5187 11.9958 82.1861 11.0236 81.927C10.0514 81.6678 10.7781 79.971 10.7781 79.971C10.5915 80.3475 10.0317 81.3646 9.18226 81.257C8.33279 81.1495 8.87292 79.7118 8.87292 79.7118C8.87292 79.7118 7.23289 81.482 6.69276 81.0712C6.15263 80.6605 6.56018 79.8976 6.56018 79.8976C5.98568 79.4478 6.7566 78.4649 6.7566 78.4649C6.7566 78.4649 5.37681 79.7118 4.70902 79.3451C4.04122 78.9783 4.87597 77.7363 4.87597 77.7363C4.87597 77.7363 3.6484 78.8267 3.19175 78.0835C2.73509 77.3402 4.57644 75.9808 4.57644 75.9808C3.506 76.9588 2.38646 77.1299 1.7334 76.504C1.64611 76.4382 1.57625 76.3522 1.5299 76.2534C1.48356 76.1547 1.46211 76.0461 1.46743 75.9372C1.47276 75.8283 1.50468 75.7224 1.56044 75.6286C1.61621 75.5347 1.69412 75.4559 1.78741 75.3989C-0.0146527 75.6531 -0.269987 74.1372 1.16872 73.6727C1.82988 73.468 2.45099 73.1521 3.00516 72.7387C3.00516 72.7387 0.888835 73.6825 0.42727 72.6409C-0.0342938 71.5993 2.65162 70.7485 2.65162 70.7485C2.65162 70.7485 0.245591 71.1446 0.368347 70.1275C0.510745 68.9392 2.8824 68.592 2.8824 68.592C1.37004 68.1812 1.1098 66.5089 4.16398 66.636C6.76642 66.7289 9.12334 63.9416 9.12334 63.9416L30.2473 65.2864Z" fill="white"/>
<path d="M17.7113 83.9564C17.5728 83.9518 17.4369 83.9165 17.3138 83.8531C17.1906 83.7896 17.0832 83.6996 16.9994 83.5897C16.7244 83.1838 16.8619 82.553 17.0632 81.8146C16.6213 82.3965 16.032 82.8659 15.3053 82.7437C14.8143 82.6655 14.6228 82.1667 14.554 81.6581C14.2005 82.2645 13.68 82.9002 13.081 82.8708C13.0213 82.8658 12.9622 82.856 12.9042 82.8415C12.7816 82.8105 12.6669 82.7539 12.5679 82.6756C12.4689 82.5972 12.3877 82.4987 12.3297 82.3867C12.2256 82.1852 12.1686 81.9629 12.1627 81.7364C12.0442 81.8811 11.8942 81.9972 11.7241 82.0759C11.554 82.1547 11.3682 82.1941 11.1807 82.1911C11.1061 82.1869 11.0321 82.1754 10.9597 82.1569C10.833 82.1241 10.7155 82.063 10.616 81.9783C10.5164 81.8935 10.4375 81.7874 10.3852 81.6679C10.2984 81.4779 10.258 81.2701 10.2674 81.0615C10.134 81.1933 9.97514 81.2968 9.80044 81.3658C9.62573 81.4347 9.43881 81.4676 9.25096 81.4625H9.14785C9.0331 81.4526 8.92242 81.4154 8.82504 81.3542C8.72766 81.2929 8.64641 81.2094 8.58808 81.1104C8.4776 80.9053 8.42981 80.6724 8.45059 80.4405C7.95956 80.8757 7.31632 81.3647 6.85967 81.3452C6.74399 81.3424 6.6322 81.303 6.5405 81.2327C6.35605 81.0729 6.22894 80.8575 6.17844 80.6192C6.12793 80.381 6.15678 80.1328 6.26062 79.9124C6.18632 79.8154 6.13384 79.7036 6.10673 79.5847C6.07962 79.4657 6.07852 79.3423 6.10349 79.2229C5.76423 79.4617 5.36437 79.6007 4.94958 79.6239C4.82249 79.6158 4.69861 79.5808 4.58622 79.5212C4.49364 79.4708 4.41319 79.401 4.35044 79.3166C4.28769 79.2321 4.24416 79.1351 4.22286 79.0322C4.18243 78.8171 4.19592 78.5954 4.26214 78.3867C4.0624 78.4909 3.83942 78.5431 3.61398 78.5383C3.48337 78.5359 3.35568 78.4995 3.24366 78.4325C3.13164 78.3656 3.03923 78.2705 2.97565 78.1569C2.88093 77.9778 2.84202 77.7747 2.86389 77.5734C2.88575 77.3722 2.96741 77.1821 3.09841 77.0273C2.82852 77.0926 2.54663 77.0906 2.27769 77.0215C2.00875 76.9525 1.76108 76.8184 1.55659 76.6312C1.44115 76.5356 1.34926 76.415 1.28797 76.2785C1.22668 76.142 1.19763 75.9933 1.20305 75.8439C1.21057 75.7684 1.22875 75.6943 1.25706 75.6239C0.569623 75.6092 0.0785974 75.2474 3.32762e-05 74.729C-0.0785309 74.2107 0.250457 73.6728 1.09502 73.4038L1.24233 73.35C1.02482 73.3568 0.810057 73.3002 0.624307 73.1873C0.438558 73.0744 0.289874 72.9101 0.196444 72.7143C0.14535 72.6014 0.118929 72.4789 0.118929 72.3549C0.118929 72.231 0.14535 72.1085 0.196444 71.9955C0.450155 71.571 0.824304 71.2307 1.27179 71.0175C0.905665 71.0152 0.5543 70.8735 0.289739 70.6214C0.224523 70.5434 0.17642 70.4526 0.148515 70.3549C0.12061 70.2572 0.11352 70.1548 0.1277 70.0542C0.235726 69.1545 1.34544 68.685 2.11636 68.465C1.93325 68.3549 1.78413 68.1968 1.68538 68.0078C1.58663 67.8189 1.54207 67.6065 1.55659 67.3941C1.6106 67.0469 1.97396 66.24 4.18849 66.3183C6.64362 66.4063 8.92198 63.7412 8.94162 63.7168C8.96802 63.6858 9.00125 63.6613 9.03873 63.6452C9.0762 63.629 9.1169 63.6218 9.15767 63.6239L30.2718 65.0175C30.3131 65.0212 30.3529 65.0347 30.3879 65.0568C30.4229 65.0789 30.4521 65.109 30.4731 65.1447C30.4731 65.1691 31.9756 67.6875 34.4701 67.8048C36.1395 67.8879 37.1756 68.2938 37.4555 68.9931C37.5203 69.1701 37.5394 69.3604 37.5111 69.5467C37.4828 69.7329 37.408 69.9091 37.2935 70.0591C38.0545 70.2205 39.4982 70.6606 39.6013 71.7168C39.6167 71.8419 39.6045 71.9689 39.5654 72.0889C39.5264 72.2088 39.4616 72.3188 39.3754 72.4112C39.1871 72.5653 38.9698 72.6806 38.7363 72.7503C38.5028 72.82 38.2577 72.8427 38.0153 72.817C38.2369 73.002 38.4061 73.2413 38.5063 73.5114C38.5565 73.65 38.5746 73.798 38.5593 73.9445C38.544 74.091 38.4957 74.2321 38.4179 74.3574C38.2808 74.5723 38.0821 74.7412 37.8475 74.8424C37.6128 74.9435 37.3531 74.9722 37.102 74.9246H36.9841C37.2542 75.0762 37.5586 75.2376 37.8778 75.4136C38.2108 75.5387 38.4904 75.7743 38.6693 76.0807C38.8482 76.3872 38.9155 76.7457 38.8598 77.0958C38.7771 77.3675 38.5994 77.6007 38.3589 77.7532C38.1184 77.9056 37.831 77.9673 37.5488 77.9271C37.5806 78.0332 37.5923 78.1443 37.5832 78.2547C37.5669 78.3822 37.5256 78.5053 37.4616 78.6169C37.3975 78.7285 37.3121 78.8264 37.21 78.9051C36.827 79.2131 36.0708 79.1056 35.2753 78.6899C35.3861 78.8428 35.4501 79.0243 35.4597 79.2125C35.4692 79.4008 35.424 79.5878 35.3294 79.751C35.2488 79.8578 35.143 79.9431 35.0213 79.9994C34.8997 80.0557 34.766 80.0813 34.6321 80.0738C34.4211 80.0573 34.2172 79.9902 34.038 79.8782C34.0777 80.0829 34.0676 80.2942 34.0085 80.4943C33.976 80.5924 33.9229 80.6824 33.8526 80.7583C33.7823 80.8342 33.6965 80.8943 33.6009 80.9344C33.4836 80.9854 33.3555 81.0072 33.2278 80.998C32.8183 80.9447 32.433 80.7749 32.118 80.509C32.1311 80.6299 32.1182 80.7521 32.0801 80.8677C32.042 80.9832 31.9796 81.0893 31.8971 81.1789C32.0051 81.5701 32.1721 82.465 31.5779 82.8317C31.474 82.8967 31.3515 82.9259 31.2293 82.9148C30.7874 82.9148 30.2472 82.4258 29.825 82.0004C29.81 82.176 29.749 82.3446 29.6482 82.4894C29.5766 82.5871 29.4827 82.6664 29.3743 82.7208C29.2659 82.7752 29.146 82.8032 29.0246 82.8024C28.7711 82.7822 28.5263 82.7014 28.3109 82.5669C28.0955 82.4324 27.9159 82.2481 27.7872 82.0298C27.7663 82.2025 27.7094 82.3691 27.6202 82.5188C27.553 82.6272 27.4628 82.7197 27.3559 82.7898C27.2491 82.8599 27.1281 82.9059 27.0016 82.9246C26.928 82.9295 26.8542 82.9295 26.7806 82.9246C26.5958 82.9063 26.4174 82.8477 26.2578 82.7531C26.0983 82.6584 25.9616 82.53 25.8575 82.377C25.8301 82.6028 25.753 82.8199 25.6316 83.0126C25.562 83.117 25.4716 83.206 25.366 83.2742C25.2604 83.3423 25.1419 83.3881 25.0178 83.4087C24.9575 83.4161 24.8965 83.4161 24.8361 83.4087C24.296 83.4087 23.8541 82.8268 23.5791 82.2498C23.5376 82.4155 23.4642 82.5716 23.3631 82.7095C23.28 82.8184 23.1742 82.908 23.053 82.9722C22.9318 83.0363 22.798 83.0735 22.6609 83.0811C22.411 83.0936 22.1639 83.023 21.9586 82.8805C21.7533 82.738 21.6014 82.5317 21.5266 82.2938C21.3204 82.9735 20.9718 83.7315 20.4267 83.9222C20.2581 83.9928 20.0709 84.0067 19.8936 83.9617C19.7164 83.9167 19.5587 83.8152 19.4447 83.6728C19.3412 83.5374 19.2661 83.3828 19.2237 83.218C19.0745 83.451 18.8659 83.6403 18.6191 83.7666C18.3724 83.8929 18.0964 83.9516 17.8194 83.9369L17.7113 83.9564ZM19.1844 82.0493C19.1975 81.9832 19.2364 81.9249 19.2925 81.8873C19.3487 81.8498 19.4175 81.8359 19.4839 81.8488C19.5507 81.863 19.6093 81.9027 19.6469 81.9594C19.6846 82.0161 19.6984 82.0853 19.6853 82.152C19.5856 82.5655 19.6378 83.0009 19.8326 83.3794C19.9308 83.5114 20.0634 83.531 20.2549 83.4625C20.7753 83.2865 21.1583 81.9222 21.2762 81.1007C21.2793 81.0691 21.2886 81.0385 21.3036 81.0106C21.3186 80.9827 21.339 80.958 21.3637 80.938C21.3883 80.918 21.4167 80.903 21.4472 80.894C21.4777 80.885 21.5097 80.8821 21.5413 80.8855C21.606 80.888 21.6672 80.9154 21.7121 80.9619C21.757 81.0084 21.782 81.0704 21.7819 81.1349C21.7819 81.1349 21.836 82.6508 22.6216 82.6019C22.6856 82.6011 22.7485 82.5858 22.8055 82.5569C22.8626 82.5281 22.9122 82.4866 22.9506 82.4356C23.2256 82.0738 23.1372 81.2669 23.0783 80.9686C23.0662 80.904 23.0793 80.8372 23.1149 80.7819C23.1504 80.7265 23.2058 80.6866 23.2698 80.6703C23.3017 80.6623 23.3349 80.6606 23.3675 80.6653C23.4001 80.67 23.4314 80.6811 23.4597 80.6979C23.4879 80.7147 23.5126 80.7369 23.5323 80.7632C23.5519 80.7896 23.5662 80.8195 23.5742 80.8513C23.8148 81.7315 24.3942 82.998 24.9294 82.91C24.9854 82.9023 25.0389 82.8826 25.0864 82.8522C25.1339 82.8218 25.1742 82.7814 25.2044 82.7339C25.4696 82.3378 25.3566 81.4674 25.2879 81.1642C25.2732 81.0988 25.2851 81.0302 25.3209 80.9734C25.3568 80.9166 25.4137 80.8762 25.4794 80.8611C25.5116 80.8531 25.5451 80.8515 25.578 80.8566C25.6108 80.8616 25.6424 80.8731 25.6707 80.8904C25.699 80.9077 25.7236 80.9305 25.743 80.9573C25.7625 80.9842 25.7763 81.0146 25.7838 81.0469C25.8771 81.4185 26.2748 82.5139 26.9132 82.4112C26.9678 82.4055 27.0203 82.387 27.0663 82.3572C27.1124 82.3275 27.1508 82.2873 27.1783 82.24C27.4042 81.8782 27.2274 81.0615 27.144 80.8073C27.125 80.7437 27.1312 80.6753 27.1614 80.6162C27.1915 80.5571 27.2433 80.5117 27.306 80.4894C27.3686 80.467 27.4374 80.4699 27.4979 80.4973C27.5584 80.5246 27.6059 80.5745 27.6301 80.6361C27.9247 81.3941 28.455 82.284 29 82.2694C29.044 82.2723 29.088 82.2645 29.1282 82.2466C29.1685 82.2287 29.2037 82.2012 29.2308 82.1667C29.3347 81.8807 29.3347 81.5676 29.2308 81.2816C29.2142 81.2255 29.2179 81.1655 29.2412 81.1118C29.2645 81.0582 29.3061 81.0145 29.3585 80.9882C29.4115 80.9616 29.4721 80.9539 29.5302 80.9664C29.5882 80.9788 29.6403 81.0107 29.6776 81.0567C30.0999 81.5946 30.8659 82.3574 31.2244 82.3721C31.2587 82.3721 31.2735 82.3721 31.2784 82.3721C31.5779 82.1911 31.4453 81.4723 31.3324 81.1545C31.3134 81.1004 31.3132 81.0416 31.3319 80.9875C31.3506 80.9333 31.3871 80.8871 31.4355 80.8562C31.8136 80.6117 31.3029 79.7657 31.298 79.7608C31.2641 79.706 31.2518 79.6407 31.2636 79.5774C31.2754 79.5141 31.3105 79.4575 31.3619 79.4185C31.4134 79.3814 31.4769 79.3643 31.5403 79.3706C31.6036 79.377 31.6624 79.4062 31.7056 79.4527C32.0542 79.8391 32.7809 80.4601 33.2229 80.4796C33.2697 80.4902 33.3184 80.4902 33.3653 80.4796C33.396 80.4673 33.4236 80.4482 33.4457 80.4236C33.4678 80.399 33.484 80.3696 33.4929 80.3378C33.5268 79.9466 33.4358 79.5546 33.2327 79.218C33.2036 79.162 33.196 79.0973 33.2113 79.0361C33.2267 78.9748 33.264 78.9213 33.3161 78.8855C33.3687 78.8504 33.4324 78.836 33.495 78.845C33.5576 78.8541 33.6146 78.8859 33.655 78.9344C33.7924 79.0909 34.2687 79.5603 34.637 79.575C34.6903 79.5781 34.7436 79.5676 34.7917 79.5445C34.8398 79.5214 34.8812 79.4864 34.912 79.443C35.0249 79.3012 34.7745 78.6557 33.8612 77.6679L33.7483 77.5505C33.7014 77.5013 33.6761 77.4354 33.6779 77.3676C33.6797 77.2997 33.7086 77.2354 33.7581 77.1887C33.8076 77.142 33.8736 77.1168 33.9418 77.1186C34.0099 77.1205 34.0745 77.1492 34.1214 77.1985L34.2295 77.3158C34.8403 77.9772 35.6501 78.4233 36.5373 78.5872C36.6515 78.5998 36.7667 78.5758 36.8663 78.5188C36.9159 78.4841 36.958 78.4398 36.99 78.3885C37.0221 78.3373 37.0434 78.2801 37.0529 78.2205C37.0505 78.0597 36.9934 77.9045 36.8908 77.7804C36.8585 77.7373 36.8411 77.685 36.8411 77.6312C36.8411 77.5775 36.8585 77.5252 36.8908 77.4821C36.918 77.436 36.9596 77.4 37.0093 77.3797C37.0589 77.3594 37.1139 77.3558 37.1658 77.3696C37.8041 77.5212 38.2706 77.3696 38.3688 76.9784C38.3931 76.7431 38.3371 76.5065 38.2096 76.3068C38.0822 76.1072 37.8909 75.9561 37.6666 75.8782C36.8338 75.4747 36.0356 75.0037 35.2803 74.4699C35.2335 74.4303 35.2023 74.3757 35.192 74.3154C35.1818 74.2552 35.1933 74.1934 35.2244 74.1407C35.2555 74.0881 35.3043 74.0481 35.3621 74.0278C35.4199 74.0075 35.4831 74.0082 35.5405 74.0298C36.0469 74.2528 36.5855 74.3947 37.1363 74.4503C37.5733 74.4747 37.8581 74.3672 37.9858 74.1422C38.0274 74.0785 38.0535 74.006 38.062 73.9304C38.0705 73.8549 38.0613 73.7784 38.0349 73.707C37.8827 73.2571 37.1707 72.8611 36.9105 72.729C36.8528 72.7041 36.8064 72.6589 36.7802 72.6021C36.7539 72.5452 36.7496 72.4808 36.7681 72.421C36.7872 72.3619 36.827 72.3117 36.8801 72.2794C36.9333 72.2471 36.9963 72.2349 37.0578 72.2449C37.288 72.2873 37.521 72.3135 37.755 72.3232C38.1899 72.3963 38.6367 72.3094 39.012 72.0787C39.0475 72.0393 39.0734 71.9924 39.0879 71.9416C39.1023 71.8907 39.105 71.8373 39.0955 71.7853C39.0219 70.9735 37.4113 70.5921 36.8024 70.5139C36.755 70.507 36.7103 70.4875 36.6731 70.4573C36.6359 70.4272 36.6077 70.3876 36.5913 70.3427C36.5755 70.2987 36.5722 70.2513 36.5818 70.2056C36.5913 70.1599 36.6133 70.1176 36.6453 70.0835C36.8663 69.8488 37.1069 69.5065 36.9841 69.1985C36.7926 68.7095 35.8449 68.4014 34.4504 68.3329C31.9953 68.2156 30.4535 66.0738 30.1097 65.5408L9.26078 64.1618C8.79922 64.6508 6.62397 66.9344 4.17867 66.8464C2.79888 66.7975 2.12618 67.1349 2.07216 67.4919C2.02797 67.7657 2.35696 68.1569 2.97565 68.3232C3.03225 68.3378 3.0819 68.3718 3.11598 68.4192C3.15006 68.4665 3.16643 68.5242 3.16224 68.5823C3.15953 68.641 3.13654 68.6969 3.09716 68.7405C3.05778 68.7842 3.00444 68.813 2.94619 68.8219C2.34223 68.91 0.746393 69.3109 0.648188 70.1373C0.641556 70.1678 0.641633 70.1993 0.648416 70.2297C0.655198 70.26 0.668522 70.2886 0.68747 70.3134C0.741483 70.3721 0.918252 70.5139 1.50257 70.5432C1.88194 70.5532 2.26146 70.5303 2.63684 70.4747C2.70052 70.4631 2.76627 70.4764 2.82028 70.512C2.8743 70.5475 2.91238 70.6025 2.92655 70.6655C2.94081 70.7282 2.93111 70.794 2.89935 70.8501C2.86758 70.9061 2.81602 70.9484 2.75469 70.9686C2.07707 71.1789 0.923162 71.707 0.69238 72.2107C0.669356 72.2579 0.657394 72.3098 0.657394 72.3623C0.657394 72.4148 0.669356 72.4666 0.69238 72.5139C0.726752 72.5872 0.829867 72.8268 1.3258 72.8464C1.87922 72.8283 2.42413 72.7055 2.93146 72.4845C2.98742 72.4589 3.05092 72.4547 3.1098 72.4727C3.16868 72.4908 3.21882 72.5298 3.25063 72.5823C3.28391 72.6348 3.29678 72.6975 3.28684 72.7588C3.27689 72.82 3.2448 72.8755 3.19661 72.9148C2.61637 73.346 1.9673 73.6766 1.2767 73.8928C0.712021 74.0787 0.49597 74.4161 0.530341 74.6703C0.574534 75.0224 1.09993 75.2278 1.78246 75.13C1.83865 75.1237 1.89533 75.1362 1.94363 75.1655C1.99193 75.1948 2.0291 75.2392 2.04932 75.2918C2.06955 75.3443 2.07167 75.4021 2.05536 75.456C2.03906 75.5099 2.00525 75.5569 1.95923 75.5897C1.84943 75.671 1.77274 75.7891 1.74318 75.9222C1.74541 75.9956 1.76423 76.0676 1.79824 76.1328C1.83224 76.1979 1.88055 76.2547 1.93959 76.2987C2.40115 76.7388 3.17697 76.6752 3.96261 76.1422C4.23268 75.9075 4.45364 75.7608 4.45364 75.751C4.50672 75.713 4.57244 75.6967 4.63723 75.7055C4.70202 75.7143 4.76095 75.7475 4.80188 75.7983C4.8428 75.8491 4.8626 75.9136 4.85719 75.9785C4.85178 76.0434 4.82158 76.1037 4.77281 76.1471C4.61883 76.2906 4.45474 76.423 4.28178 76.5432C3.59434 77.1447 3.29973 77.6581 3.44704 77.9271C3.46715 77.9694 3.49925 78.0049 3.53939 78.0292C3.57953 78.0535 3.62595 78.0656 3.67291 78.064C4.07455 77.9962 4.44609 77.8086 4.73843 77.5261C4.78561 77.4858 4.8457 77.4637 4.90784 77.4637C4.96998 77.4637 5.03007 77.4858 5.07724 77.5261C5.12387 77.5667 5.15407 77.6229 5.1622 77.6841C5.17033 77.7452 5.15584 77.8073 5.12143 77.8586C4.8886 78.1755 4.75996 78.5564 4.75317 78.9491C4.76069 78.9813 4.77512 79.0115 4.79546 79.0377C4.8158 79.0639 4.84157 79.0853 4.87101 79.1007C4.91393 79.1223 4.96059 79.1356 5.0085 79.1398C5.45042 79.1398 6.23115 78.6068 6.61906 78.2547C6.66529 78.2054 6.72929 78.1764 6.79697 78.1741C6.86466 78.1719 6.93048 78.1964 6.97997 78.2425C7.02946 78.2885 7.05855 78.3522 7.06085 78.4196C7.06315 78.487 7.03847 78.5526 6.99224 78.6019C6.99224 78.6019 6.3981 79.3989 6.75164 79.6826C6.799 79.7178 6.83202 79.7688 6.84465 79.8263C6.85728 79.8838 6.84866 79.9439 6.82039 79.9955C6.82039 79.9955 6.52577 80.5774 6.88422 80.8513H6.91859C7.28195 80.8513 8.20999 80.0591 8.72066 79.5114C8.76015 79.4679 8.81381 79.4396 8.87219 79.4315C8.93057 79.4235 8.98993 79.4362 9.03982 79.4674C9.08949 79.4984 9.12718 79.5453 9.14679 79.6003C9.16639 79.6553 9.16677 79.7153 9.14785 79.7706C8.9972 80.1158 8.9661 80.5012 9.05946 80.8659C9.07988 80.8983 9.10808 80.9251 9.14152 80.9439C9.17496 80.9627 9.21258 80.9729 9.25096 80.9735C9.71744 81.0322 10.1839 80.6263 10.5866 79.8293C10.6162 79.7705 10.6675 79.7255 10.7298 79.7036C10.792 79.6817 10.8604 79.6847 10.9205 79.7119C10.9803 79.7406 11.0269 79.7911 11.0507 79.8529C11.0744 79.9147 11.0735 79.9833 11.0481 80.0444C10.945 80.2889 10.6897 81.0811 10.8812 81.4674C10.9038 81.5169 10.9379 81.5604 10.9805 81.5943C11.0232 81.6283 11.0732 81.6518 11.1267 81.663C11.7306 81.8293 12.2511 80.773 12.3788 80.4161C12.4003 80.3512 12.4468 80.2975 12.508 80.2668C12.5692 80.2361 12.6402 80.2309 12.7053 80.2523C12.7704 80.2737 12.8244 80.3199 12.8552 80.3809C12.8861 80.4419 12.8913 80.5126 12.8698 80.5774C12.7716 80.8708 12.5752 81.7266 12.8011 82.1471C12.8276 82.1976 12.8644 82.242 12.9092 82.2774C12.9541 82.3128 13.0059 82.3384 13.0613 82.3525H13.1301C13.6211 82.3769 14.2938 81.2376 14.6031 80.421C14.6254 80.3619 14.6688 80.3132 14.7251 80.2843C14.7814 80.2554 14.8464 80.2483 14.9076 80.2645C14.9679 80.2796 15.0204 80.3165 15.0549 80.368C15.0894 80.4195 15.1034 80.482 15.0942 80.5432C15.0205 81.1007 15.0352 82.1716 15.4183 82.2351C16.4641 82.4063 17.2989 80.553 17.5297 79.8488C17.5499 79.7898 17.5908 79.7399 17.6449 79.7085C17.699 79.677 17.7627 79.6661 17.8243 79.6777C17.8858 79.6906 17.9404 79.7257 17.9775 79.7763C18.0147 79.8268 18.0318 79.8892 18.0256 79.9515C17.9533 80.5453 17.8268 81.1313 17.6475 81.7021C17.4658 82.3623 17.2743 83.0371 17.4462 83.2914C17.4462 83.3207 17.5297 83.4136 17.785 83.443C18.8849 83.5505 19.1942 82.1129 19.209 82.0395L19.1844 82.0493Z" fill="#414043"/>
<path d="M30.3994 66.1374C30.9295 66.3415 31.4745 66.5049 32.0296 66.6264C32.3099 66.692 32.5934 66.7426 32.8791 66.778C33.1804 66.82 33.4862 66.82 33.7875 66.778C33.8347 66.7733 33.8811 66.7618 33.925 66.7438H33.9692C33.9935 66.7393 34.0185 66.7393 34.0428 66.7438C34.1163 66.7789 34.174 66.8399 34.2049 66.9149C34.249 67.0019 34.2661 67.1001 34.2539 67.1968C34.2416 67.2935 34.2006 67.3844 34.1361 67.4577C33.9733 67.6448 33.7655 67.7878 33.5322 67.8734C33.2717 67.9755 33.0042 68.0588 32.7318 68.1228C33.0196 68.1692 33.3131 68.1692 33.6009 68.1228C33.9181 68.0838 34.2151 67.947 34.4504 67.7316C34.584 67.6017 34.6752 67.4346 34.712 67.2523C34.7488 67.07 34.7295 66.8808 34.6566 66.7096C34.5821 66.5188 34.4359 66.3645 34.2491 66.2793C34.1431 66.2311 34.026 66.2125 33.9103 66.2255C33.8793 66.2218 33.8479 66.2218 33.817 66.2255H33.758H33.6942C33.4346 66.2503 33.1731 66.2503 32.9135 66.2255L32.0836 66.1668C31.5288 66.2206 30.969 66.1619 30.3994 66.1374Z" fill="#414043"/>
<path d="M9.05459 64.2693C8.42116 64.4258 7.79265 64.5725 7.16413 64.6751C6.56062 64.7969 5.93974 64.8068 5.33261 64.7045C5.14611 64.6116 4.93626 64.5755 4.72928 64.6007C4.52229 64.6259 4.32737 64.7113 4.16887 64.8463C4.09501 64.9376 4.0433 65.0447 4.01775 65.1592C3.9922 65.2737 3.99351 65.3925 4.02157 65.5064C4.06479 65.6967 4.15224 65.8743 4.2769 66.0248C4.51151 66.2957 4.81773 66.4956 5.16075 66.6018C5.4772 66.7045 5.81119 66.7428 6.1428 66.7143C5.83312 66.6316 5.53468 66.5117 5.25404 66.3573C4.99395 66.2183 4.77156 66.0187 4.60589 65.7754C4.53435 65.6692 4.48585 65.5493 4.46349 65.4233C4.45504 65.3789 4.45637 65.3331 4.46739 65.2892C4.47841 65.2453 4.49886 65.2043 4.52732 65.169C4.55994 65.1375 4.59979 65.1143 4.64342 65.1015C4.68706 65.0887 4.73316 65.0867 4.77775 65.0957C4.91986 65.1086 5.05995 65.1381 5.19512 65.1837C5.53856 65.258 5.89208 65.2746 6.24101 65.2326C6.57366 65.1973 6.90237 65.1319 7.22306 65.037C7.86463 64.8619 8.48039 64.6038 9.05459 64.2693Z" fill="#414043"/>
<path d="M18.3251 74.0347C18.3219 75.0771 18.2448 76.118 18.0943 77.1496C17.9519 78.1741 17.7236 79.185 17.4118 80.1716C17.4015 80.2037 17.3976 80.2375 17.4004 80.2711C17.4032 80.3047 17.4127 80.3374 17.4282 80.3674C17.4437 80.3973 17.4649 80.424 17.4908 80.4458C17.5166 80.4675 17.5465 80.484 17.5787 80.4943C17.611 80.5046 17.6449 80.5084 17.6787 80.5056C17.7124 80.5028 17.7453 80.4935 17.7754 80.478C17.8055 80.4626 17.8322 80.4414 17.8541 80.4157C17.8759 80.3899 17.8925 80.3602 17.9028 80.3281C18.1349 79.2968 18.2827 78.2486 18.3448 77.1936C18.4153 76.1415 18.4087 75.0858 18.3251 74.0347Z" fill="#414043"/>
<path d="M37.1953 77.3597C36.8588 77.2397 36.5308 77.0976 36.2132 76.9343C35.8859 76.7713 35.5716 76.5953 35.2705 76.4062C34.6541 76.0239 34.0725 75.5886 33.5322 75.1055C34.0173 75.6528 34.5497 76.1568 35.1232 76.6116C35.4129 76.8414 35.7124 77.0614 36.0217 77.2619C36.3368 77.4714 36.6648 77.6608 37.0038 77.8292C37.034 77.8467 37.0676 77.8579 37.1023 77.862C37.1371 77.8661 37.1723 77.8631 37.2059 77.8531C37.2394 77.843 37.2705 77.8262 37.2972 77.8037C37.324 77.7812 37.3458 77.7535 37.3613 77.7223C37.3768 77.691 37.3857 77.6569 37.3875 77.6221C37.3892 77.5873 37.3837 77.5525 37.3714 77.5198C37.359 77.4872 37.3401 77.4575 37.3157 77.4325C37.2913 77.4074 37.262 77.3877 37.2297 77.3744L37.1953 77.3597Z" fill="#414043"/>
<path d="M24.2861 76.9834C24.4825 77.6778 24.6642 78.3721 24.841 79.0714C25.0178 79.7707 25.1749 80.4748 25.2878 81.1741C25.2932 81.2072 25.3051 81.239 25.3228 81.2675C25.3406 81.296 25.3638 81.3208 25.3912 81.3403C25.4186 81.3599 25.4496 81.3738 25.4824 81.3814C25.5152 81.3889 25.5492 81.39 25.5824 81.3844C25.6155 81.3796 25.6473 81.3683 25.6759 81.3512C25.7045 81.334 25.7294 81.3113 25.7491 81.2844C25.7687 81.2575 25.7828 81.227 25.7905 81.1946C25.7981 81.1622 25.7992 81.1287 25.7936 81.0959C25.7936 81.0959 25.7936 81.0959 25.7936 81.0665C25.5923 80.3526 25.3418 79.6778 25.0914 78.9981C24.841 78.3183 24.5513 77.6484 24.2861 76.9834Z" fill="#414043"/>
<path d="M37.0577 72.2449C36.0217 72.0395 34.9807 71.7901 33.9594 71.4919C32.9307 71.2064 31.9286 70.8334 30.9641 70.3769C31.895 70.912 32.8709 71.3652 33.8808 71.7315C34.889 72.1129 35.912 72.4487 36.9497 72.7388C37.0142 72.757 37.0832 72.7493 37.142 72.7173C37.2008 72.6853 37.2446 72.6315 37.264 72.5677C37.2737 72.5352 37.2768 72.5012 37.2732 72.4675C37.2695 72.4339 37.2591 72.4013 37.2427 72.3717C37.2262 72.3421 37.204 72.3161 37.1773 72.2952C37.1506 72.2742 37.12 72.2588 37.0872 72.2498L37.0577 72.2449Z" fill="#414043"/>
<path d="M8.15105 70.6411C7.75803 71.1855 7.31768 71.6944 6.8351 72.1619C6.36011 72.631 5.84777 73.0611 5.3031 73.4479C4.23274 74.2307 3.02061 74.8003 1.73334 75.1252C1.69717 75.1293 1.66229 75.1409 1.63103 75.1595C1.59977 75.1781 1.57285 75.2031 1.55209 75.2329C1.53133 75.2626 1.5172 75.2965 1.51064 75.3321C1.50409 75.3678 1.50527 75.4044 1.51409 75.4396C1.52292 75.4747 1.5392 75.5076 1.56183 75.536C1.58446 75.5644 1.61292 75.5876 1.64531 75.6042C1.67769 75.6207 1.71326 75.6302 1.74961 75.6319C1.78597 75.6336 1.82228 75.6276 1.8561 75.6142C3.16676 75.1959 4.38508 74.532 5.4455 73.6582C5.97197 73.2288 6.46445 72.7596 6.91858 72.2548C7.37672 71.7544 7.78918 71.2144 8.15105 70.6411Z" fill="#414043"/>
<path d="M6.10353 74.5286C5.83838 74.7535 5.56341 74.9687 5.28843 75.1789C5.01084 75.3858 4.72057 75.5752 4.41931 75.7462C4.3604 75.7808 4.31758 75.8372 4.30012 75.9031C4.28266 75.969 4.29196 76.0391 4.32602 76.0982C4.34231 76.1276 4.36439 76.1534 4.39093 76.1741C4.41747 76.1948 4.44793 76.2099 4.48048 76.2186C4.51304 76.2272 4.54701 76.2293 4.58037 76.2246C4.61374 76.2199 4.6458 76.2085 4.67465 76.1912C4.69437 76.1827 4.71261 76.1711 4.72866 76.1569C4.98477 75.9056 5.22579 75.6394 5.45047 75.3599C5.68616 75.086 5.89239 74.8268 6.10353 74.5286Z" fill="#414043"/>
<path d="M9.8696 77.9465C9.69637 78.2651 9.49768 78.5692 9.27546 78.8561C9.05779 79.1385 8.81984 79.4049 8.56347 79.6531C8.53942 79.6768 8.52033 79.7049 8.50729 79.736C8.49426 79.7671 8.48755 79.8004 8.48755 79.834C8.48755 79.8677 8.49426 79.901 8.50729 79.9321C8.52033 79.9632 8.53942 79.9913 8.56347 80.015C8.58687 80.0395 8.61505 80.0591 8.64628 80.0725C8.67752 80.0858 8.71116 80.0927 8.74515 80.0927C8.77915 80.0927 8.81279 80.0858 8.84403 80.0725C8.87526 80.0591 8.90343 80.0395 8.92683 80.015C8.94197 80.0036 8.95383 79.9884 8.9612 79.971C9.16376 79.6587 9.34266 79.3318 9.49642 78.993C9.64738 78.6541 9.77214 78.3043 9.8696 77.9465Z" fill="#414043"/>
<path d="M8.95143 75.927C8.79642 76.1581 8.62406 76.3771 8.43585 76.5822C8.25417 76.7876 8.05776 76.9832 7.86135 77.1739C7.45923 77.5535 7.03804 77.9126 6.59941 78.2497C6.54569 78.2921 6.51091 78.3539 6.50264 78.4216C6.49436 78.4894 6.51326 78.5576 6.55522 78.6116C6.59763 78.6637 6.65868 78.6974 6.72553 78.7056C6.79238 78.7138 6.85981 78.6959 6.91367 78.6556C6.91367 78.6556 6.93822 78.6556 6.94313 78.6263C7.33353 78.2203 7.70231 77.7943 8.04794 77.35C8.2198 77.125 8.38675 76.8952 8.53896 76.6605C8.69558 76.4272 8.83349 76.1819 8.95143 75.927Z" fill="#414043"/>
<path d="M5.8923 76.6899L5.24415 77.1789L4.92007 77.4185C4.81588 77.4943 4.7077 77.5645 4.59599 77.6288C4.5372 77.6636 4.49416 77.7196 4.47586 77.7852C4.45756 77.8508 4.46542 77.9209 4.49779 77.9809C4.51421 78.0108 4.53639 78.0371 4.56306 78.0584C4.58972 78.0798 4.62035 78.0957 4.65318 78.1052C4.68601 78.1147 4.72042 78.1177 4.75441 78.114C4.78841 78.1103 4.82134 78.1 4.85132 78.0836C4.87475 78.0683 4.89619 78.0503 4.91516 78.0298C5.01827 77.9124 5.10175 77.8048 5.18522 77.6924L5.42583 77.3599L5.8923 76.6899Z" fill="#414043"/>
<path d="M13.6211 77.0664C13.4296 77.6336 13.2331 78.196 13.0269 78.7583C12.8207 79.3207 12.6095 79.8781 12.364 80.4063C12.3492 80.4363 12.3407 80.4691 12.3389 80.5025C12.3371 80.536 12.342 80.5694 12.3535 80.6009C12.3649 80.6324 12.3826 80.6613 12.4055 80.6858C12.4285 80.7103 12.4561 80.73 12.4868 80.7437C12.5174 80.7576 12.5505 80.7653 12.5841 80.7664C12.6177 80.7676 12.6512 80.7621 12.6827 80.7502C12.7142 80.7384 12.743 80.7205 12.7676 80.6976C12.7921 80.6746 12.8118 80.6471 12.8256 80.6165V80.5823C13.0024 79.9955 13.13 79.4087 13.2577 78.8219C13.3854 78.2351 13.513 77.6532 13.6211 77.0664Z" fill="#414043"/>
<path d="M11.2102 78.9687C10.999 79.267 10.783 79.5555 10.562 79.8392C10.5191 79.8936 10.4996 79.9629 10.5079 80.0316C10.5161 80.1004 10.5515 80.1631 10.6062 80.2059C10.6609 80.2487 10.7304 80.2681 10.7995 80.2599C10.8686 80.2516 10.9315 80.2164 10.9745 80.1619C11.0012 80.1292 11.0198 80.0907 11.0285 80.0494C11.0972 79.6876 11.1562 79.3306 11.2102 78.9687Z" fill="#414043"/>
<path d="M19.8719 78.8074C19.7982 79.3599 19.7049 79.9076 19.5969 80.4504C19.4901 80.9876 19.3524 81.5182 19.1844 82.0396C19.1738 82.0717 19.1696 82.1056 19.1723 82.1393C19.1749 82.173 19.1843 82.2059 19.1999 82.2359C19.2154 82.266 19.2368 82.2926 19.2628 82.3143C19.2888 82.3361 19.3189 82.3524 19.3514 82.3624C19.3829 82.373 19.4163 82.3773 19.4496 82.3749C19.4828 82.3725 19.5153 82.3636 19.545 82.3485C19.5747 82.3335 19.6012 82.3127 19.6227 82.2874C19.6443 82.262 19.6605 82.2327 19.6705 82.201C19.6722 82.188 19.6722 82.1749 19.6705 82.1619C19.7591 81.6048 19.8165 81.0432 19.8424 80.4797C19.8768 79.9223 19.8866 79.3648 19.8719 78.8074Z" fill="#414043"/>
<path d="M5.47993 68.0933C5.05039 68.1859 4.61597 68.2544 4.17871 68.2986C3.758 68.3498 3.33258 68.3498 2.91187 68.2986C2.85682 68.3064 2.80573 68.3316 2.76607 68.3704C2.72642 68.4092 2.70028 68.4596 2.6915 68.5143C2.68272 68.5689 2.69175 68.625 2.71726 68.6742C2.74278 68.7233 2.78345 68.7631 2.8333 68.7876H2.88731C3.34504 68.7524 3.7968 68.6621 4.23273 68.5187C4.65992 68.416 5.07238 68.2644 5.47993 68.0933Z" fill="#414043"/>
<path d="M20.8638 70.2155C20.9346 70.6887 20.9805 71.1654 21.0013 71.6434C21.0307 72.1324 21.0405 72.6214 21.0405 73.1104C21.0405 74.0884 20.9865 75.0664 20.9031 76.0052C21.0307 75.0272 21.124 74.0786 21.1682 73.1104C21.1682 72.6214 21.2026 72.1324 21.1682 71.6434C21.169 71.1533 21.1428 70.6636 21.0896 70.1764C21.0859 70.1435 21.0695 70.1134 21.0438 70.0924C21.0181 70.0714 20.9853 70.0612 20.9522 70.0639C20.9187 70.0688 20.8884 70.0862 20.8675 70.1125C20.8465 70.1389 20.8364 70.1722 20.8392 70.2057L20.8638 70.2155Z" fill="#414043"/>
<path d="M21.5561 79.6533C21.5267 79.9027 21.4874 80.1423 21.4432 80.3966C21.4432 80.5188 21.399 80.6411 21.3695 80.7584C21.3485 80.8719 21.3173 80.9831 21.2762 81.091C21.2501 81.1552 21.2504 81.2271 21.277 81.2912C21.3037 81.3552 21.3545 81.4062 21.4186 81.4333C21.4505 81.4459 21.4846 81.4522 21.519 81.4516C21.5533 81.4511 21.5872 81.4438 21.6187 81.4302C21.6502 81.4165 21.6787 81.3968 21.7025 81.3722C21.7263 81.3475 21.745 81.3184 21.7574 81.2866C21.7643 81.2576 21.7643 81.2275 21.7574 81.1985C21.7596 81.0628 21.7514 80.9271 21.7329 80.7927C21.7329 80.6655 21.7034 80.5384 21.6789 80.4113C21.6592 80.1472 21.6052 79.8978 21.5561 79.6533Z" fill="#414043"/>
<path d="M15.3692 78.592C15.2562 78.9099 15.1384 79.2228 15.0107 79.5358C14.8901 79.8392 14.7474 80.1334 14.5835 80.416C14.5658 80.4448 14.554 80.4768 14.5489 80.5102C14.5437 80.5436 14.5453 80.5777 14.5535 80.6105C14.5618 80.6433 14.5765 80.6741 14.5968 80.7012C14.6171 80.7282 14.6426 80.751 14.6719 80.7681C14.7301 80.8028 14.7996 80.8136 14.8656 80.7981C14.9317 80.7826 14.989 80.742 15.0254 80.6849C15.0274 80.6638 15.0274 80.6425 15.0254 80.6214C15.121 80.2866 15.1899 79.9449 15.2317 79.5994C15.3053 79.262 15.3397 78.9294 15.3692 78.592Z" fill="#414043"/>
<path d="M22.6412 78.4014C22.818 79.2571 22.9653 80.1226 23.0832 80.9833C23.0786 81.0217 23.0829 81.0606 23.0957 81.0971C23.1086 81.1337 23.1296 81.1668 23.1572 81.194C23.1848 81.2212 23.2183 81.2417 23.2551 81.2541C23.292 81.2665 23.3311 81.2703 23.3696 81.2653C23.4082 81.2603 23.445 81.2466 23.4774 81.2253C23.5099 81.204 23.537 81.1756 23.5567 81.1423C23.5764 81.1089 23.5882 81.0716 23.5913 81.033C23.5943 80.9944 23.5885 80.9557 23.5742 80.9197C23.5765 80.9035 23.5765 80.887 23.5742 80.8708C23.2992 80.0297 22.9882 79.2066 22.6412 78.4014Z" fill="#414043"/>
<path d="M28.1113 75.1252C28.6024 75.9174 29.1474 76.6998 29.6777 77.4822C29.9478 77.8734 30.2178 78.2597 30.4928 78.646C30.7678 79.0323 31.0428 79.4137 31.3472 79.7903C31.3674 79.8183 31.3932 79.8419 31.4229 79.8597C31.4526 79.8775 31.4856 79.8891 31.52 79.8937C31.5543 79.8984 31.5893 79.896 31.6227 79.8868C31.6561 79.8776 31.6872 79.8617 31.7143 79.8401C31.7413 79.8185 31.7636 79.7916 31.7799 79.7612C31.7962 79.7307 31.8061 79.6972 31.8089 79.6628C31.8118 79.6284 31.8076 79.5938 31.7966 79.5611C31.7856 79.5283 31.768 79.4982 31.7449 79.4724C31.4258 79.1399 31.1164 78.7878 30.8071 78.4308C30.4977 78.0739 30.1982 77.712 29.8987 77.3502C29.2849 76.602 28.6956 75.8636 28.1113 75.1252Z" fill="#414043"/>
<path d="M27.6301 80.6557C27.4042 80.2645 27.1734 79.8831 26.9377 79.5017C27.0114 79.9418 27.0851 80.3868 27.1489 80.822C27.1587 80.8904 27.195 80.9523 27.2501 80.9944C27.3052 81.0364 27.3746 81.0553 27.4435 81.0469C27.5117 81.0349 27.5727 80.9973 27.6138 80.9417C27.6549 80.8862 27.6731 80.8171 27.6645 80.7486C27.6604 80.7154 27.6486 80.6836 27.6301 80.6557Z" fill="#414043"/>
<path d="M29.7219 81.0957C29.4027 80.6067 29.0933 80.1421 28.7987 79.6287C28.5041 79.1152 28.2242 78.6507 27.964 78.1225C28.1457 78.6702 28.3519 79.213 28.5679 79.746C28.784 80.279 29.0246 80.8072 29.2799 81.3304C29.3087 81.3912 29.3605 81.4383 29.424 81.4612C29.4875 81.4841 29.5575 81.481 29.6187 81.4526C29.6802 81.423 29.7275 81.3705 29.7505 81.3065C29.7734 81.2425 29.7702 81.172 29.7415 81.1103V81.081L29.7219 81.0957Z" fill="#414043"/>
<path d="M33.6845 78.9196C33.1934 78.4062 32.727 77.9417 32.2114 77.4527C31.6958 76.9637 31.195 76.5285 30.6696 76.0933C31.136 76.5822 31.5878 77.1055 32.0248 77.6287C32.4618 78.1519 32.8988 78.6898 33.2867 79.2277C33.3059 79.2555 33.3304 79.2793 33.3589 79.2976C33.3874 79.3159 33.4192 79.3284 33.4526 79.3343C33.4859 79.3402 33.5201 79.3395 33.5532 79.3321C33.5863 79.3247 33.6175 79.3108 33.6452 79.2913C33.6998 79.2512 33.7365 79.1914 33.7475 79.1247C33.7585 79.058 33.7429 78.9897 33.7041 78.9343L33.6845 78.9196Z" fill="#414043"/>
<path d="M34.1461 77.1936L32.9578 76.2156L33.7581 77.5359C33.7753 77.565 33.7982 77.5904 33.8253 77.6107C33.8525 77.6309 33.8834 77.6456 33.9164 77.6537C33.9493 77.6619 33.9835 77.6635 34.017 77.6584C34.0506 77.6533 34.0827 77.6415 34.1117 77.6239C34.1701 77.5875 34.212 77.5299 34.2285 77.4632C34.245 77.3966 34.2348 77.3262 34.2001 77.2669C34.1871 77.2391 34.1688 77.2142 34.1461 77.1936Z" fill="#414043"/>
<path d="M33.321 72.7827C33.6304 73.081 33.9446 73.3695 34.2736 73.6531C34.5997 73.9432 34.9424 74.2142 35.2999 74.4649C35.3275 74.4844 35.3588 74.4983 35.3918 74.5056C35.4249 74.513 35.4591 74.5138 35.4925 74.5079C35.5258 74.502 35.5577 74.4895 35.5862 74.4712C35.6146 74.4529 35.6392 74.4291 35.6583 74.4013C35.6967 74.3453 35.7115 74.2766 35.6995 74.2098C35.6876 74.1431 35.6499 74.0837 35.5945 74.0443L35.5503 74.0199C35.1627 73.8517 34.7856 73.6607 34.4209 73.4477C34.0478 73.2375 33.6795 73.0125 33.321 72.7827Z" fill="#414043"/>
<path d="M36.827 70.0003C36.3359 70.0003 35.8106 70.0003 35.2999 69.9563C34.7892 69.9336 34.2806 69.8764 33.7777 69.7851C34.2578 69.961 34.7501 70.1015 35.2508 70.2057C35.7418 70.3182 36.2574 70.4208 36.773 70.5089C36.8399 70.5188 36.9081 70.5025 36.9631 70.4632C37.0181 70.424 37.0556 70.3649 37.0676 70.2986C37.0739 70.2654 37.0734 70.2314 37.0661 70.1984C37.0588 70.1654 37.0448 70.1343 37.0251 70.1069C37.0053 70.0794 36.9802 70.0563 36.9512 70.0388C36.9222 70.0213 36.89 70.0099 36.8564 70.0052H36.827V70.0003Z" fill="#414043"/>
<path d="M2.73992 70.9638C2.91669 70.8904 3.07381 70.8073 3.23094 70.7242C3.38807 70.641 3.55011 70.553 3.72197 70.4601C4.02948 70.2766 4.32622 70.0758 4.61073 69.8586C4.29058 69.9992 3.9627 70.1217 3.62867 70.2254C3.46172 70.2792 3.28987 70.3232 3.13765 70.3672C2.97592 70.4114 2.81203 70.4473 2.64662 70.4748C2.59654 70.4999 2.55596 70.5405 2.53092 70.5905C2.50588 70.6405 2.49772 70.6971 2.50766 70.7521C2.51759 70.8071 2.54509 70.8574 2.58606 70.8955C2.62702 70.9337 2.67927 70.9576 2.73501 70.9638H2.73992Z" fill="#414043"/>
<path d="M3.15238 72.9296C3.39298 72.7291 3.64341 72.5286 3.85455 72.3232L4.19827 72.0103C4.31149 71.9056 4.41502 71.7911 4.50761 71.668C4.38606 71.7597 4.2562 71.8399 4.1197 71.9076C3.98712 71.9809 3.84964 72.0445 3.71215 72.1129C3.44209 72.245 3.1622 72.3721 2.88723 72.4944C2.82437 72.5213 2.77469 72.5718 2.74896 72.635C2.72322 72.6981 2.72351 72.7688 2.74974 72.8318C2.77779 72.8947 2.82942 72.9443 2.89363 72.9699C2.95784 72.9954 3.02955 72.995 3.09346 72.9687L3.15238 72.9296Z" fill="#414043"/>
<path d="M13.6604 70.9148C13.5425 71.174 13.4296 71.4331 13.3068 71.6874C13.1841 71.9417 13.0662 72.1764 12.9435 72.4453C12.6881 72.9343 12.4524 73.4527 12.1627 73.9417C11.873 74.4307 11.603 74.9197 11.3034 75.4087C11.1561 75.6434 10.999 75.8977 10.837 76.1079C10.6749 76.3182 10.508 76.5676 10.3459 76.7925C10.555 76.6014 10.7534 76.399 10.9401 76.1862C11.1267 75.9661 11.3034 75.7461 11.4753 75.5163C11.812 75.0572 12.1187 74.5769 12.3935 74.0786C12.667 73.5813 12.9113 73.0686 13.1252 72.5431C13.3452 72.0148 13.5242 71.4704 13.6604 70.9148Z" fill="#414043"/>
<path d="M9.11837 72.4453C8.62734 73.0468 8.18542 73.658 7.72877 74.2741C7.2721 74.8903 6.82037 75.4917 6.37354 76.1226C6.95893 75.618 7.48299 75.0468 7.935 74.4208C8.39568 73.804 8.79218 73.1421 9.11837 72.4453Z" fill="#414043"/>
<path d="M19.862 70.6018C19.9218 71.252 19.9382 71.9054 19.9111 72.5578C19.8831 73.2141 19.8092 73.8677 19.6902 74.5138C19.8523 73.8707 19.9688 73.2171 20.0388 72.5578C20.1117 71.8921 20.138 71.2222 20.1174 70.5529C20.1174 70.5192 20.1039 70.4869 20.08 70.463C20.056 70.4392 20.0236 70.4258 19.9897 70.4258C19.9559 70.4258 19.9234 70.4392 19.8994 70.463C19.8755 70.4869 19.862 70.5192 19.862 70.5529V70.6018Z" fill="#414043"/>
<path d="M24.7478 71.8928C24.8029 72.8858 24.9675 73.8697 25.2388 74.8268C25.3707 75.3082 25.5348 75.7803 25.7299 76.24C25.9192 76.7013 26.1721 77.1341 26.4811 77.5261C26.2586 77.0878 26.0698 76.6334 25.9164 76.1666C25.7593 75.7005 25.6169 75.231 25.4892 74.7583C25.2045 73.8488 24.9884 72.8708 24.7478 71.8928Z" fill="#414043"/>
<path d="M26.3534 73.1301C26.349 73.4776 26.397 73.8237 26.4958 74.157C26.5904 74.4929 26.7136 74.82 26.8641 75.135C27.1576 75.7638 27.5505 76.3416 28.0278 76.8465C27.7136 76.2304 27.3797 75.6387 27.0949 75.0274C26.9427 74.7242 26.8101 74.4113 26.6824 74.0983C26.5543 73.7821 26.4444 73.4588 26.3534 73.1301Z" fill="#414043"/>
<path d="M16.6949 72.8708C16.4788 73.6435 16.3315 74.421 16.2039 75.2034L16.0026 76.3721C15.9289 76.7633 15.8798 77.1545 15.7865 77.5457C15.9636 77.1852 16.1003 76.8064 16.1941 76.4161C16.3021 76.0298 16.3806 75.6386 16.4543 75.2474C16.596 74.4626 16.6765 73.668 16.6949 72.8708Z" fill="#414043"/>
<path d="M8.63228 67.7558L7.82209 68.3378L7.01189 68.9099C6.47176 69.2913 5.92182 69.6532 5.3866 70.0639C6.01363 69.8232 6.60758 69.5044 7.15429 69.1153C7.71363 68.7398 8.21205 68.2813 8.63228 67.7558Z" fill="#414043"/>
<path d="M13.0565 68.4699C13.002 68.9476 12.8848 69.4162 12.7078 69.8635C12.5379 70.3235 12.3361 70.7712 12.1039 71.2034C11.6354 72.0699 11.095 72.8959 10.4884 73.6728C11.1334 72.9205 11.7117 72.1139 12.2168 71.262C12.4696 70.836 12.6927 70.3933 12.8846 69.9368C13.0921 69.469 13.2358 68.9756 13.3118 68.4699C13.3164 68.4361 13.3073 68.402 13.2866 68.3749C13.2658 68.3479 13.2352 68.3301 13.2013 68.3256C13.1675 68.3211 13.1332 68.3301 13.106 68.3507C13.0788 68.3714 13.061 68.4019 13.0565 68.4356V68.4699Z" fill="#414043"/>
<path d="M31.8185 73.8488C30.8404 73.1918 29.9395 72.4274 29.1326 71.5701C28.7345 71.1408 28.3747 70.6778 28.0573 70.1863C27.7403 69.7024 27.4956 69.1753 27.3306 68.6215C27.3214 68.5891 27.2997 68.5616 27.2703 68.5451C27.2408 68.5286 27.206 68.5244 27.1734 68.5335C27.157 68.5374 27.1415 68.5446 27.128 68.5548C27.1144 68.5649 27.1032 68.5777 27.0949 68.5924C27.0866 68.6071 27.0814 68.6234 27.0797 68.6402C27.078 68.6569 27.0798 68.6739 27.085 68.6899C27.2782 69.2598 27.551 69.7997 27.8952 70.2938C28.2359 70.7795 28.6187 71.2344 29.0393 71.6533C29.4576 72.0716 29.9003 72.4652 30.3651 72.8317C30.8288 73.1993 31.3141 73.539 31.8185 73.8488Z" fill="#414043"/>
<path d="M8.62739 64.6213C8.48008 67.7363 13.3707 70.4893 19.5527 70.7925C25.7347 71.0957 30.8463 68.8072 31.0231 65.6971C31.1999 62.5871 26.2847 59.8292 20.0978 59.526C13.9108 59.2228 8.77961 61.5113 8.62739 64.6213Z" fill="#414043"/>
<path d="M8.37202 64.6116C8.52915 61.3646 13.7733 58.9685 20.1125 59.2717C26.4516 59.5749 31.4257 62.4649 31.2784 65.7069C31.1311 68.949 25.8771 71.35 19.5429 71.0468C13.2086 70.7436 8.21489 67.8585 8.37202 64.6116ZM8.86304 64.6116C8.72065 67.5749 13.5131 70.2253 19.5478 70.5138C25.5825 70.8023 30.6057 68.6262 30.7481 65.658C30.8905 62.6898 26.0981 60.0443 20.0683 59.7558C14.0385 59.4673 9.02999 61.6678 8.88268 64.636L8.86304 64.6116Z" fill="#414043"/>
<path d="M8.62739 64.6213C8.48008 67.7363 13.3707 70.4893 19.5527 70.7925C25.7347 71.0957 30.8463 68.8072 31.0231 65.6971C31.1999 62.5871 26.2847 59.8292 20.0978 59.526C13.9108 59.2228 8.77961 61.5113 8.62739 64.6213Z" fill="#414043"/>
<path d="M8.37202 64.6116C8.52915 61.3646 13.7733 58.9685 20.1125 59.2717C26.4516 59.5749 31.4257 62.4649 31.2784 65.7069C31.1311 68.949 25.8771 71.35 19.5429 71.0468C13.2086 70.7436 8.21489 67.8585 8.37202 64.6116ZM8.86304 64.6116C8.72065 67.5749 13.5131 70.2253 19.5478 70.5138C25.5825 70.8023 30.6057 68.6262 30.7481 65.658C30.8905 62.6898 26.0981 60.0443 20.0683 59.7558C14.0385 59.4673 9.02999 61.6678 8.88268 64.636L8.86304 64.6116Z" fill="#414043"/>
<path d="M9.3933 64.6606C9.37118 65.1781 9.50823 65.6899 9.78613 66.1276C10.0584 66.5729 10.4036 66.9695 10.8075 67.3012C11.6205 67.9542 12.5276 68.4817 13.4983 68.866C17.4208 70.3691 21.7249 70.5748 25.7739 69.4528C26.7795 69.1658 27.735 68.7272 28.6072 68.1521C29.0385 67.8573 29.4197 67.4958 29.7365 67.0812C30.0577 66.6678 30.2429 66.1657 30.2668 65.6435C30.2174 66.1575 30.0138 66.6449 29.6825 67.0421C29.3572 67.4379 28.9691 67.7782 28.5335 68.0494C27.6641 68.5958 26.715 69.0049 25.7199 69.2621C23.7288 69.7947 21.6649 70.006 19.6066 69.888C17.5467 69.8102 15.5126 69.4041 13.5818 68.6851C12.6174 68.3336 11.7118 67.839 10.8958 67.2181C10.4794 66.9085 10.1163 66.5336 9.8205 66.1081C9.53926 65.6775 9.39076 65.1743 9.3933 64.6606Z" fill="white"/>
<path d="M12.1136 66.9541C13.1966 67.716 14.4119 68.2715 15.6981 68.5922C18.2649 69.2762 20.9496 69.4013 23.5693 68.959C24.8815 68.7629 26.1464 68.3287 27.3011 67.6778C26.714 67.9692 26.0987 68.2002 25.4646 68.3673C24.8328 68.5428 24.1897 68.6752 23.5398 68.7634C20.9396 69.1183 18.2959 68.9907 15.7423 68.3869C15.1055 68.2322 14.479 68.0379 13.8666 67.8049C13.2548 67.5812 12.6675 67.2961 12.1136 66.9541Z" fill="white"/>
<path d="M32.5059 68.9001C31.937 68.8438 31.3757 68.7274 30.8315 68.5529C30.2927 68.4066 29.7996 68.1274 29.3977 67.7412C29.3858 67.7292 29.3717 67.7197 29.3561 67.7132C29.3405 67.7067 29.3238 67.7034 29.3069 67.7034C29.29 67.7034 29.2732 67.7067 29.2576 67.7132C29.2421 67.7197 29.2279 67.7292 29.216 67.7412C29.2042 67.7526 29.1947 67.7662 29.1882 67.7814C29.1818 67.7965 29.1785 67.8127 29.1785 67.8292C29.1785 67.8456 29.1818 67.8619 29.1882 67.877C29.1947 67.8921 29.2042 67.9058 29.216 67.9172C29.4395 68.1204 29.6949 68.2856 29.9722 68.4062C30.2385 68.5216 30.5146 68.6132 30.7971 68.68C31.3577 68.8111 31.9303 68.8849 32.5059 68.9001Z" fill="#414043"/>
<path d="M17.839 63.668C17.9358 64.0676 18.1515 64.4289 18.4577 64.7046C18.7682 64.9861 19.1504 65.1772 19.5625 65.2572C19.9762 65.3342 20.4034 65.2936 20.795 65.1399C21.1799 64.9949 21.512 64.7375 21.7476 64.4015C21.4526 64.6563 21.1059 64.8448 20.7311 64.954C20.3669 65.0589 19.983 65.0772 19.6104 65.0075C19.2377 64.9379 18.8867 64.7822 18.5853 64.5531C18.2748 64.3157 18.02 64.0136 17.839 63.668Z" fill="white"/>
<path d="M19.8964 64.4013C20.2535 64.4303 20.6098 64.3357 20.905 64.1334C21.2002 63.9312 21.4163 63.6338 21.5168 63.2913L40.2642 2.25952C40.3814 1.86396 40.336 1.43824 40.138 1.07601C39.94 0.713777 39.6057 0.444703 39.2085 0.327982C39.0118 0.270188 38.8056 0.251536 38.6017 0.273093C38.3978 0.29465 38.2002 0.355993 38.02 0.453619C37.6563 0.650785 37.3861 0.983772 37.2689 1.37932L18.5215 62.4111C18.4591 62.6085 18.437 62.8164 18.4565 63.0224C18.476 63.2285 18.5367 63.4286 18.6351 63.6109C18.7335 63.7932 18.8675 63.954 19.0294 64.0839C19.1912 64.2138 19.3775 64.3101 19.5772 64.3671C19.6817 64.3925 19.789 64.404 19.8964 64.4013Z" fill="white"/>
<path d="M19.5036 64.5872C19.2746 64.5199 19.0612 64.4083 18.8756 64.2588C18.6899 64.1093 18.5357 63.9248 18.4217 63.7159C18.3077 63.507 18.2361 63.2778 18.2111 63.0413C18.1862 62.8048 18.2082 62.5658 18.2761 62.3378L37.0382 1.31095C37.156 0.912256 37.4073 0.565753 37.7504 0.329099C38.0934 0.0924441 38.5075 -0.0200915 38.9237 0.0102167C39.0452 0.023671 39.1652 0.0482243 39.2822 0.0835664C39.5113 0.149732 39.7249 0.260805 39.9104 0.410272C40.0959 0.559739 40.2496 0.744589 40.3624 0.953982C40.4768 1.16289 40.5487 1.39223 40.574 1.62885C40.5993 1.86548 40.5774 2.10475 40.5097 2.33295L21.7623 63.3647C21.6435 63.7621 21.3916 64.1069 21.0485 64.3418C20.7054 64.5767 20.2919 64.6875 19.8768 64.6557C19.7501 64.6476 19.6249 64.6246 19.5036 64.5872ZM37.5292 1.47721L18.7622 62.4845C18.6682 62.812 18.707 63.1632 18.8702 63.4625C18.95 63.6141 19.0592 63.7483 19.1916 63.8575C19.3239 63.9666 19.4767 64.0484 19.6411 64.0982C19.8055 64.1498 19.9786 64.168 20.1502 64.1517C20.3217 64.1354 20.4883 64.0849 20.6399 64.0033C20.7915 63.9216 20.925 63.8105 21.0327 63.6764C21.1403 63.5424 21.2198 63.3882 21.2664 63.2229L40.0334 2.18625C40.0823 2.02251 40.0982 1.85075 40.0802 1.68086C40.0622 1.51097 40.0107 1.34631 39.9285 1.19633C39.8464 1.04636 39.7353 0.914044 39.6016 0.806993C39.4679 0.699942 39.3143 0.620271 39.1496 0.572564C39.0632 0.546843 38.9743 0.530449 38.8844 0.523664C38.5826 0.50162 38.2824 0.584655 38.0352 0.758577C37.788 0.9325 37.6092 1.18651 37.5292 1.47721Z" fill="#414043"/>
<path d="M38.0202 1.59448L35.4914 9.90744L33.2621 16.636L27.414 34.7289L23.7559 47.1299L21.3007 55.4722L20.1321 59.6678L19.5281 61.7558L19.3759 62.2791C19.3197 62.4519 19.2754 62.6283 19.2433 62.8072C19.2293 62.9905 19.2777 63.1731 19.3808 63.3255C19.4864 63.4764 19.6406 63.5868 19.8178 63.6385C19.6437 63.5837 19.4935 63.4715 19.3918 63.3205C19.29 63.1694 19.2429 62.9884 19.2581 62.8072C19.2941 62.6299 19.3416 62.4551 19.4005 62.284L19.5576 61.7656L20.1665 59.6678L21.4284 55.5113L23.9179 47.1984L27.6595 34.8512L33.4242 16.6996L35.6092 9.94656L38.0202 1.59448Z" fill="#414043"/>
</g>
<defs>
<clipPath id="clip0_381_6299">
<rect width="58" height="85" fill="white" transform="translate(0 -0.000488281)"/>
</clipPath>
</defs>
</svg>
