<svg width="183" height="55" viewBox="0 0 183 55" fill="none" xmlns="http://www.w3.org/2000/svg">
<path d="M67.0195 27.5641C67.0195 26.1901 67.2672 24.9159 67.7665 23.7416C68.2657 22.5673 68.9527 21.5488 69.8275 20.686C70.7022 19.8193 71.7287 19.1402 72.903 18.641C74.0773 18.1417 75.3395 17.894 76.6896 17.894C78.0396 17.894 79.3018 18.1497 80.4761 18.6569C81.6504 19.1682 82.6689 19.8552 83.5317 20.718C84.3984 21.5847 85.0854 22.6032 85.5927 23.7736C86.104 24.9479 86.3556 26.21 86.3556 27.5601C86.3556 28.9101 86.1 30.1723 85.5927 31.3466C85.0814 32.5209 84.3944 33.5394 83.5317 34.4062C82.6649 35.2729 81.6464 35.9599 80.4761 36.4672C79.3018 36.9785 78.0396 37.2301 76.6896 37.2301C75.671 37.2301 74.6445 37.0224 73.614 36.607C72.5835 36.1916 71.7567 35.7003 71.1416 35.1331V41.428C71.1416 41.9952 70.9419 42.4825 70.5384 42.8859C70.135 43.2894 69.6477 43.4891 69.0805 43.4891C68.5134 43.4891 68.0261 43.2894 67.6227 42.8859C67.2192 42.4825 67.0195 41.9952 67.0195 41.428V27.5641ZM71.1416 27.5641C71.1416 28.323 71.2894 29.0379 71.5849 29.713C71.8805 30.388 72.2799 30.9751 72.7752 31.4744C73.2745 31.9737 73.8616 32.3691 74.5367 32.6647C75.2117 32.9603 75.9267 33.1081 76.6856 33.1081C77.4445 33.1081 78.1634 32.9603 78.8385 32.6647C79.5135 32.3691 80.1006 31.9697 80.5999 31.4744C81.0992 30.9751 81.4946 30.392 81.7902 29.713C82.0858 29.0379 82.2336 28.319 82.2336 27.5641C82.2336 26.8052 82.0858 26.0902 81.7902 25.4112C81.4946 24.7362 81.0952 24.149 80.5999 23.6497C80.1006 23.1504 79.5175 22.755 78.8385 22.4594C78.1634 22.1639 77.4445 22.0161 76.6856 22.0161C75.9267 22.0161 75.2117 22.1639 74.5367 22.4594C73.8616 22.755 73.2745 23.1544 72.7752 23.6497C72.2759 24.149 71.8805 24.7362 71.5849 25.4112C71.2894 26.0862 71.1416 26.8052 71.1416 27.5641Z" fill="white"/>
<path d="M95.7095 18.6718C96.2527 18.6718 96.736 18.8716 97.1474 19.275C97.5628 19.6784 97.7705 20.1657 97.7705 20.7329V21.0165C98.078 20.5891 98.5014 20.1817 99.0327 19.7902C99.5679 19.3988 100.139 19.0633 100.758 18.7757C101.373 18.4921 101.988 18.2644 102.607 18.1007C103.223 17.9369 103.782 17.853 104.277 17.853C104.892 17.853 105.415 18.0647 105.843 18.4921C106.27 18.9195 106.482 19.4387 106.482 20.0578C106.482 20.673 106.27 21.1882 105.843 21.6036C105.415 22.019 104.896 22.2267 104.277 22.2267C103.446 22.2267 102.647 22.3865 101.877 22.706C101.106 23.0256 100.415 23.4649 99.7956 24.0201C99.1804 24.5793 98.6891 25.2224 98.3217 25.9573C97.9542 26.6923 97.7705 27.4751 97.7705 28.3019V34.3812C97.7705 34.9483 97.5708 35.4356 97.1674 35.839C96.7639 36.2425 96.2766 36.4422 95.7095 36.4422C95.1423 36.4422 94.655 36.2425 94.2516 35.839C93.8482 35.4356 93.6484 34.9523 93.6484 34.3812V20.7289C93.6484 20.1617 93.8482 19.6744 94.2516 19.271C94.655 18.8756 95.1423 18.6718 95.7095 18.6718Z" fill="white"/>
<path d="M111.639 27.5269C111.639 26.1768 111.894 24.9147 112.402 23.7403C112.909 22.566 113.604 21.5475 114.483 20.6848C115.361 19.818 116.384 19.131 117.558 18.6237C118.732 18.1125 119.995 17.8608 121.345 17.8608C122.695 17.8608 123.957 18.1165 125.131 18.6237C126.305 19.135 127.324 19.822 128.191 20.6848C129.054 21.5515 129.745 22.57 130.252 23.7403C130.759 24.9147 131.015 26.1768 131.015 27.5269C131.015 28.8769 130.759 30.1391 130.252 31.3134C129.741 32.4877 129.054 33.5062 128.191 34.373C127.324 35.2397 126.305 35.9267 125.131 36.434C123.957 36.9453 122.695 37.1969 121.345 37.1969C119.995 37.1969 118.732 36.9413 117.558 36.434C116.384 35.9267 115.361 35.2357 114.483 34.373C113.604 33.5062 112.913 32.4877 112.402 31.3134C111.894 30.1391 111.639 28.8769 111.639 27.5269ZM115.765 27.5269C115.765 28.2858 115.912 29.0007 116.212 29.6798C116.508 30.3548 116.907 30.9419 117.406 31.4412C117.906 31.9405 118.493 32.3359 119.172 32.6315C119.851 32.9271 120.57 33.0749 121.329 33.0749C122.092 33.0749 122.811 32.9271 123.486 32.6315C124.165 32.3359 124.752 31.9365 125.251 31.4412C125.75 30.9419 126.15 30.3548 126.445 29.6798C126.741 29.0047 126.893 28.2858 126.893 27.5269C126.893 26.768 126.745 26.053 126.445 25.374C126.146 24.699 125.75 24.1118 125.251 23.6125C124.752 23.1133 124.165 22.7178 123.486 22.4223C122.807 22.1267 122.088 21.9789 121.329 21.9789C120.566 21.9789 119.847 22.1267 119.172 22.4223C118.493 22.7178 117.906 23.1172 117.406 23.6125C116.907 24.1118 116.508 24.699 116.212 25.374C115.912 26.049 115.765 26.768 115.765 27.5269Z" fill="white"/>
<path d="M140.189 13.623C140.189 13.0559 140.389 12.5686 140.792 12.1651C141.196 11.7617 141.679 11.562 142.25 11.562C142.817 11.562 143.305 11.7617 143.708 12.1651C144.111 12.5686 144.311 13.0559 144.311 13.623V18.6717H146.408C146.975 18.6717 147.463 18.8715 147.866 19.2749C148.269 19.6783 148.469 20.1656 148.469 20.7328C148.469 21.2999 148.265 21.7872 147.866 22.1907C147.463 22.5941 146.975 22.7938 146.408 22.7938H144.311V34.3491C144.311 34.9402 144.119 35.4395 143.74 35.8429C143.36 36.2464 142.873 36.4461 142.282 36.4461C141.691 36.4461 141.192 36.2464 140.788 35.8429C140.385 35.4395 140.185 34.9442 140.185 34.3491V22.7938C139.614 22.7938 139.131 22.5941 138.727 22.1907C138.324 21.7872 138.124 21.2999 138.124 20.7328C138.124 20.1656 138.324 19.6783 138.727 19.2749C139.131 18.8715 139.614 18.6717 140.185 18.6717V13.623H140.189Z" fill="white"/>
<path d="M155.3 12.6649C155.3 11.906 155.547 11.2789 156.047 10.7796C156.546 10.2804 157.149 10.0327 157.86 10.0327C158.619 10.0327 159.246 10.2804 159.745 10.7796C160.245 11.2789 160.492 11.906 160.492 12.6649C160.492 13.3759 160.245 13.979 159.745 14.4783C159.246 14.9776 158.619 15.2252 157.86 15.2252C157.149 15.2252 156.546 14.9776 156.047 14.4783C155.551 13.979 155.3 13.3759 155.3 12.6649ZM155.763 20.7732C155.763 20.1821 155.963 19.6828 156.366 19.2794C156.77 18.8759 157.265 18.6762 157.86 18.6762C158.455 18.6762 158.951 18.8759 159.354 19.2794C159.757 19.6828 159.957 20.1821 159.957 20.7732V34.3536C159.957 34.9447 159.757 35.444 159.354 35.8474C158.951 36.2508 158.451 36.4506 157.86 36.4506C157.269 36.4506 156.77 36.2508 156.366 35.8474C155.963 35.444 155.763 34.9487 155.763 34.3536V20.7732Z" fill="white"/>
<path d="M179.014 19.9894C179.418 19.1147 180.057 18.6753 180.935 18.6753C181.526 18.6753 182.022 18.887 182.413 19.3144C182.805 19.7418 183 20.229 183 20.7723C183 21.0559 182.94 21.3554 182.821 21.663L177.205 34.4645C177.109 34.6762 177.009 34.9039 176.901 35.1395C176.793 35.3752 176.646 35.6028 176.458 35.8145C176.266 36.0262 176.018 36.202 175.711 36.3298C175.403 36.4616 174.988 36.5255 174.469 36.5255C173.969 36.5255 173.566 36.4616 173.258 36.3298C172.951 36.198 172.707 36.0262 172.531 35.8145C172.352 35.6028 172.212 35.3752 172.104 35.1395C171.996 34.9039 171.896 34.6762 171.801 34.4645L166.185 21.5951C166.113 21.4073 166.065 21.2476 166.041 21.1158C166.017 20.984 166.005 20.8482 166.005 20.7084C166.005 20.1651 166.201 19.6898 166.592 19.2864C166.983 18.883 167.475 18.6833 168.066 18.6833C168.613 18.6833 169.025 18.8071 169.312 19.0547C169.596 19.3024 169.831 19.6299 170.023 20.0333L174.505 30.3424L179.014 19.9894Z" fill="white"/>
<path d="M23.1451 17.7386C21.136 17.7386 19.1149 17.2114 17.3175 16.133L12.6962 13.361C11.418 12.5941 11.0026 10.9325 11.7695 9.65432C12.5364 8.37617 14.198 7.96076 15.4762 8.72766L20.1015 11.4957C22.3542 12.8457 25.274 12.5461 27.2072 10.7607L35.9147 2.70835C37.0091 1.69382 38.7186 1.76172 39.7331 2.86013C40.7477 3.95455 40.6798 5.66408 39.5814 6.67862L30.8739 14.731C28.729 16.7121 25.9451 17.7386 23.1451 17.7386Z" fill="#FC6E45"/>
<path d="M14.0914 52.3227C13.3645 52.3227 12.6375 52.0311 12.1063 51.456C11.0918 50.3615 11.1597 48.652 12.2581 47.6375L20.9655 39.5851C24.6482 36.182 30.2201 35.6069 34.5179 38.1871L39.1393 40.9591C40.4174 41.726 40.8328 43.3876 40.0659 44.6658C39.299 45.9439 37.6374 46.3593 36.3593 45.5924L31.7379 42.8204C29.4852 41.4704 26.5654 41.77 24.6322 43.5554L15.9248 51.6077C15.4055 52.0871 14.7465 52.3227 14.0914 52.3227Z" fill="#FC6E45"/>
<path d="M10.6315 41.7292C10.1602 41.7292 9.68091 41.6054 9.24554 41.3418C7.96738 40.5749 7.55199 38.9133 8.31888 37.6351L11.0909 33.0138C12.4409 30.7611 12.1414 27.8413 10.3559 25.9081L2.30357 17.2007C1.28903 16.1062 1.35693 14.3967 2.45535 13.3822C3.54977 12.3676 5.26329 12.4355 6.27383 13.534L14.3262 22.2414C17.7293 25.9241 18.3045 31.496 15.7242 35.7938L12.9522 40.4151C12.4449 41.2619 11.5502 41.7292 10.6315 41.7292Z" fill="#FC6E45"/>
<path d="M47.5499 40.9202C46.8229 40.9202 46.096 40.6286 45.5647 40.0534L37.5124 31.346C34.1093 27.6633 33.5341 22.0914 36.1144 17.7936L38.8864 13.1723C39.6533 11.8941 41.3149 11.4787 42.593 12.2456C43.8712 13.0125 44.2866 14.6741 43.5197 15.9523L40.7477 20.5736C39.3976 22.8263 39.6972 25.7461 41.4826 27.6793L49.535 36.3867C50.5495 37.4812 50.4816 39.1907 49.3832 40.2052C48.864 40.6845 48.2049 40.9202 47.5499 40.9202Z" fill="#FC6E45"/>
<path d="M23.6785 8.57912C26.0477 8.57912 27.9683 6.6585 27.9683 4.28931C27.9683 1.92012 26.0477 -0.000488281 23.6785 -0.000488281C21.3093 -0.000488281 19.3887 1.92012 19.3887 4.28931C19.3887 6.6585 21.3093 8.57912 23.6785 8.57912Z" fill="#FC6E45"/>
<path d="M47.5466 27.8076C49.9158 27.8076 51.8364 25.887 51.8364 23.5178C51.8364 21.1486 49.9158 19.228 47.5466 19.228C45.1774 19.228 43.2568 21.1486 43.2568 23.5178C43.2568 25.887 45.1774 27.8076 47.5466 27.8076Z" fill="#FC6E45"/>
<path d="M27.9675 54.3154C30.3367 54.3154 32.2573 52.3948 32.2573 50.0256C32.2573 47.6564 30.3367 45.7358 27.9675 45.7358C25.5983 45.7358 23.6777 47.6564 23.6777 50.0256C23.6777 52.3948 25.5983 54.3154 27.9675 54.3154Z" fill="#FC6E45"/>
<path d="M4.2898 33.6631C6.659 33.6631 8.57961 31.7425 8.57961 29.3733C8.57961 27.0041 6.659 25.0835 4.2898 25.0835C1.92061 25.0835 0 27.0041 0 29.3733C0 31.7425 1.92061 33.6631 4.2898 33.6631Z" fill="#FC6E45"/>
<path d="M25.9177 32.0244C28.6046 32.0244 30.7827 29.8463 30.7827 27.1594C30.7827 24.4726 28.6046 22.2944 25.9177 22.2944C23.2309 22.2944 21.0527 24.4726 21.0527 27.1594C21.0527 29.8463 23.2309 32.0244 25.9177 32.0244Z" fill="#FC6E45"/>
</svg>
