"published"	"country"	"city"	"company"	"title"	"tags"	"link"	"id"	"updated"	"inserted"
"11.07.2019"	"Austria"	"Vienna"	"ISG Personalmanagement GmbH"	"Senior Software Developer - Open Source Framework - Vienna at ISG Personalmanagement GmbH (Vienna, Austria)"	"openshift, go, java, canary-deployment, kubernetes"	"https://stackoverflow.com/jobs/238132/senior-software-developer-open-source-framework-isg-personalmanagement-gmbh?a=1hRrRwj6vJMA"	"238132"	"11.07.2019"	"1563973369"
"10.07.2019"	"Bulgaria"	"Sofia"	"Peytz & Co A/S"	"We are on the lookout for a senior PHP developer star at Peytz & Co A/S (Sofia, Bulgaria)"	"php, zend-framework3, symfony4, go"	"https://stackoverflow.com/jobs/240899/we-are-on-the-lookout-for-a-senior-php-developer-peytz-co-a-s?a=1iMYXNsxB2bC"	"240899"	"10.07.2019"	"1563973369"
"29.06.2019"	"Bulgaria"	"Sofia"	"SumUp"	"(Senior) Backend Developer at SumUp (Sofia, Bulgaria)"	"ruby, ruby-on-rails, go, java, scala"	"https://stackoverflow.com/jobs/195486/senior-backend-developer-sumup?a=13yIpJdmOwPS"	"195486"	"29.06.2019"	"1563973369"
"13.07.2019"	"Canada"	"Montreal"	"Ubisoft Montreal"	"Online Programmer at Ubisoft Montreal (Montreal, QC, Canada)"	"python, go, docker, amazon-web-services, c#"	"https://stackoverflow.com/jobs/203799/online-programmer-ubisoft-montreal?a=16lzbGY8yt2w"	"203799"	"13.07.2019"	"1563973369"
"15.07.2019"	"Canada"	"Vancouver"	"LoginRadius Inc."	"Senior DevOps at LoginRadius Inc. (Vancouver, BC, Canada)"	"go, azure, saas, security, google-cloud-platform, sysadmin"	"https://stackoverflow.com/jobs/281773/senior-devops-loginradius-inc?a=1wuS1uAr3MxG"	"281773"	"15.07.2019"	"1563973369"
"28.06.2019"	"Denmark"	"Aarhus"	"Google"	"Software Engineer at Google (Aarhus, Denmark)"	"c, c++, go"	"https://stackoverflow.com/jobs/231873/software-engineer-google?a=1fLj1ivYoouY"	"231873"	"28.06.2019"	"1563973369"
"21.07.2019"	"Denmark"	"Copenhagen"	"Maersk"	"Software Engineer - Maersk Digital at Maersk (Copenhagen, Denmark)"	"python, go, amazon-web-services, docker"	"https://stackoverflow.com/jobs/204858/software-engineer-maersk-digital-maersk?a=16HApfKbke9a"	"204858"	"21.07.2019"	"1563973369"
"04.07.2019"	"France"	"Marseille"	"BuyCo"	"Backend Software Engineer at BuyCo (Marseille, France)"	"ruby, rails, go, python, postgresql"	"https://stackoverflow.com/jobs/279172/backend-software-engineer-buyco?a=1vCMVeym0OS4"	"279172"	"04.07.2019"	"1563973369"
"28.06.2019"	"France"	"Paris"	"Adevinta"	"Backend Engineers (Global Projects) at Adevinta (Paris, France)"	"go, java, scala, amazon-web-services, python"	"https://stackoverflow.com/jobs/271025/backend-engineers-global-projects-adevinta?a=1sTo9hUWjdoQ"	"271025"	"28.06.2019"	"1563973369"
"28.06.2019"	"France"	"Paris"	"Adevinta"	"Backend Engineer -- Search Team at Adevinta (Paris, France)"	"go, elasticsearch, amazon-web-services, java, docker"	"https://stackoverflow.com/jobs/271043/backend-engineer-search-team-adevinta?a=1sTLlZmD2hTa"	"271043"	"28.06.2019"	"1563973369"
"23.07.2019"	"France"	"Paris"	"Back Market"	"Senior Back-End Engineer at Back Market (Paris, France)"	"python, go, automated-tests, django"	"https://stackoverflow.com/jobs/283829/senior-back-end-engineer-back-market?a=1xbCx5B9qICY"	"283829"	"23.07.2019"	"1563973369"
"24.06.2019"	"France"	"Paris"	"Google"	"Software Engineer, Image Compression at Google (Paris, France)"	"c++, linux, c, go"	"https://stackoverflow.com/jobs/266930/software-engineer-image-compression-google?a=1rwf2ROEVf8s"	"266930"	"24.06.2019"	"1563973369"
"04.07.2019"	"France"	"Paris"	"KatchMe"	"Développeur Backend (Go) - Streaming Vidéo @ Molotov at KatchMe (Paris, France)"	"go, redis, cassandra"	"https://stackoverflow.com/jobs/272448/d%C3%A9veloppeur-backend-go-streaming-vid%C3%A9o-katchme?a=1tmYCzIV76Cs"	"272448"	"04.07.2019"	"1563973369"
"21.07.2019"	"France"	"Paris"	"THALES"	"Dévelopeur Back-End (H/F) at THALES (Paris, France)"	"sql, nosql, docker, go, java"	"https://stackoverflow.com/jobs/269512/d%C3%A9velopeur-back-end-h-f-thales?a=1snVEuSvRXJC"	"269512"	"21.07.2019"	"1563973369"
"21.07.2019"	"France"	"Paris"	"THALES"	"Développeur Full Stack / Tech Lead (H/F) at THALES (Paris, France)"	"go, java, python, docker, git"	"https://stackoverflow.com/jobs/269514/d%C3%A9veloppeur-full-stack-tech-lead-h-f-thales?a=1snYelVACiTS"	"269514"	"21.07.2019"	"1563973369"
"24.06.2019"	"Germany"	"Berlin"	"AUTO1"	"Site Reliability Engineer - SRE (d/f/m) at AUTO1 (Berlin, Germany)"	"go, java, sre, continuous-integration, continuous-deployment"	"https://stackoverflow.com/jobs/276299/site-reliability-engineer-sre-d-f-m-auto1?a=1uF3aBLRjqHm"	"276299"	"24.06.2019"	"1563973369"
"14.07.2019"	"Germany"	"Berlin"	"AUTO1"	"Principal Golang Engineer (d/f/m) at AUTO1 (Berlin, Germany)"	"go"	"https://stackoverflow.com/jobs/230122/principal-golang-engineer-d-f-m-auto1?a=1faTHGzr0w92"	"230122"	"14.07.2019"	"1563973369"
"13.07.2019"	"Germany"	"Berlin"	"Babbel (Lesson Nine GmbH)"	"Senior Backend Engineer Ruby on Rails or Node.JS at Babbel (Lesson Nine GmbH) (Berlin, Germany)"	"ruby-on-rails, ruby, node.js, go, amazon-web-services"	"https://stackoverflow.com/jobs/238747/senior-backend-engineer-ruby-on-rails-or-nodejs-babbel-lesson-nine-gmbh?a=1i4eH849lI9W"	"238747"	"13.07.2019"	"1563973369"
"22.07.2019"	"Germany"	"Berlin"	"Container Solutions"	"Cloud Native Engineer - Berlin at Container Solutions (Berlin, Germany)"	"docker, kubernetes, go, python, cloud"	"https://stackoverflow.com/jobs/174636/cloud-native-engineer-berlin-container-solutions?a=WzbsGU6JEZy"	"174636"	"22.07.2019"	"1563973369"
"24.07.2019"	"Germany"	"Berlin"	"D4L data4life gGmbH"	"Sr. Security Engineer for our Data Platform (f/m/x) at D4L data4life gGmbH (Berlin, Deutschland)"	"go, java, node.js, scala, postgresql"	"https://stackoverflow.com/jobs/276181/sr-security-engineer-for-our-data-platform-f-m-d4l-data4life-ggmbh?a=1uCB37QldhW8"	"276181"	"24.07.2019"	"1563973369"
"22.07.2019"	"Germany"	"Berlin"	"Delivery Hero SE"	"Senior Go/Python Backend Engineer - Groceries (f/m/d) at Delivery Hero SE (Berlin, Germany)"	"python, go, php, mysql, postgresql"	"https://stackoverflow.com/jobs/283428/senior-go-python-backend-engineer-groceries-f-delivery-hero-se?a=1x3hA29izgXe"	"283428"	"22.07.2019"	"1563973369"
"19.07.2019"	"Germany"	"Berlin"	"Gnosis Service GmbH"	"RUST Developer (m/w/d) at Gnosis Service GmbH (Berlin, Germany)"	"java, web-services, c++, rust, go"	"https://stackoverflow.com/jobs/282822/rust-developer-m-w-d-gnosis-service-gmbh?a=1wQGlM765PP2"	"282822"	"19.07.2019"	"1563973369"
"20.07.2019"	"Germany"	"Berlin"	"IDAGIO"	"Backend & API Engineer at IDAGIO (Berlin, Germany)"	"api, python, node.js, go, ruby"	"https://stackoverflow.com/jobs/269106/backend-api-engineer-idagio?a=1sfufNNY8F9e"	"269106"	"20.07.2019"	"1563973369"
"18.07.2019"	"Germany"	"Berlin"	"MEDWING GmbH"	"Senior Ruby On Rails Fullstack Developer (m/f) at MEDWING GmbH (Berlin, Deutschland)"	"ruby-on-rails, reactjs, go, aws-lambda"	"https://stackoverflow.com/jobs/237504/senior-ruby-on-rails-fullstack-developer-m-f-medwing-gmbh?a=1hEogQJ3OxPy"	"237504"	"18.07.2019"	"1563973369"
"13.07.2019"	"Germany"	"Berlin"	"McKinsey & Company"	"Backend Developer/Architect - McKinsey Digital at McKinsey & Company (Berlin, Germany)"	"ruby, go, node.js, java, amazon-web-services"	"https://stackoverflow.com/jobs/273732/backend-developer-architect-mckinsey-digital-mckinsey-company?a=1tNFTTA4YgQ8"	"273732"	"13.07.2019"	"1563973369"
"17.07.2019"	"Germany"	"Berlin"	"Omio"	"Senior Software Engineer (Backend) / Routing Team / Berlin at Omio (Berlin, Germany)"	"java, go, kubernetes, google-cloud-platform, docker"	"https://stackoverflow.com/jobs/275100/senior-software-engineer-backend-routing-team-omio?a=1ug7t9wsdM0E"	"275100"	"17.07.2019"	"1563973369"
"12.07.2019"	"Germany"	"Berlin"	"Onefootball GmbH"	"Senior Backend Engineer at Onefootball GmbH (Berlin, Germany)"	"go, mysql, postgresql, redis"	"https://stackoverflow.com/jobs/173626/senior-backend-engineer-onefootball-gmbh?a=WebpAQrhgre"	"173626"	"12.07.2019"	"1563973369"
"15.07.2019"	"Germany"	"Berlin"	"Opinary"	"Lead Product Owner @ Berlin based Adtech Startup at Opinary (Berlin, Germany)"	"go, python, numpy, reactjs, redux"	"https://stackoverflow.com/jobs/255555/lead-product-owner-berlin-based-adtech-startup-opinary?a=1nHIRV5EQECI"	"255555"	"15.07.2019"	"1563973369"
"29.06.2019"	"Germany"	"Berlin"	"Tourlane GmbH"	"Backend Developer - Ruby (x/m/f) for travel startup at Tourlane GmbH (Berlin, Deutschland)"	"amazon-web-services, ruby, node.js, go, postgresql"	"https://stackoverflow.com/jobs/207096/backend-developer-ruby-x-m-f-for-travel-tourlane-gmbh?a=17s7xIgRIehW"	"207096"	"29.06.2019"	"1563973369"
"09.07.2019"	"Germany"	"Berlin"	"YARA GmbH  & Co. KG - Digital Farming Lab Berlin"	"Backend Developer (f/m/d) at YARA GmbH  & Co. KG - Digital Farming Lab Berlin (Berlin, Deutschland)"	"postgresql, java, amazon-web-services, go, nosql"	"https://stackoverflow.com/jobs/266603/backend-developer-f-m-d-yara-gmbh-co-kg-digital?a=1rprutcDIqAg"	"266603"	"09.07.2019"	"1563973369"
"16.07.2019"	"Germany"	"Berlin"	"ZF Car eWallet GmbH"	"Backend Software Developer (Java) (m/f/d) - Car eWallet platform at ZF Car eWallet GmbH (Berlin, Germany)"	"java, go, spring-boot, blockchain, microservices"	"https://stackoverflow.com/jobs/281972/backend-software-developer-java-m-f-d-car-zf-car-ewallet-gmbh?a=1wz0z81yqKvm"	"281972"	"16.07.2019"	"1563973369"
"16.07.2019"	"Germany"	"Berlin"	"ZF Car eWallet GmbH"	"Senior Backend Software Developer (Java) (m/f/d) - Car eWallet platform at ZF Car eWallet GmbH (Berlin, Germany)"	"java, go, spring-boot, blockchain, microservices"	"https://stackoverflow.com/jobs/281974/senior-backend-software-developer-java-m-f-d-zf-car-ewallet-gmbh?a=1wz38Z4Db5FC"	"281974"	"16.07.2019"	"1563973369"
"09.07.2019"	"Germany"	"Berlin"	"Zalando SE"	"Senior Software Developer (Java) - Content Creation ROPs at Zalando SE (Berlin, Germany)"	"java, go, reactjs, javascript, amazon-web-services"	"https://stackoverflow.com/jobs/260766/senior-software-developer-java-content-zalando-se?a=1ps4FMSFj7d6"	"260766"	"09.07.2019"	"1563973369"
"19.07.2019"	"Germany"	"Berlin"	"Zalando SE"	"Tech Lead - Retail Platform (Go) - Design & build mission-critical applications at Zalando SE (Berlin, Germany)"	"go, postgresql, kubernetes, agile, amazon-web-services"	"https://stackoverflow.com/jobs/247454/tech-lead-retail-platform-go-design-build-zalando-se?a=1kZhoEB0kTXq"	"247454"	"19.07.2019"	"1563973369"
"20.07.2019"	"Germany"	"Berlin"	"Zalando SE"	"Fullstack Engineer (Go+JavaScript) at Zalando SE (Berlin, Germany)"	"amazon-web-services, cloud, web-services, go, javascript"	"https://stackoverflow.com/jobs/269109/fullstack-engineer-go-plusjavascript-zalando-se?a=1sfy7AnAgaTC"	"269109"	"20.07.2019"	"1563973369"
"21.07.2019"	"Germany"	"Berlin"	"Zalando SE"	"Backend Engineer (Golang) - Zalando Lounge at Zalando SE (Berlin, Germany)"	"amazon-web-services, kubernetes, postgresql, go, python"	"https://stackoverflow.com/jobs/269479/backend-engineer-golang-zalando-lounge-zalando-se?a=1snf6SyKxkvm"	"269479"	"21.07.2019"	"1563973369"
"23.07.2019"	"Germany"	"Berlin"	"Zalando SE"	"Backend Engineer - API Development (Go) - Design & develop next-generation tools at Zalando SE (Berlin, Germany)"	"go, amazon-web-services, api, backend"	"https://stackoverflow.com/jobs/194864/backend-engineer-api-development-go-design-zalando-se?a=13lMyCMymmnC"	"194864"	"23.07.2019"	"1563973369"
"18.07.2019"	"Germany"	"Berlin"	"Zattoo"	"Software Engineer (Golang) at Zattoo (Berlin, Germany)"	"go, python, ruby, cassandra, kubernetes"	"https://stackoverflow.com/jobs/282182/software-engineer-golang-zattoo?a=1wDnhYeAUASs"	"282182"	"18.07.2019"	"1563973369"
"20.07.2019"	"Germany"	"Berlin"	"enersis"	"Senior Full-Stack Developer (f/m) at enersis (Berlin, Deutschland)"	"angular, typescript, sql, go, node.js"	"https://stackoverflow.com/jobs/254451/senior-full-stack-developer-f-m-enersis?a=1nkLDBHogdig"	"254451"	"20.07.2019"	"1563973369"
"07.07.2019"	"Germany"	"Berlin"	"fromAtoB"	"DevOps Engineer (f/m/d) at fromAtoB (Berlin, Germany)"	"go, kubernetes, ruby, python, prometheus"	"https://stackoverflow.com/jobs/265376/devops-engineer-f-m-d-fromatob?a=1qZVH2ga9ZzW"	"265376"	"07.07.2019"	"1563973369"
"29.06.2019"	"Germany"	"Berlin"	"i2x GmbH"	"Senior Software Python/C++ Engineer - Backend, (m/f/d) at i2x GmbH (Berlin, Germany)"	"python, api, sql, c++, go"	"https://stackoverflow.com/jobs/262516/senior-software-python-c-plus-plus-engineer-backend-m-i2x-gmbh?a=1q2sHtiFjOYU"	"262516"	"29.06.2019"	"1563973369"
"23.07.2019"	"Germany"	"Berlin"	"relayr GmbH"	"Full Stack Solution Engineer (m/f) at relayr GmbH (Berlin, Germany)"	"javascript, reactjs, python, go, node.js"	"https://stackoverflow.com/jobs/170635/full-stack-solution-engineer-m-f-relayr-gmbh?a=VdZxu8qtJvi"	"170635"	"23.07.2019"	"1563973369"
"10.07.2019"	"Germany"	"Berlin"	"simplesurance GmbH"	"Remote Golang/ Fullstack Software Engineer (f/m/d) at simplesurance GmbH (Berlin, Germany) (allows remote)"	"go, grpc, microservices, php, react"	"https://stackoverflow.com/jobs/156200/remote-golang-fullstack-software-engineer-f-m-d-simplesurance-gmbh?a=QnQxpugOPQI"	"156200"	"10.07.2019"	"1563973369"
"10.07.2019"	"Germany"	"Berlin"	"simplesurance GmbH"	"Language-agnostic Software Engineer (f/m) at simplesurance GmbH (Berlin, Germany)"	"go, php, python, aws, docker"	"https://stackoverflow.com/jobs/133651/language-agnostic-software-engineer-f-m-simplesurance-gmbh?a=IOZj0wsMXXa"	"133651"	"10.07.2019"	"1563973369"
"14.07.2019"	"Germany"	"Berlin"	"simplesurance GmbH"	"Go/ Golang Software Engineer (f/m/d) at simplesurance GmbH (Berlin, Germany)"	"go, grpc, microservices, protobuf, golang"	"https://stackoverflow.com/jobs/168385/go-golang-software-engineer-f-m-d-simplesurance-gmbh?a=UtcVTjhBGmY"	"168385"	"14.07.2019"	"1563973369"
"10.07.2019"	"Germany"	"Berlin"	"solarisBank AG"	"(Junior-Senior) Golang Engineer (f/m/div) at solarisBank AG at solarisBank AG (Berlin, Germany)"	"docker, microservices, grape, amazon-web-services, go"	"https://stackoverflow.com/jobs/273253/junior-senior-golang-engineer-f-m-div-at-solarisbank-ag?a=1tDIotceXvIk"	"273253"	"10.07.2019"	"1563973369"
"28.06.2019"	"Germany"	"Braunschweig"	"Cloudogu GmbH"	"Agiler Softwareentwickler (m/w/d) at Cloudogu GmbH (Braunschweig, Deutschland)"	"java, go, docker, javascript, git"	"https://stackoverflow.com/jobs/206272/agiler-softwareentwickler-m-w-d-cloudogu-gmbh?a=17aZhbPjLA7C"	"206272"	"28.06.2019"	"1563973369"
"25.06.2019"	"Germany"	"Düsseldorf"	"naontek AG"	"Full-stack Engineer at naontek AG (Düsseldorf, Germany)"	"go, vue.js, javascript, amazon-web-services, aws-lambda"	"https://stackoverflow.com/jobs/269488/full-stack-engineer-naontek-ag?a=1snqIehATRKw"	"269488"	"25.06.2019"	"1563973369"
"26.06.2019"	"Germany"	"Erfurt"	"NTT DATA Deutschland GmbH"	"Junior Softwareentwickler (m/w/d) in Erfurt at NTT DATA Deutschland GmbH (Erfurt, Deutschland)"	"python, docker, kubernetes, go, java"	"https://stackoverflow.com/jobs/270468/junior-softwareentwickler-m-w-d-in-erfurt-ntt-data-deutschland-gmbh?a=1sHO5uB798OY"	"270468"	"26.06.2019"	"1563973369"
"15.07.2019"	"Germany"	"Frankfurt am Main"	"Drooms GmbH"	"Senior Backend Developer (f/m/d) at the leading provider of data rooms in Europe at Drooms GmbH (Frankfurt am Main, Deutschland)"	"go, ruby, redis, python, kotlin"	"https://stackoverflow.com/jobs/255726/senior-backend-developer-f-m-d-at-the-leading-drooms-gmbh?a=1nLhjzPHKQgM"	"255726"	"15.07.2019"	"1563973369"
"26.06.2019"	"Germany"	"Hamburg"	"AppLike GmbH - Part of Gruner+Jahr"	"Tech Lead Backend Development (f/m/d) at AppLike! at AppLike GmbH - Part of Gruner+Jahr (Hamburg, Deutschland)"	"go, php, mysql, docker, amazon-web-services"	"https://stackoverflow.com/jobs/242488/tech-lead-backend-development-f-m-d-at-applike-applike-gmbh-part-of?a=1jk1r6nSrg8E"	"242488"	"26.06.2019"	"1563973369"
"14.07.2019"	"Germany"	"Hamburg"	"Cybus GmbH"	"Senior Node.js Developer at Cybus GmbH (Hamburg, Deutschland)"	"node.js, docker, mqtt, c++, go"	"https://stackoverflow.com/jobs/239417/senior-nodejs-developer-cybus-gmbh?a=1iiaqLGNK4Ao"	"239417"	"14.07.2019"	"1563973369"
"04.07.2019"	"Germany"	"Hamburg"	"Engel & Volkers Technology GmbH"	"Backend Software Engineer (m/w/d) in PropTech at Engel & Volkers Technology GmbH (Hamburg, Germany)"	"java, go, kubernetes, docker, node.js"	"https://stackoverflow.com/jobs/272492/backend-software-engineer-m-w-d-in-proptech-engel-v%C3%B6lkers-technology?a=1tnTloOByCg8"	"272492"	"04.07.2019"	"1563973369"
"18.07.2019"	"Germany"	"Hamburg"	"Engel & Volkers Technology GmbH"	"Node.js Software Engineer (m/w/d) in PropTech at Engel & Volkers Technology GmbH (Hamburg, Germany)"	"node.js, reactjs, go, koa2, express"	"https://stackoverflow.com/jobs/282683/nodejs-software-engineer-m-w-d-in-proptech-engel-v%C3%B6lkers-technology?a=1wNN9Oah96P6"	"282683"	"18.07.2019"	"1563973369"
"02.07.2019"	"Germany"	"Hamburg"	"FREE NOW"	"Platform Developer (Go) (m/f/d) wanted for leading e-hailing app in Europe at FREE NOW (Hamburg, Germany)"	"go, amazon-web-services, python, google-compute-engine, azure"	"https://stackoverflow.com/jobs/277387/platform-developer-go-m-f-d-wanted-for-free-now?a=1v1FM4LvV8HK"	"277387"	"02.07.2019"	"1563973369"
"18.07.2019"	"Germany"	"Hamburg"	"Hoppe Marine GmbH"	"Softwareentwickler/-in für Backend-Entwicklung at Hoppe Marine GmbH (Hamburg, Germany)"	"go, embedded-linux, docker, rabbitmq, python-3.x"	"https://stackoverflow.com/jobs/282646/softwareentwickler-in-f%C3%BCr-backend-entwicklung-hoppe-marine-gmbh?a=1wN1stKmjNgk"	"282646"	"18.07.2019"	"1563973369"
"01.07.2019"	"Germany"	"Hamburg"	"Jimdo GmbH"	"Software Engineer - Cloud Infrastructure at Jimdo GmbH (Hamburg, Deutschland)"	"amazon-web-services, go, postgresql, java"	"https://stackoverflow.com/jobs/263275/software-engineer-cloud-infrastructure-jimdo-gmbh?a=1qifaGDdYngQ"	"263275"	"01.07.2019"	"1563973369"
"30.06.2019"	"Germany"	"Hamburg"	"Just Software AG"	"Software EntwicklerIn Full Stack - Java 8, React, Go - Hamburg - #loveyourwork at Just Software AG (Hamburg, Deutschland)"	"java, reactjs, microservices, go, angularjs"	"https://stackoverflow.com/jobs/265437/software-entwicklerin-full-stack-java-8-react-just-software-ag?a=1r1ckDgZXp7O"	"265437"	"30.06.2019"	"1563973369"
"26.06.2019"	"Germany"	"Hamburg"	"MOIA GmbH"	"Cloud Native Developer (m/f/d) for our Passenger Teams at MOIA GmbH (Hamburg, Deutschland)"	"amazon-web-services, web-services, go, kotlin, java"	"https://stackoverflow.com/jobs/270515/cloud-native-developer-m-f-d-for-our-passenger-moia-gmbh?a=1sIMG6gpIad2"	"270515"	"26.06.2019"	"1563973369"
"09.07.2019"	"Germany"	"Hamburg"	"Smaato"	"Senior Cloud Engineer (m/w/d) Python Go Rust at Smaato (Hamburg, Germany)"	"python, sysadmin, kubernetes, go, amazon-web-services"	"https://stackoverflow.com/jobs/248176/senior-cloud-engineer-m-w-d-python-go-rust-smaato?a=1leiaxvEa8GA"	"248176"	"09.07.2019"	"1563973369"
"29.06.2019"	"Germany"	"Hamburg"	"Taxdoo GmbH"	"Fullstack Developer for VC-backed RegTech Startup at Taxdoo GmbH (Hamburg, Deutschland)"	"javascript, java, amazon-web-services, go, node.js"	"https://stackoverflow.com/jobs/271779/fullstack-developer-for-vc-backed-regtech-startup-taxdoo-gmbh?a=1t94aRCO5UM8"	"271779"	"29.06.2019"	"1563973369"
"12.07.2019"	"Germany"	"Hamburg"	"freiheit.com technologies gmbh"	"Hackers wanted - Software Engineers (m/f/d) & Machine Learning Experts (m/f/d) at freiheit.com technologies gmbh (Hamburg, Deutschland)"	"java, javascript, reactjs, clojure, go"	"https://stackoverflow.com/jobs/165266/hackers-wanted-software-engineers-m-f-d-freiheitcom-technologies-gmbh?a=Tqm31qmYiQw"	"165266"	"12.07.2019"	"1563973369"
"12.07.2019"	"Germany"	"Hamburg"	"freiheit.com technologies gmbh"	"Hackers wanted-Looking for a Senior Developer (m/f/d) with Team Lead Experience! at freiheit.com technologies gmbh (Hamburg, Deutschland)"	"java, javascript, kotlin, go, clojure"	"https://stackoverflow.com/jobs/91520/hackers-wanted-looking-for-a-senior-developer-m-freiheitcom-technologies-gmbh?a=uGXM2HWyF6U"	"91520"	"12.07.2019"	"1563973369"
"13.07.2019"	"Germany"	"Hamburg"	"inovex GmbH"	"Senior Software-Entwickler (m/w/d) - Java, .NET, Typescript at inovex GmbH (Hamburg, Deutschland)"	"java, .net, typescript, go, kotlin"	"https://stackoverflow.com/jobs/238679/senior-software-entwickler-m-w-d-java-net-inovex-gmbh?a=1i2P22nxW6xa"	"238679"	"13.07.2019"	"1563973369"
"13.07.2019"	"Germany"	"Hamburg"	"inovex GmbH"	"Fullstack-Entwickler (m/w/d) - Java, .Net, JavaScript, Go, Kotlin, Clojure at inovex GmbH (Hamburg, Deutschland)"	"go, java, javascript, kotlin, .net"	"https://stackoverflow.com/jobs/238684/fullstack-entwickler-m-w-d-java-net-inovex-gmbh?a=1i2VtG0eNXrO"	"238684"	"13.07.2019"	"1563973369"
"05.07.2019"	"Germany"	"Hannover"	"enercity AG"	"fmt.Println - Backend-Entwickler - Digitale Vertriebsplattform at enercity AG (Hannover, Deutschland)"	"sql, node.js, go, git, rest"	"https://stackoverflow.com/jobs/244451/fmtprintln-backend-entwickler-digitale-enercity-ag?a=1jYQ3pAx3k1W"	"244451"	"05.07.2019"	"1563973369"
"20.07.2019"	"Germany"	"Herford"	"Cliplister GmbH"	"Senior Backend Developer  Digital Asset Management Platform at Cliplister GmbH (Herford, Deutschland)"	"java, go, php, zend-framework, postgresql"	"https://stackoverflow.com/jobs/240787/senior-backend-developer-digital-asset-cliplister-gmbh?a=1iKEzSGfJUVa"	"240787"	"20.07.2019"	"1563973369"
"20.07.2019"	"Germany"	"Herford"	"Cliplister GmbH"	"Intern, Backend Developer  Digital Asset Management Platform at Cliplister GmbH (Herford, Germany)"	"java, php, go"	"https://stackoverflow.com/jobs/240796/intern-backend-developer-digital-asset-cliplister-gmbh?a=1iKQbep66sak"	"240796"	"20.07.2019"	"1563973369"
"13.07.2019"	"Germany"	"Herzogenaurach"	"adidas AG"	"(Senior) Devops Engineer (m/f) with Kubernetes/Golang at adidas AG (Herzogenaurach, Germany)"	"devops, docker, kubernetes, golang, container"	"https://stackoverflow.com/jobs/205386/senior-devops-engineer-m-f-with-kubernetes-adidas-ag?a=16Sz58QoElPi"	"205386"	"13.07.2019"	"1563973369"
"21.07.2019"	"Germany"	"Köln"	"real.digital"	"Mid / Senior Software Engineer (f/m/d)  Rudolfplatz/Cologne at real.digital (Köln, Deutschland)"	"php, go, javascript, mysql, vue.js"	"https://stackoverflow.com/jobs/275846/mid-senior-software-engineer-f-m-d-realdigital?a=1uvDbj2116IU"	"275846"	"21.07.2019"	"1563973369"
"08.07.2019"	"Germany"	"Leipzig"	"InVision AG"	"Software Engineer at InVision AG (Leipzig, Deutschland)"	"javascript, python, ruby, go, typescript"	"https://stackoverflow.com/jobs/253799/software-engineer-invision-ag?a=1n7d6FwqAVm8"	"253799"	"08.07.2019"	"1563973369"
"30.06.2019"	"Germany"	"Munich"	"Google"	"Software Engineering Manager at Google (Munich, Germany)"	"c++, c, go"	"https://stackoverflow.com/jobs/235353/software-engineering-manager-google?a=1gVFi6RcWoo0"	"235353"	"30.06.2019"	"1563973369"
"06.07.2019"	"Germany"	"Munich"	"Google"	"Systems Engineer, Site Reliability Engineering at Google (Munich, Germany)"	"go, c, c++, linux, kubernetes"	"https://stackoverflow.com/jobs/245318/systems-engineer-site-reliability-engineering-google?a=1kgRKPBe4jfO"	"245318"	"06.07.2019"	"1563973369"
"12.07.2019"	"Germany"	"Munich"	"Google"	"Software Engineer at Google (Munich, Germany)"	"c, c++, go"	"https://stackoverflow.com/jobs/231871/software-engineer-google?a=1fLgrrsTE3kI"	"231871"	"12.07.2019"	"1563973369"
"15.07.2019"	"Germany"	"Munich"	"Google"	"Software Engineer, Site Reliability Engineering, University Graduate, 2019 at Google (Munich, Germany)"	"c, c++, go, linux, kubernetes"	"https://stackoverflow.com/jobs/246414/software-engineer-site-reliability-engineering-google?a=1kDEFINbFnVe"	"246414"	"15.07.2019"	"1563973369"
"21.07.2019"	"Germany"	"Munich"	"Google"	"Software Engineer, Site Reliability Engineering at Google (Munich, Germany)"	"c, c++, go, linux, kubernetes"	"https://stackoverflow.com/jobs/245319/software-engineer-site-reliability-engineering-google?a=1kgT2L7LrtPW"	"245319"	"21.07.2019"	"1563973369"
"22.07.2019"	"Germany"	"München"	"KI labs GmbH"	"Backend Engineering Lead [greenfield product development] at KI labs GmbH (München, Germany)"	"cloud, python, go, javascript, django"	"https://stackoverflow.com/jobs/250205/backend-engineering-lead-greenfield-product-ki-labs-gmbh?a=1lUtS5lPrt2o"	"250205"	"22.07.2019"	"1563973369"
"26.06.2019"	"Germany"	"München"	"NTT DATA Deutschland GmbH"	"Developer (m/w/d) Cloud (AWS, Azure, Openshift, ...) at NTT DATA Deutschland GmbH (München, Deutschland)"	"java, docker, kubernetes, go, linux"	"https://stackoverflow.com/jobs/270467/developer-m-w-d-cloud-aws-azure-openshift-ntt-data-deutschland-gmbh?a=1sHMNz4zLYeQ"	"270467"	"26.06.2019"	"1563973369"
"14.07.2019"	"Germany"	"München"	"Personio"	"Senior Backend Engineer (m/w/d) at Personio (München, Germany)"	"docker, java, kotlin, golang, kubernetes"	"https://stackoverflow.com/jobs/273941/senior-backend-engineer-m-w-d-personio?a=1tS1kOgA4WD6"	"273941"	"14.07.2019"	"1563973369"
"08.07.2019"	"Germany"	"München"	"Sixt SE"	"GO DEVELOPER (M/F/D) / AWS / microservices / Docker / Kafka at Sixt SE (München, Deutschland)"	"go, apache-kafka, microservices, amazon-web-services, docker"	"https://stackoverflow.com/jobs/265118/go-developer-m-f-d-aws-microservices-sixt-se?a=1qUz5ERhJXeE"	"265118"	"08.07.2019"	"1563973369"
"21.07.2019"	"Germany"	"München"	"eGym GmbH"	"Team Lead Site Reliability Engineering (m/w/d) at eGym GmbH (München, Deutschland)"	"go, java, linux"	"https://stackoverflow.com/jobs/275851/team-lead-site-reliability-engineering-m-w-d-egym-gmbh?a=1uvJCWEHSXDy"	"275851"	"21.07.2019"	"1563973369"
"27.06.2019"	"Germany"	"Stuttgart"	"alfatraining Bildungszentrum GmbH"	"Cloud Infrastructure Engineer at alfatraining Bildungszentrum GmbH (Stuttgart, Germany)"	"docker, kubernetes, go, microservices, terraform"	"https://stackoverflow.com/jobs/271011/cloud-infrastructure-engineer-alfatraining-bildungszentrum?a=1sT66izp4Pf2"	"271011"	"27.06.2019"	"1563973369"
"12.07.2019"	"Germany"	"Stuttgart"	"alfatraining Bildungszentrum GmbH"	"Senior Backend Engineer at alfatraining Bildungszentrum GmbH (Stuttgart, Germany)"	"go, microservices, docker, kubernetes, grpc"	"https://stackoverflow.com/jobs/267100/senior-backend-engineer-alfatraining-bildungszentrum?a=1rzMcB2asgco"	"267100"	"12.07.2019"	"1563973369"
"05.07.2019"	"Germany"	"Unterföhring"	"Hetzner Cloud GmbH"	"Softwareentwickler (m/w/d) Backend Python/Go at Hetzner Cloud GmbH (Unterföhring, Deutschland)"	"python, go, docker, kubernetes"	"https://stackoverflow.com/jobs/272624/softwareentwickler-m-w-d-backend-python-go-hetzner-cloud-gmbh?a=1tqDvS5ET9ba"	"272624"	"05.07.2019"	"1563973369"
"18.07.2019"	"Germany"	"Unterföhring"	"Hetzner Cloud GmbH"	"Senior Softwareentwickler (m/w/d) Backend Python/Go at Hetzner Cloud GmbH (Unterföhring, Deutschland)"	"python, go, kubernetes, docker"	"https://stackoverflow.com/jobs/224168/senior-softwareentwickler-m-w-d-backend-python-hetzner-cloud-gmbh?a=1db63rQtSeAM"	"224168"	"18.07.2019"	"1563973369"
"14.07.2019"	"Hong Kong"	"Hong Kong Island"	"Chengbao"	"Engineering Manager  Cross-platform development at Chengbao (Hong Kong Island, Hong Kong)"	"c++, go, desktop-application, mobile"	"https://stackoverflow.com/jobs/273862/engineering-manager-cross-platform-development-chengbao?a=1tQnuvO3ysAU"	"273862"	"14.07.2019"	"1563973369"
"10.07.2019"	"Hong Kong"	"Kowloon"	"Lalamove"	"Senior Software Engineer - Backend (PHP/Node.js/Golang) at Lalamove (Kowloon, Hong Kong)"	"javascript, node.js, go, php"	"https://stackoverflow.com/jobs/200308/senior-software-engineer-backend-php-nodejs-lalamove?a=15aYJFQYTAK4"	"200308"	"10.07.2019"	"1563973369"
"27.06.2019"	"Indonesia"	"Jakarta"	"Grab"	"Senior Backend Engineer (Jakarta, Lippo) at Grab (Jakarta, Indonesia)"	"data-structures, algorithm, go, distributed-system, microservices"	"https://stackoverflow.com/jobs/270684/senior-backend-engineer-jakarta-lippo-grab?a=1sMixTXnS0GQ"	"270684"	"27.06.2019"	"1563973369"
"10.07.2019"	"Indonesia"	"Palmerah"	"Traveloka"	"Engineering Lead at Traveloka (Palmerah, Indonesia)"	"java, .net, c#, go, amazon-web-services"	"https://stackoverflow.com/jobs/207877/engineering-lead-traveloka?a=17Imnl9gAxoI"	"207877"	"10.07.2019"	"1563973369"
"24.06.2019"	"Ireland"	"Dublin"	"Google"	"Software Engineer, Site Reliability Engineering, University Graduate, 2019 at Google (Dublin, Ireland)"	"c, c++, go, linux, kubernetes"	"https://stackoverflow.com/jobs/246009/software-engineer-site-reliability-engineering-google?a=1kveyXfbjfUY"	"246009"	"24.06.2019"	"1563973369"
"18.07.2019"	"Ireland"	"Dublin"	"Google"	"Software Engineering Manager at Google (Dublin, Ireland)"	"linux, c, go, c++"	"https://stackoverflow.com/jobs/266859/software-engineering-manager-google?a=1ruLvZyro7Li"	"266859"	"18.07.2019"	"1563973369"
"19.07.2019"	"Ireland"	"Dublin"	"Google"	"Software Engineer, Site Reliability Engineering at Google (Dublin, Ireland)"	"c, c++, go, linux, kubernetes"	"https://stackoverflow.com/jobs/266875/software-engineer-site-reliability-engineering-google?a=1rv68PX3mR5m"	"266875"	"19.07.2019"	"1563973369"
"20.07.2019"	"Ireland"	"Dublin"	"Google"	"Systems Engineer, Site Reliability Engineering at Google (Dublin, Ireland)"	"c, c++, go, linux, kubernetes"	"https://stackoverflow.com/jobs/248079/systems-engineer-site-reliability-engineering-google?a=1lch7xBqUAa4"	"248079"	"20.07.2019"	"1563973369"
"24.07.2019"	"Japan"	"Minato City"	"MANPOWERGROUP Sp. z o. o."	"Backend Developer (PHP & Go)_International Relocation to Tokyo, Japan at MANPOWERGROUP Sp. z o. o. (Minato City, Japan)"	"go, php, javascript, web-applications, backend"	"https://stackoverflow.com/jobs/284081/backend-developer-php-go-international-manpowergroup-sp-z-o-o?a=1xgRoTQNBJtu"	"284081"	"24.07.2019"	"1563973369"
"16.07.2019"	"Japan"	"Tokyo"	"Mercari"	"Software Engineer, Backend at Mercari (Tokyo, Japan)"	"go, microservices, kubernetes, grpc"	"https://stackoverflow.com/jobs/230858/software-engineer-backend-mercari?a=1fqcwyPC4920"	"230858"	"16.07.2019"	"1563973369"
"09.07.2019"	"Luxembourg"	"Esch-sur-Alzette"	"Tadaweb"	"Qt Frontend Engineer at Tadaweb (Esch-sur-Alzette, Luxembourg)"	"qt, go, qml, c++, gtk"	"https://stackoverflow.com/jobs/263955/qt-frontend-engineer-tadaweb?a=1qwnNBvg6rwA"	"263955"	"09.07.2019"	"1563973369"
"17.07.2019"	"Luxembourg"	"Esch-sur-Alzette"	"Tadaweb"	"Senior Software Engineer at Tadaweb (Esch-sur-Alzette, Luxembourg)"	"c++, mongodb, go, rest, nosql"	"https://stackoverflow.com/jobs/282304/senior-software-engineer-tadaweb?a=1wFUzaggvpYc"	"282304"	"17.07.2019"	"1563973369"
"17.07.2019"	"Luxembourg"	"Luxembourg City"	"Numbrs"	"Security Engineer - Luxembourg at Numbrs (Luxembourg City, Luxembourg)"	"security, cryptography, go, python, kubernetes, sysadmin"	"https://stackoverflow.com/jobs/247819/security-engineer-luxembourg-numbrs?a=1l6RWj9tKcEw"	"247819"	"17.07.2019"	"1563973369"
"21.07.2019"	"Luxembourg"	"Luxembourg City"	"Numbrs"	"Site Reliability Engineer - Luxembourg at Numbrs (Luxembourg City, Luxembourg)"	"go, kubernetes, amazon-web-services, docker, devops, sysadmin"	"https://stackoverflow.com/jobs/165191/site-reliability-engineer-luxembourg-numbrs?a=ToNmr3ZWv8Q"	"165191"	"21.07.2019"	"1563973369"
"01.07.2019"	"Malaysia"	"Kuala Lumpur"	"iflix"	"Back end engineers -  Malaysia - Changing the face of entertainment at iflix (Kuala Lumpur, Malaysia)"	"node.js, amazon-web-services, javascript, go"	"https://stackoverflow.com/jobs/159630/back-end-engineers-malaysia-changing-the-iflix?a=RxalPAAGiBi"	"159630"	"01.07.2019"	"1563973369"
"02.07.2019"	"Netherlands"	"Amsterdam"	"Bitonic B.V."	"DevOps Engineer with an affinity for Bitcoin! at Bitonic B.V. (Amsterdam, Netherlands)"	"php, c++, go, bitcoin"	"https://stackoverflow.com/jobs/278534/devops-engineer-with-an-affinity-for-bitcoin-bitonic-bv?a=1vpwrhIVzV5K"	"278534"	"02.07.2019"	"1563973369"
"27.06.2019"	"Netherlands"	"Amsterdam"	"Catawiki"	"Senior Backend Engineer at Catawiki (Amsterdam, Netherlands)"	"ruby-on-rails, microservices, go, elasticsearch, reactjs"	"https://stackoverflow.com/jobs/172436/senior-backend-engineer-catawiki?a=VPrjujSy8ZG"	"172436"	"27.06.2019"	"1563973369"
"27.06.2019"	"Netherlands"	"Amsterdam"	"Container Solutions"	"Cloud Native Engineer - Amsterdam at Container Solutions (Amsterdam, Netherlands)"	"docker, kubernetes, python, cloud, go"	"https://stackoverflow.com/jobs/270710/cloud-native-engineer-amsterdam-container-solutions?a=1sMQ41BnArQc"	"270710"	"27.06.2019"	"1563973369"
"27.06.2019"	"Netherlands"	"Amsterdam"	"MessageBird"	"Senior Software Engineer (Go) at MessageBird (Amsterdam, Netherlands)"	"go, system-design, infrastructure, distributed-system, scale"	"https://stackoverflow.com/jobs/242786/senior-software-engineer-go-messagebird?a=1jqdBAMhO7N6"	"242786"	"27.06.2019"	"1563973369"
"03.07.2019"	"Netherlands"	"Amsterdam"	"Nulab, Inc"	"Senior Back-End Engineer at Nulab, Inc (Amsterdam, Netherlands)"	"java, api, go, graphql, rest"	"https://stackoverflow.com/jobs/194734/senior-back-end-engineer-nulab-inc?a=13j4Y0yzMaCQ"	"194734"	"03.07.2019"	"1563973369"
"04.07.2019"	"Netherlands"	"Oisterwijk"	"Dual Inventive"	"Ervaren Full Stack Developer at Dual Inventive (Oisterwijk, Netherlands)"	"reactjs, go, php, jquery, react-native"	"https://stackoverflow.com/jobs/252872/ervaren-full-stack-developer-dual-inventive?a=1mNW3A1r9Haw"	"252872"	"04.07.2019"	"1563973369"
"17.07.2019"	"Poland"	"Gdask"	"Amazon"	"Software Development Engineer - Alexa Automotive at Amazon (Gdask, Poland)"	"c++, c, go"	"https://stackoverflow.com/jobs/231771/software-development-engineer-alexa-automotive-amazon?a=1fJbwEZ4gZ3O"	"231771"	"17.07.2019"	"1563973369"
"27.06.2019"	"Poland"	"Warsaw"	"Container Solutions"	"Cloud Native Engineer - Warsaw at Container Solutions (Warsaw, Poland)"	"docker, kubernetes, go, python, cloud"	"https://stackoverflow.com/jobs/270711/cloud-native-engineer-warsaw-container-solutions?a=1sMRlX7UXCqk"	"270711"	"27.06.2019"	"1563973369"
"12.07.2019"	"Poland"	"Warsaw"	"Google"	"Software Engineer at Google (Warsaw, Poland)"	"c, c++, go"	"https://stackoverflow.com/jobs/231065/software-engineer-google?a=1fuvnCt2qtEI"	"231065"	"12.07.2019"	"1563973369"
"21.07.2019"	"Poland"	"Warsaw"	"Google"	"Lead Software Engineer, Kubernetes at Google (Warsaw, Poland)"	"cloud, c++, c, go, kubernetes"	"https://stackoverflow.com/jobs/231219/lead-software-engineer-kubernetes-google?a=1fxHUvhVYLoA"	"231219"	"21.07.2019"	"1563973369"
"28.06.2019"	"Poland"	"Warsaw"	"ING"	"Data Engineer at ING (Warsaw, Poland)"	"scala, go, python, apache-spark, hadoop"	"https://stackoverflow.com/jobs/234321/data-engineer-ing?a=1gAcSBfHgf0Q"	"234321"	"28.06.2019"	"1563973369"
"28.06.2019"	"Portugal"	"Lisboa"	"KI labs GmbH"	"Software Engineer at KI labs GmbH (Lisboa, Portugal)"	"reactjs, cloud, python, java, go"	"https://stackoverflow.com/jobs/234495/software-engineer-ki-labs-gmbh?a=1gDPc2zmhWpi"	"234495"	"28.06.2019"	"1563973369"
"12.07.2019"	"Portugal"	"Lissabon"	"freiheit.com technologies gmbh"	"Hackers wanted - Software Engineers (m/f/d) & Machine Learning Experts (m/f/d) at freiheit.com technologies gmbh (Lissabon, Portugal)"	"java, kotlin, javascript, clojure, go"	"https://stackoverflow.com/jobs/254089/hackers-wanted-software-engineers-m-f-d-freiheitcom-technologies-gmbh?a=1ndeXJIwYqly"	"254089"	"12.07.2019"	"1563973369"
"12.07.2019"	"Portugal"	"Lissabon"	"freiheit.com technologies gmbh"	"Hackers wanted - Software Engineers (m/f/d) & Machine Learning Experts (m/f/d) at freiheit.com technologies gmbh (Lissabon, Portugal)"	"java, kotlin, javascript, clojure, go"	"https://stackoverflow.com/jobs/197741/hackers-wanted-software-engineers-m-f-d-freiheitcom-technologies-gmbh?a=14jBsXFcyqSQ"	"197741"	"12.07.2019"	"1563973369"
"10.07.2019"	"Remote"	"Remote"	"BlueLabs Software"	"Software Engineer (Go) - Account Team at BlueLabs Software () (allows remote)"	"go, concurrency, distributed-computing, cqrs, domain-driven-design"	"https://stackoverflow.com/jobs/272914/software-engineer-go-account-team-bluelabs-software?a=1twFmWhLgEaA"	"272914"	"10.07.2019"	"1563973369"
"21.07.2019"	"Remote"	"Remote"	"Brave Software"	"Senior Server Side Ledger Engineer at Brave Software () (allows remote)"	"go, postgresql, ruby-on-rails, typescript, amazon-web-services"	"https://stackoverflow.com/jobs/275894/senior-server-side-ledger-engineer-brave-software?a=1uwD3QdQXiH6"	"275894"	"21.07.2019"	"1563973369"
"01.07.2019"	"Remote"	"Remote"	"Cilium"	"Senior Developer - Golang (remote) at Cilium () (allows remote)"	"go, kubernetes, amazon-web-services, docker, javascript"	"https://stackoverflow.com/jobs/278243/senior-developer-golang-remote-cilium?a=1vjtii0hPfwc"	"278243"	"01.07.2019"	"1563973369"
"28.06.2019"	"Remote"	"Remote"	"Elastic"	"Cloud- Golang Engineer(Kubernetes) at Elastic () (allows remote)"	"kubernetes, go, amazon-web-services"	"https://stackoverflow.com/jobs/234558/cloud-golang-engineer-kubernetes-elastic?a=1gF8puDgPH7q"	"234558"	"28.06.2019"	"1563973369"
"02.07.2019"	"Remote"	"Remote"	"Elastic"	"Senior Golang Engineer at Elastic () (allows remote)"	"go, c++, unix, distributed-system"	"https://stackoverflow.com/jobs/208381/senior-golang-engineer-elastic?a=17SQ6XEyWz5K"	"208381"	"02.07.2019"	"1563973369"
"23.07.2019"	"Remote"	"Remote"	"Giant Swarm GmbH"	"Platform Engineer for Containers at Giant Swarm GmbH () (allows remote)"	"go, kubernetes"	"https://stackoverflow.com/jobs/160144/platform-engineer-for-containers-giant-swarm-gmbh?a=RHQYJlgM27C"	"160144"	"23.07.2019"	"1563973369"
"28.06.2019"	"Remote"	"Remote"	"Heetch"	"Backend Engineer - Driver Engagement Team (Golang) at Heetch () (allows remote)"	"microservices, go, event-driven, apache-kafka, ruby-on-rails"	"https://stackoverflow.com/jobs/268874/backend-engineer-driver-engagement-team-golang-heetch?a=1saFay35r3Xi"	"268874"	"28.06.2019"	"1563973369"
"28.06.2019"	"Remote"	"Remote"	"Heetch"	"Backend Engineer - Marketplace Team (Golang) at Heetch () (allows remote)"	"microservices, go, event-driven, apache-kafka, docker"	"https://stackoverflow.com/jobs/268881/backend-engineer-marketplace-team-golang-heetch?a=1saOc2IR3g2c"	"268881"	"28.06.2019"	"1563973369"
"28.06.2019"	"Remote"	"Remote"	"Heetch"	"Backend Engineer - Ride Team (Golang) at Heetch () (allows remote)"	"microservices, go"	"https://stackoverflow.com/jobs/268888/backend-engineer-ride-team-golang-heetch?a=1saXdxoCFs76"	"268888"	"28.06.2019"	"1563973369"
"28.06.2019"	"Remote"	"Remote"	"Heetch"	"Senior Site Reliability Engineer (SRE) - Core Team at Heetch () (allows remote)"	"microservices, go, bash, python, ruby"	"https://stackoverflow.com/jobs/268894/senior-site-reliability-engineer-sre-core-team-heetch?a=1sb4X6xQUtBS"	"268894"	"28.06.2019"	"1563973369"
"30.06.2019"	"Remote"	"Remote"	"Heetch"	"Engineering Manager - Payment Team at Heetch () (allows remote)"	"microservices, go, stripe-payments, payment-gateway, payment"	"https://stackoverflow.com/jobs/265194/engineering-manager-payment-team-heetch?a=1qW94aKc8Vws"	"265194"	"30.06.2019"	"1563973369"
"04.07.2019"	"Remote"	"Remote"	"Heetch"	"Backend Engineer - Care Platform Team (Golang) at Heetch () (allows remote)"	"go, kafka, docker, reactjs, postgresql"	"https://stackoverflow.com/jobs/252959/backend-engineer-care-platform-team-golang-heetch?a=1mPKdiGgFxRK"	"252959"	"04.07.2019"	"1563973369"
"06.07.2019"	"Remote"	"Remote"	"Heetch"	"Backend Engineer - Payment Team (Golang) at Heetch () (allows remote)"	"microservices, machine-learning, event-sourcing, go, stripe-payments"	"https://stackoverflow.com/jobs/195949/backend-engineer-payment-team-golang-heetch?a=13IlijcAQyDC"	"195949"	"06.07.2019"	"1563973369"
"12.07.2019"	"Remote"	"Remote"	"Heetch"	"Backend Engineer - Driver Acquisition Team (Golang) at Heetch () (allows remote)"	"microservices, go, apache-kafka, ruby, event-driven"	"https://stackoverflow.com/jobs/267152/backend-engineer-driver-acquisition-team-heetch?a=1rAReQk9T8v6"	"267152"	"12.07.2019"	"1563973369"
"19.07.2019"	"Remote"	"Remote"	"Heetch"	"Backend Engineer - Developers Care Team (Golang) at Heetch () (allows remote)"	"go, microservices, event-sourcing, grpc, cqrs"	"https://stackoverflow.com/jobs/192163/backend-engineer-developers-care-team-golang-heetch?a=12rCxAgDWkr6"	"192163"	"19.07.2019"	"1563973369"
"19.07.2019"	"Remote"	"Remote"	"Heetch"	"Senior DevOps Engineer - CI/CD at Heetch () (allows remote)"	"go, docker, kubernetes, microservices, devops"	"https://stackoverflow.com/jobs/268890/senior-devops-engineer-ci-cd-heetch?a=1saZNorHpNhm"	"268890"	"19.07.2019"	"1563973369"
"19.07.2019"	"Remote"	"Remote"	"Heetch"	"Engineering Manager - Passenger Team at Heetch () (allows remote)"	"microservices, go, docker"	"https://stackoverflow.com/jobs/252605/engineering-manager-passenger-team-heetch?a=1mInQQTIn7A4"	"252605"	"19.07.2019"	"1563973369"
"02.07.2019"	"Remote"	"Remote"	"Rocaccion Inc."	"Senior Go Developer Who Loves Writing Microservices at Rocaccion Inc. () (allows remote)"	"go, rust, docker, kubernetes"	"https://stackoverflow.com/jobs/249958/senior-go-developer-who-loves-writing-rocaccion-inc?a=1lPlrUIS8j6w"	"249958"	"02.07.2019"	"1563973369"
"16.07.2019"	"Remote"	"Remote"	"SUSE"	"Senior Software Engineer with Kubernetes and Go (Flexible location) at SUSE () (allows remote)"	"kubernetes, salt, go, ruby-on-rails, docker"	"https://stackoverflow.com/jobs/281928/senior-software-engineer-with-kubernetes-and-go-suse?a=1wy5QiVRZeRG"	"281928"	"16.07.2019"	"1563973369"
"17.07.2019"	"Remote"	"Remote"	"SUSE"	"Senior Solutions Developer (Python / Go / Linux / CI+CD / Clusters) at SUSE () (allows remote)"	"linux, kubernetes, go, salt, ansible"	"https://stackoverflow.com/jobs/282181/senior-solutions-developer-python-go-linux-suse?a=1wDm02I3xqik"	"282181"	"17.07.2019"	"1563973369"
"13.07.2019"	"Remote"	"Remote"	"Scrapinghub"	"Head of Development - Crawlera at Scrapinghub () (allows remote)"	"python, erlang, go, web-crawler, web-scraping"	"https://stackoverflow.com/jobs/230227/head-of-development-crawlera-scrapinghub?a=1fd546FXfrkA"	"230227"	"13.07.2019"	"1563973369"
"11.07.2019"	"Remote"	"Remote"	"Sticker Mule"	"Software Engineer: Site Reliability and Infrastructure at Sticker Mule () (allows remote)"	"bash, kubernetes, go, gcloud, docker"	"https://stackoverflow.com/jobs/280836/software-engineer-site-reliability-and-sticker-mule?a=1wbo57Q3SQwM"	"280836"	"11.07.2019"	"1563973369"
"24.06.2019"	"Remote"	"Remote"	"Theorem"	"Experienced Backend Engineer - Go at Theorem () (allows remote)"	"go, reactjs, api-design"	"https://stackoverflow.com/jobs/251085/experienced-backend-engineer-go-theorem?a=1mcMkzbwjFPW"	"251085"	"24.06.2019"	"1563973369"
"28.06.2019"	"Remote"	"Remote"	"X-Team"	"Go Developer (Remote) at X-Team () (allows remote)"	"go, machine-learning, python, node.js"	"https://stackoverflow.com/jobs/235208/go-developer-remote-x-team?a=1gSEmzL9KDTi"	"235208"	"28.06.2019"	"1563973369"
"27.06.2019"	"Romania"	"Cluj-Napoca"	"Siemens"	"Golang Software Developer at Siemens (Cluj-Napoca, Romania)"	"golang, go, restapi"	"https://stackoverflow.com/jobs/270633/golang-software-developer-siemens?a=1sLeNAbVOiYg"	"270633"	"27.06.2019"	"1563973369"
"12.07.2019"	"Russia"	"Moskva"	"Avito"	"PHP/Go developer at Avito (Moskva, Russia)"	"php, go, docker, kubernetes, postgresql"	"https://stackoverflow.com/jobs/267007/php-go-developer-avito?a=1rxQjje6Ho0o"	"267007"	"12.07.2019"	"1563973369"
"29.06.2019"	"Singapore"	"Singapore"	"CashShield"	"Backend Engineer (C++, Golang, Nodejs) at CashShield (Singapore)"	"go, python, node.js, c++"	"https://stackoverflow.com/jobs/262451/backend-engineer-c-plus-plus-golang-nodejs-cashshield?a=1q16UabG1J6w"	"262451"	"29.06.2019"	"1563973369"
"12.07.2019"	"Singapore"	"Singapore"	"CashShield"	"DevOps Engineer at CashShield (Singapore)"	"docker, kubernetes, go, python, jenkins"	"https://stackoverflow.com/jobs/273532/devops-engineer-cashshield?a=1tJw4kCqe8ik"	"273532"	"12.07.2019"	"1563973369"
"26.06.2019"	"Singapore"	"Singapore"	"Grab"	"Senior Backend Engineer at Grab (Singapore)"	"data-structures, algorithm, go, distributed-system, microservices"	"https://stackoverflow.com/jobs/216786/senior-backend-engineer-grab?a=1aHBuhGR4cUg"	"216786"	"26.06.2019"	"1563973369"
"17.07.2019"	"Singapore"	"Singapore"	"Grab"	"Software Engineer,Full Stack at Grab (Singapore)"	"reactjs, ruby-on-rails, javascript, java, go"	"https://stackoverflow.com/jobs/274119/software-engineer-full-stack-grab?a=1tVINXGoBkm4"	"274119"	"17.07.2019"	"1563973369"
"03.07.2019"	"Singapore"	"Singapore"	"Ninja Van"	"Software Engineer at Ninja Van (Singapore)"	"java, playframework, react-redux, javascript, go"	"https://stackoverflow.com/jobs/272207/software-engineer-ninja-van?a=1thXVYfc2Ybm"	"272207"	"03.07.2019"	"1563973369"
"28.06.2019"	"Spain"	"Barcelona"	"Adevinta"	"Backend Software Engineer -- Houston Team at Adevinta (Barcelona, Spain)"	"amazon-web-services, java, scala, kotlin, go"	"https://stackoverflow.com/jobs/271066/backend-software-engineer-houston-team-adevinta?a=1sUf0kr0Ddi8"	"271066"	"28.06.2019"	"1563973369"
"23.07.2019"	"Spain"	"Barcelona"	"Kochava"	"Software Engineer at Kochava (Barcelona, Spain)"	"php, mysql, go, google-cloud-platform, linux"	"https://stackoverflow.com/jobs/283808/software-engineer-kochava?a=1xbbsBzQA8og"	"283808"	"23.07.2019"	"1563973369"
"23.07.2019"	"Spain"	"Barcelona"	"Kochava"	"Lead Software Engineer at Kochava (Barcelona, Spain)"	"java, mysql, go, linux, google-cloud-platform"	"https://stackoverflow.com/jobs/283810/lead-software-engineer-kochava?a=1xbe2sCVktyw"	"283810"	"23.07.2019"	"1563973369"
"26.06.2019"	"Spain"	"Barcelona"	"NoviCap"	"Software Craftsman at NoviCap (Barcelona, Spain)"	"ruby, python, reactjs, go, docker"	"https://stackoverflow.com/jobs/147602/software-craftsman-novicap?a=Nv4m1a5zfzi"	"147602"	"26.06.2019"	"1563973369"
"17.07.2019"	"Spain"	"Madrid"	"Teknei"	"Backend developer Java & Go at Teknei (Madrid, Spain)"	"go, java, java-ee"	"https://stackoverflow.com/jobs/282168/backend-developer-java-go-teknei?a=1wD5eYT3GcIE"	"282168"	"17.07.2019"	"1563973369"
"21.07.2019"	"Spain"	"Madrid"	"source{d}"	"Lead Applications Engineer at source{d} (Madrid, Spain) (allows remote)"	"go, python, scala, javascript, typescript"	"https://stackoverflow.com/jobs/283181/lead-applications-engineer-source-d?a=1wY99Rwlg71m"	"283181"	"21.07.2019"	"1563973369"
"18.07.2019"	"Sweden"	"Stockholm"	"P.F.C. - Personal Finance Co."	"Backend Engineer (Go & Microservices) at P.F.C. - Personal Finance Co. (Stockholm, Sweden)"	"go, microservices, amazon-web-services, heroku"	"https://stackoverflow.com/jobs/230546/backend-engineer-go-microservices-pfc-personal-finance-co?a=1fjIj55FsTdK"	"230546"	"18.07.2019"	"1563973369"
"24.06.2019"	"Sweden"	"Stockholm"	"Tink AB"	"Fullstack Software Engineer at Tink AB (Stockholm, Sweden)"	"reactjs, redux, typescript, java, go"	"https://stackoverflow.com/jobs/276323/fullstack-software-engineer-tink-ab?a=1uFy6SmMhwGs"	"276323"	"24.06.2019"	"1563973369"
"21.07.2019"	"Sweden"	"Stockholm"	"Tink AB"	"Backend Software Engineer at Tink AB (Stockholm, Sweden)"	"java, go, kubernetes, microservices"	"https://stackoverflow.com/jobs/203229/backend-software-engineer-tink-ab?a=169ImPPjxaSY"	"203229"	"21.07.2019"	"1563973369"
"09.07.2019"	"Sweden"	"Västerås"	"Westermo Network Technologies AB"	"Software Developer for Test Framework &Tools at Westermo Network Technologies AB (Västerås, Sweden)"	"python, go, linux, jenkins, docker"	"https://stackoverflow.com/jobs/280124/software-developer-for-test-framework-tools-westermo-network-technologies?a=1vWAcwaNNjCU"	"280124"	"09.07.2019"	"1563973369"
"11.07.2019"	"Sweden"	"Växjö"	"Playn GO"	"Software Developer at Playn GO (Växjö, Sweden)"	"go, javascript, amazon-web-services"	"https://stackoverflow.com/jobs/208055/software-developer-play-n-go?a=17M3Quz56V7G"	"208055"	"11.07.2019"	"1563973369"
"29.06.2019"	"Switzerland"	"Zürich"	"Google"	"Software Engineer at Google (Zürich, Switzerland)"	"c, c++, go"	"https://stackoverflow.com/jobs/234833/software-engineer-google?a=1gKQVDXiBDmU"	"234833"	"29.06.2019"	"1563973369"
"06.07.2019"	"Switzerland"	"Zürich"	"Google"	"Software Engineer, Site Reliability Engineering at Google (Zürich, Switzerland)"	"c, c++, go, linux, kubernetes"	"https://stackoverflow.com/jobs/245311/software-engineer-site-reliability-engineering-google?a=1kgIJkVss7aU"	"245311"	"06.07.2019"	"1563973369"
"11.07.2019"	"Switzerland"	"Zürich"	"Google"	"Software Engineer, Site Reliability Engineering, University Graduate, 2019 at Google (Zürich, Switzerland)"	"c, c++, go, linux, kubernetes"	"https://stackoverflow.com/jobs/246415/software-engineer-site-reliability-engineering-google?a=1kDFXEjJ2yvm"	"246415"	"11.07.2019"	"1563973369"
"16.07.2019"	"Switzerland"	"Zürich"	"Google"	"Security Engineer, Detection at Google (Zürich, Switzerland)"	"security, c, c++, go"	"https://stackoverflow.com/jobs/231148/security-engineer-detection-google?a=1fwenD1IrE1q"	"231148"	"16.07.2019"	"1563973369"
"02.07.2019"	"Switzerland"	"Zürich"	"Hays plc"	"Senior Backend Software Engineer (m/f) at Hays plc (Zürich, Schweiz)"	"oop, go, symfony2"	"https://stackoverflow.com/jobs/204525/senior-backend-software-engineer-m-f-hays-plc?a=16AF7hYVSo6c"	"204525"	"02.07.2019"	"1563973369"
"10.07.2019"	"Switzerland"	"Zürich"	"Nine Internet Solutions AG"	"Kubernetes Engineering at Nine Internet Solutions AG (Zürich, Switzerland)"	"kubernetes, ansible, terraform, go, prometheus, sysadmin"	"https://stackoverflow.com/jobs/205625/kubernetes-engineering-nine-internet-solutions-ag?a=16XxbTh2Y968"	"205625"	"10.07.2019"	"1563973369"
"04.07.2019"	"Switzerland"	"Zürich"	"Numbrs"	"Senior Backend Engineer, Crypto at Numbrs (Zürich, Switzerland)"	"java, scala, backend, go, microservices"	"https://stackoverflow.com/jobs/279096/senior-backend-engineer-crypto-numbrs?a=1vBcWIFrBQAg"	"279096"	"04.07.2019"	"1563973369"
"05.07.2019"	"Switzerland"	"Zürich"	"Numbrs"	"Engineering Manager at Numbrs (Zürich, Switzerland)"	"java, go, microservices, backend, scala"	"https://stackoverflow.com/jobs/244993/engineering-manager-numbrs?a=1ka6Mi2hBPRS"	"244993"	"05.07.2019"	"1563973369"
"08.07.2019"	"Switzerland"	"Zürich"	"Numbrs"	"Software Engineer, Backend at Numbrs (Zürich, Switzerland)"	"java, scala, backend, go, microservices"	"https://stackoverflow.com/jobs/237365/software-engineer-backend-numbrs?a=1hBv4SMeROPC"	"237365"	"08.07.2019"	"1563973369"
"03.07.2019"	"Switzerland"	"Zürich"	"Smallpdf"	"Backend Engineer (Golang) (m/f) at Smallpdf (Zürich, Switzerland)"	"devops, aws, terraform, docker, golang"	"https://stackoverflow.com/jobs/278948/backend-engineer-golang-m-f-smallpdf?a=1vy89oZMiAla"	"278948"	"03.07.2019"	"1563973369"
"05.07.2019"	"Switzerland"	"Zürich"	"iptiQ"	"Engineering Manager at iptiQ (Zürich, Switzerland)"	"java, scala, go, python, c++"	"https://stackoverflow.com/jobs/279513/engineering-manager-iptiq?a=1vJSwCvUs1A4"	"279513"	"05.07.2019"	"1563973369"
"18.07.2019"	"Switzerland"	"Zürich"	"tutti.ch"	"Senior Backend Engineer Go (w/m) 80-100% at tutti.ch (Zürich, Schweiz)"	"go, postgresql, reactjs, java, javascript"	"https://stackoverflow.com/jobs/259493/senior-backend-engineer-go-w-m-80-100-tuttich?a=1p1BzFNqyPoQ"	"259493"	"18.07.2019"	"1563973369"
"12.07.2019"	"Thailand"	"Khwaeng Pathum Wan"	"Agoda"	"Senior Data Pipeline Engineer at Agoda (Khwaeng Pathum Wan, Thailand)"	"elasticsearch, .net, go, messaging, scala"	"https://stackoverflow.com/jobs/219492/senior-data-pipeline-engineer-agoda?a=1bBRWXPsm5Lq"	"219492"	"12.07.2019"	"1563973369"
"10.07.2019"	"United Kingdom"	"Birmingham"	"The Economist"	"Tech Lead - Content Platform at The Economist (Birmingham, UK)"	"agile, amazon-web-services, elasticsearch, aws-lambda, go"	"https://stackoverflow.com/jobs/280463/tech-lead-content-platform-the-economist?a=1w3De35hubaE"	"280463"	"10.07.2019"	"1563973369"
"01.07.2019"	"United Kingdom"	"Cambridge"	"Simprints Technology Ltd"	"Senior Backend Engineer - build tech that improves millions of lives! at Simprints Technology Ltd (Cambridge, UK)"	"google-cloud-platform, microservices, go, serverless, amazon-web-services"	"https://stackoverflow.com/jobs/263624/senior-backend-engineer-build-tech-that-simprints-technology-ltd?a=1qpv5uN5oWDS"	"263624"	"01.07.2019"	"1563973369"
"08.07.2019"	"United Kingdom"	"Cambridge"	"Simprints Technology Ltd"	"Senior Backend Engineer - build tech that improves millions of lives! at Simprints Technology Ltd (Cambridge, UK)"	"google-cloud-platform, microservices, go, serverless, amazon-web-services"	"https://stackoverflow.com/jobs/205031/senior-backend-engineer-build-tech-that-simprints-technology-ltd?a=16LbqLxiYKXu"	"205031"	"08.07.2019"	"1563973369"
"06.07.2019"	"United Kingdom"	"Edinburgh"	"iZettle"	"Backend Engineer .... Using Go for Microservices with Cloud Infrastructure at iZettle (Edinburgh, UK)"	"go, microservices, postgresql, docker, kubernetes"	"https://stackoverflow.com/jobs/272919/backend-engineer-using-go-for-microservices-izettle?a=1twLOzUs8v5e"	"272919"	"06.07.2019"	"1563973369"
"11.07.2019"	"United Kingdom"	"Exeter"	"Sparx"	"Software Engineer - use Go, React JS, Kubernetes, Google Cloud Platform at Sparx (Exeter, UK)"	"reactjs, go, cloud, kubernetes, typescript"	"https://stackoverflow.com/jobs/280900/software-engineer-use-go-react-js-kubernetes-sparx?a=1wcIAvqvNLP2"	"280900"	"11.07.2019"	"1563973369"
"04.07.2019"	"United Kingdom"	"London"	"Amazon"	"Front-End Engineer, Video Commerce UI at Amazon (London, UK)"	"c, c++, go"	"https://stackoverflow.com/jobs/235923/front-end-engineer-video-commerce-ui-amazon?a=1h7w6Y01XGxy"	"235923"	"04.07.2019"	"1563973369"
"16.07.2019"	"United Kingdom"	"London"	"Armakuni"	"DevOps Engineering Consultant - Putting the Dev into DevOps! at Armakuni (London, UK)"	"continuous-integration, java, go, ruby-on-rails-3, continuous-deployment"	"https://stackoverflow.com/jobs/268297/devops-engineering-consultant-putting-the-dev-armakuni?a=1rYFkceuNzIQ"	"268297"	"16.07.2019"	"1563973369"
"04.07.2019"	"United Kingdom"	"London"	"Clearmatics"	"Blockchain Engineer at Clearmatics (London, UK)"	"c++, scala, blockchain, rust, go"	"https://stackoverflow.com/jobs/195388/blockchain-engineer-clearmatics?a=13wG4NMCbNJe"	"195388"	"04.07.2019"	"1563973369"
"27.06.2019"	"United Kingdom"	"London"	"Container Solutions"	"Cloud Native Engineer - London at Container Solutions (London, UK)"	"docker, kubernetes, python, cloud, go"	"https://stackoverflow.com/jobs/270713/cloud-native-engineer-london-container-solutions?a=1sMTVOaZHXAA"	"270713"	"27.06.2019"	"1563973369"
"21.07.2019"	"United Kingdom"	"London"	"Form3 - Financial Cloud"	"Senior Software Developer (GO) - 100% remote (EU only) at Form3 - Financial Cloud (London, UK) (allows remote)"	"go, amazon-web-services, docker, terraform, tdd"	"https://stackoverflow.com/jobs/230221/senior-software-developer-go-100-remote-eu-form3-financial-cloud?a=1fcXkxwJ0pPO"	"230221"	"21.07.2019"	"1563973369"
"23.07.2019"	"United Kingdom"	"London"	"Funding Circle"	"Global Site Reliability Engineer building an SRE practice from the Ground up at Funding Circle (London, UK)"	"amazon-web-services, kubernetes, terraform, go, ruby, sysadmin"	"https://stackoverflow.com/jobs/283909/global-site-reliability-engineer-building-an-sre-funding-circle?a=1xdhFjAdknfi"	"283909"	"23.07.2019"	"1563973369"
"22.07.2019"	"United Kingdom"	"London"	"Goldman Sachs"	"Site Reliability Engineer at Goldman Sachs (London, UK)"	"go, python, c++, java, perl, sysadmin"	"https://stackoverflow.com/jobs/203553/site-reliability-engineer-goldman-sachs?a=16gs3rRICtGM"	"203553"	"22.07.2019"	"1563973369"
"26.06.2019"	"United Kingdom"	"London"	"News UK"	"Senior Distributed Engineer at News UK (London, UK)"	"go, testing, continuous-integration, kubernetes, api"	"https://stackoverflow.com/jobs/277200/senior-distributed-engineer-news-uk?a=1uXMHzCR2dJC"	"277200"	"26.06.2019"	"1563973369"
"08.07.2019"	"United Kingdom"	"London"	"Oliver Wyman Systems Engineering"	"Senior Software Engineer to create brilliant products at Oliver Wyman Systems Engineering (London, UK)"	"python, .net, agile, go, git"	"https://stackoverflow.com/jobs/279909/senior-software-engineer-to-create-brilliant-oliver-wyman-systems?a=1vS722l4rCla"	"279909"	"08.07.2019"	"1563973369"
"21.07.2019"	"United Kingdom"	"London"	"Perkbox"	"Go Developer at Perkbox (London, UK)"	"go"	"https://stackoverflow.com/jobs/174160/go-developer-perkbox?a=WphP35SQpC8"	"174160"	"21.07.2019"	"1563973369"
"13.07.2019"	"United Kingdom"	"London"	"Sliide"	"Golang Developer - Micro services - AWS - Sliide- London at Sliide (London, UK)"	"go, microservices"	"https://stackoverflow.com/jobs/238799/golang-developer-micro-services-aws-sliide-sliide?a=1i5jJnm8MAsE"	"238799"	"13.07.2019"	"1563973369"
"09.07.2019"	"United Kingdom"	"London"	"Synthace Ltd."	"(Senior) Software Engineer - Data & Workflows at Synthace Ltd. (London, UK)"	"go, python, airflow, java, apache-spark"	"https://stackoverflow.com/jobs/266550/senior-software-engineer-data-workflows-synthace-ltd?a=1rolaio6UnHq"	"266550"	"09.07.2019"	"1563973369"
"18.07.2019"	"United Kingdom"	"London"	"Synthace Ltd."	"(Senior) Software Engineer - Ref: SynSSE1 at Synthace Ltd. (London, UK)"	"go, docker, kubernetes, google-cloud-platform, ansible"	"https://stackoverflow.com/jobs/240193/senior-software-engineer-ref-synsse1-synthace-ltd?a=1iyiOKWvKwMw"	"240193"	"18.07.2019"	"1563973369"
"27.06.2019"	"United Kingdom"	"London"	"VIOOH"	"Backend Developer (PHP) at VIOOH (London, UK)"	"php, laravel, go"	"https://stackoverflow.com/jobs/270773/backend-developer-php-viooh?a=1sO9htFi8cyk"	"270773"	"27.06.2019"	"1563973369"
"11.07.2019"	"United Kingdom"	"London"	"Vodafone"	"Software Engineer (Innovation) at Vodafone (London, UK)"	"agile, python, java, scala, go"	"https://stackoverflow.com/jobs/197045/software-engineer-innovation-vodafone?a=1458dcoyrDj2"	"197045"	"11.07.2019"	"1563973369"
"20.07.2019"	"United Kingdom"	"London"	"Yoti"	"Backend Engineer (GoLang/Node.js) at Yoti (London, UK)"	"go, node.js, microservices"	"https://stackoverflow.com/jobs/248945/backend-engineer-golang-nodejs-yoti?a=1luhx25AyoNO"	"248945"	"20.07.2019"	"1563973369"
"20.07.2019"	"United Kingdom"	"London"	"Yoti"	"Data Engineer at Yoti (London, UK)"	"python, r, go, etl, bigdata"	"https://stackoverflow.com/jobs/248957/data-engineer-yoti?a=1lux0ao32rNm"	"248957"	"20.07.2019"	"1563973369"
"11.07.2019"	"United Kingdom"	"London"	"Zoopla"	"Engineering Manager (leading 5-8 engineers) at Zoopla (London, UK)"	"agile, go, node.js, python"	"https://stackoverflow.com/jobs/254852/engineering-manager-leading-5-8-engineers-zoopla?a=1nt6AF9f7EY0"	"254852"	"11.07.2019"	"1563973369"
"19.07.2019"	"United Kingdom"	"London"	"uSwitch"	"Software Engineer - Web at uSwitch (London, UK)"	"reactjs, graphql, redux, clojure, go"	"https://stackoverflow.com/jobs/224563/software-engineer-web-uswitch?a=1djjgW96uELK"	"224563"	"19.07.2019"	"1563973369"
"19.07.2019"	"United Kingdom"	"London"	"uSwitch"	"Senior Software Engineer - Platform at uSwitch (London, UK)"	"clojure, functional-programming, elixir, go"	"https://stackoverflow.com/jobs/224575/senior-software-engineer-platform-uswitch?a=1djyK4ryYHLi"	"224575"	"19.07.2019"	"1563973369"
"22.07.2019"	"United States of America"	"Plano"	"Dyanata"	"Software Engineer - Backend at Dyanata (Plano, TX)"	"ruby, java, php, go, scala"	"https://stackoverflow.com/jobs/269973/software-engineer-backend-dyanata?a=1sxvXdOF9En6"	"269973"	"22.07.2019"	"1563973369"
"15.07.2019"	"United States of America"	"San Francisco"	"Cloudflare"	"Software Engineer - Kubernetes Platform at Cloudflare (San Francisco, CA)"	"kubernetes, go"	"https://stackoverflow.com/jobs/202823/software-engineer-kubernetes-platform-cloudflare?a=161gY8KLNSiA"	"202823"	"15.07.2019"	"1563973369"
"16.07.2019"	"United States of America"	"San Francisco"	"Vonage"	"Manager SDET -Software Engineer in Test at Vonage (San Francisco, CA)"	"python, go, java"	"https://stackoverflow.com/jobs/282023/manager-sdet-software-engineer-in-test-vonage?a=1wA4jrN0usdW"	"282023"	"16.07.2019"	"1563973369"
"08.07.2019"	"United States of America"	"Santa Monica"	"Riot Games"	"Senior Software Engineer - Esports at Riot Games (Santa Monica, CA)"	"java, javascript, go, amazon-web-services"	"https://stackoverflow.com/jobs/205044/senior-software-engineer-esports-riot-games?a=16LsbPmiPYxa"	"205044"	"08.07.2019"	"1563973369"
