<?xml version="1.0" encoding="utf-8"?>
<!-- Generator: Adobe Illustrator 19.0.0, SVG Export Plug-In . SVG Version: 6.00 Build 0)  -->
<svg version="1.1" id="Calque_1" xmlns="http://www.w3.org/2000/svg" xmlns:xlink="http://www.w3.org/1999/xlink" x="0px" y="0px"
	 viewBox="0 0 59.5 67.3" enable-background="new 0 0 59.5 67.3" xml:space="preserve">
<g id="XMLID_86_">
	<path id="XMLID_89_" fill="none" d="M12.3,42.2c2.5-0.8,4.4-3.1,4.4-5.9s-1.8-5.1-4.4-5.9c-0.6-0.2-1.2-0.3-1.9-0.3
		c-0.7,0-1.3,0.1-2,0.3c-2.5,0.8-4.3,3.1-4.3,5.9s1.8,5.1,4.3,5.9c0.6,0.2,1.3,0.3,2,0.3C11.1,42.5,11.7,42.4,12.3,42.2z"/>
	<path id="XMLID_114_" fill="none" d="M12.3,16.1v10c4.9,0.9,8.5,5.1,8.5,10.2c0,5.1-3.7,9.3-8.5,10.2v16.9h43.4V16.1L33.4,4.4
		L12.3,16.1z"/>
	<path id="XMLID_117_" fill="#FFFFFF" d="M33.3,0L8.5,13.8V26C3.7,27,0,31.2,0,36.3s3.7,9.3,8.5,10.2v20.8h51V13.8L33.3,0z
		 M4.2,36.3c0-2.8,1.8-5.1,4.3-5.9c0.6-0.2,1.3-0.3,2-0.3c0.7,0,1.3,0.1,1.9,0.3c2.5,0.8,4.4,3.1,4.4,5.9s-1.8,5.1-4.4,5.9
		c-0.6,0.2-1.2,0.3-1.9,0.3c-0.7,0-1.3-0.1-2-0.3C6,41.3,4.2,39,4.2,36.3z M55.7,63.4H12.3V46.5c4.9-0.9,8.5-5.1,8.5-10.2
		c0-5.1-3.7-9.3-8.5-10.2v-10L33.4,4.4l22.3,11.7V63.4z"/>
</g>
</svg>
