[
  {
    "metric": {
      "__name__": "node_uname_info",
      "container": "node-exporter",
      "domainname": "(none)",
      "endpoint": "metrics",
      "instance": "172.16.50.10:9100",
      "job": "node-exporter",
      "machine": "x86_64",
      "namespace": "prometheus-stack",
      "nodename": "k8s-master",
      "pod": "v12-9-2-prometheus-node-exporter-vph2g",
      "release": "3.10.0-1127.el7.x86_64",
      "service": "v12-9-2-prometheus-node-exporter",
      "sysname": "Linux",
      "version": "#1 SMP Tue Mar 31 23:36:51 UTC 2020"
    },
    "value": [
      1611868074.611,
      "1"
    ]
  }
]
