ansible==3.2.0
ansible-base==2.10.7
ansible-lint==4.3.7
arrow==1.0.3
bcrypt==3.2.0
binaryornot==0.4.4
Cerberus==1.3.2
certifi==2020.12.5
cffi==1.14.5
chardet==4.0.0
click==7.1.2
click-completion==0.5.2
click-help-colors==0.9
colorama==0.4.4
commonmark==0.9.1
cookiecutter==1.7.2
cryptography==3.4.7
distro==1.5.0
enrich==1.2.6
idna==2.10
Jinja2==2.11.3
jinja2-time==0.2.0
jmespath==0.10.0
MarkupSafe==1.1.1
molecule==3.2.4
molecule-vagrant==0.6.1
packaging==20.9
paramiko==2.7.2
pathspec==0.8.1
pkg-resources==0.0.0
pluggy==0.13.1
poyo==0.5.0
pycparser==2.20
Pygments==2.8.1
PyNaCl==1.4.0
pyparsing==2.4.7
python-dateutil==2.8.1
python-slugify==4.0.1
python-vagrant==0.5.15
PyYAML==5.4.1
requests==2.25.1
rich==10.1.0
ruamel.yaml==0.17.2
ruamel.yaml.clib==0.2.2
selinux==0.2.1
shellingham==1.4.0
six==1.15.0
subprocess-tee==0.2.0
text-unidecode==1.3
typing-extensions==3.7.4.3
urllib3==1.26.4
yamllint==1.26.1
