{
    "EMC00001_20091123_0742_MRI_HERS_OMM": {
        "subject": "EMC00001",
        "DWI_dicom": "xnat://xnat.bmia.nl/data/archive/projects/bbmri-wp3-dev/subjects/EMC00001/experiments/EMC00001_20091123_0742_MRI_HERS_OMM/scans/7/resources/DICOM"
    },
    "EMC00001_20091207_0731_MRI_HERS_OMM": {
        "subject": "EMC00001",
        "DWI_dicom": "xnat://xnat.bmia.nl/data/archive/projects/bbmri-wp3-dev/subjects/EMC00001/experiments/EMC00001_20091207_0731_MRI_HERS_OMM/scans/7/resources/DICOM"
    },
    "EMC00002_20091123_0920_MRI_HERS_OMM": {
        "subject": "EMC00002",
        "DWI_dicom": "xnat://xnat.bmia.nl/data/archive/projects/bbmri-wp3-dev/subjects/EMC00002/experiments/EMC00002_20091123_0920_MRI_HERS_OMM/scans/7/resources/DICOM"
    },
    "EMC00002_20091210_0728_MRI_HERS_OMM": {
        "subject": "EMC00002",
        "DWI_dicom": "xnat://xnat.bmia.nl/data/archive/projects/bbmri-wp3-dev/subjects/EMC00002/experiments/EMC00002_20091210_0728_MRI_HERS_OMM/scans/7/resources/DICOM"
    },
    "EMC00003_20091203_1232_MRI_HERS_OMM": {
        "subject": "EMC00003",
        "DWI_dicom": "xnat://xnat.bmia.nl/data/archive/projects/bbmri-wp3-dev/subjects/EMC00003/experiments/EMC00003_20091203_1232_MRI_HERS_OMM/scans/7/resources/DICOM"
    },
    "EMC00003_20091217_1028_MRI_HERS_OMM": {
        "subject": "EMC00003",
        "DWI_dicom": "xnat://xnat.bmia.nl/data/archive/projects/bbmri-wp3-dev/subjects/EMC00003/experiments/EMC00003_20091217_1028_MRI_HERS_OMM/scans/7/resources/DICOM"
    },
    "EMC00004_20091201_1352_MRI_HERS_OMM": {
        "subject": "EMC00004",
        "DWI_dicom": "xnat://xnat.bmia.nl/data/archive/projects/bbmri-wp3-dev/subjects/EMC00004/experiments/EMC00004_20091201_1352_MRI_HERS_OMM/scans/7/resources/DICOM"
    },
    "EMC00004_20091216_1036_MRI_HERS_OMM": {
        "subject": "EMC00004",
        "DWI_dicom": "xnat://xnat.bmia.nl/data/archive/projects/bbmri-wp3-dev/subjects/EMC00004/experiments/EMC00004_20091216_1036_MRI_HERS_OMM/scans/7/resources/DICOM"
    },
    "EMC00005_20091203_0957_MRI_HERS_OMM": {
        "subject": "EMC00005",
        "DWI_dicom": "xnat://xnat.bmia.nl/data/archive/projects/bbmri-wp3-dev/subjects/EMC00005/experiments/EMC00005_20091203_0957_MRI_HERS_OMM/scans/7/resources/DICOM"
    },
    "EMC00005_20091221_0954_MRI_HERS_OMM": {
        "subject": "EMC00005",
        "DWI_dicom": "xnat://xnat.bmia.nl/data/archive/projects/bbmri-wp3-dev/subjects/EMC00005/experiments/EMC00005_20091221_0954_MRI_HERS_OMM/scans/7/resources/DICOM"
    },
    "EMC00006_20091124_1732_MRI_HERS_OMM": {
        "subject": "EMC00006",
        "Registration_Blur_FWHM": "10",
        "DWI_dicom": "xnat://xnat.bmia.nl/data/archive/projects/bbmri-wp3-dev/subjects/EMC00006/experiments/EMC00006_20091124_1732_MRI_HERS_OMM/scans/7/resources/DICOM"
    },
    "EMC00006_20091208_1729_MRI_HERS_OMM": {
        "subject": "EMC00006",
        "DWI_dicom": "xnat://xnat.bmia.nl/data/archive/projects/bbmri-wp3-dev/subjects/EMC00006/experiments/EMC00006_20091208_1729_MRI_HERS_OMM/scans/7/resources/DICOM"
    },
    "EMC00007_20091203_1044_MRI_HERS_OMM": {
        "subject": "EMC00007",
        "DWI_dicom": "xnat://xnat.bmia.nl/data/archive/projects/bbmri-wp3-dev/subjects/EMC00007/experiments/EMC00007_20091203_1044_MRI_HERS_OMM/scans/7/resources/DICOM"
    },
    "EMC00007_20091221_1037_MRI_HERS_OMM": {
        "subject": "EMC00007",
        "DWI_dicom": "xnat://xnat.bmia.nl/data/archive/projects/bbmri-wp3-dev/subjects/EMC00007/experiments/EMC00007_20091221_1037_MRI_HERS_OMM/scans/7/resources/DICOM"
    },
    "EMC00008_20100113_0821_MRI_HERS_OMM": {
        "subject": "EMC00008",
        "DWI_dicom": "xnat://xnat.bmia.nl/data/archive/projects/bbmri-wp3-dev/subjects/EMC00008/experiments/EMC00008_20100113_0821_MRI_HERS_OMM/scans/7/resources/DICOM"
    },
    "EMC00008_20100217_1007_MRI_HERS_OMM": {
        "subject": "EMC00008",
        "DWI_dicom": "xnat://xnat.bmia.nl/data/archive/projects/bbmri-wp3-dev/subjects/EMC00008/experiments/EMC00008_20100217_1007_MRI_HERS_OMM/scans/7/resources/DICOM"
    },
    "EMC00009_20100210_1314_MRI_HERS_OMM": {
        "subject": "EMC00009",
        "DWI_dicom": "xnat://xnat.bmia.nl/data/archive/projects/bbmri-wp3-dev/subjects/EMC00009/experiments/EMC00009_20100210_1314_MRI_HERS_OMM/scans/7/resources/DICOM"
    },
    "EMC00009_20100302_1418_MRI_HERS_OMM": {
        "subject": "EMC00009",
        "DWI_dicom": "xnat://xnat.bmia.nl/data/archive/projects/bbmri-wp3-dev/subjects/EMC00009/experiments/EMC00009_20100302_1418_MRI_HERS_OMM/scans/7/resources/DICOM"
    },
    "EMC00010_20100204_1009_MRI_HERS_OMM": {
        "subject": "EMC00010",
        "DWI_dicom": "xnat://xnat.bmia.nl/data/archive/projects/bbmri-wp3-dev/subjects/EMC00010/experiments/EMC00010_20100204_1009_MRI_HERS_OMM/scans/7/resources/DICOM"
    },
    "EMC00010_20100218_1001_MRI_HERS_OMM": {
        "subject": "EMC00010",
        "DWI_dicom": "xnat://xnat.bmia.nl/data/archive/projects/bbmri-wp3-dev/subjects/EMC00010/experiments/EMC00010_20100218_1001_MRI_HERS_OMM/scans/7/resources/DICOM"
    },
    "EMC00011_20100215_1003_MRI_HERS_OMM": {
        "subject": "EMC00011",
        "DWI_dicom": "xnat://xnat.bmia.nl/data/archive/projects/bbmri-wp3-dev/subjects/EMC00011/experiments/EMC00011_20100215_1003_MRI_HERS_OMM/scans/7/resources/DICOM"
    },
    "EMC00011_20100301_0932_MRI_HERS_OMM": {
        "subject": "EMC00011",
        "DWI_dicom": "xnat://xnat.bmia.nl/data/archive/projects/bbmri-wp3-dev/subjects/EMC00011/experiments/EMC00011_20100301_0932_MRI_HERS_OMM/scans/7/resources/DICOM"
    },
    "EMC00012_20100203_1354_MRI_HERS_OMM": {
        "subject": "EMC00012",
        "DWI_dicom": "xnat://xnat.bmia.nl/data/archive/projects/bbmri-wp3-dev/subjects/EMC00012/experiments/EMC00012_20100203_1354_MRI_HERS_OMM/scans/7/resources/DICOM"
    },
    "EMC00012_20100217_1311_MRI_HERS_OMM": {
        "subject": "EMC00012",
        "DWI_dicom": "xnat://xnat.bmia.nl/data/archive/projects/bbmri-wp3-dev/subjects/EMC00012/experiments/EMC00012_20100217_1311_MRI_HERS_OMM/scans/7/resources/DICOM"
    },
    "EMC00013_20091119_1217_MRI_HERS_OMM": {
        "subject": "EMC00013",
        "DWI_dicom": "xnat://xnat.bmia.nl/data/archive/projects/bbmri-wp3-dev/subjects/EMC00013/experiments/EMC00013_20091119_1217_MRI_HERS_OMM/scans/7/resources/DICOM"
    },
    "EMC00013_20091209_1204_MRI_HERS_OMM": {
        "subject": "EMC00013",
        "DWI_dicom": "xnat://xnat.bmia.nl/data/archive/projects/bbmri-wp3-dev/subjects/EMC00013/experiments/EMC00013_20091209_1204_MRI_HERS_OMM/scans/7/resources/DICOM"
    },
    "EMC00014_20091118_0822_MRI_HERS_OMM": {
        "subject": "EMC00014",
        "DWI_dicom": "xnat://xnat.bmia.nl/data/archive/projects/bbmri-wp3-dev/subjects/EMC00014/experiments/EMC00014_20091118_0822_MRI_HERS_OMM/scans/7/resources/DICOM"
    },
    "EMC00014_20091126_1206_MRI_HERS_OMM": {
        "subject": "EMC00014",
        "DWI_dicom": "xnat://xnat.bmia.nl/data/archive/projects/bbmri-wp3-dev/subjects/EMC00014/experiments/EMC00014_20091126_1206_MRI_HERS_OMM/scans/7/resources/DICOM"
    },
    "EMC00015_20091123_1433_MRI_HERS_OMM": {
        "subject": "EMC00015",
        "DWI_dicom": "xnat://xnat.bmia.nl/data/archive/projects/bbmri-wp3-dev/subjects/EMC00015/experiments/EMC00015_20091123_1433_MRI_HERS_OMM/scans/7/resources/DICOM"
    },
    "EMC00015_20091210_1158_MRI_HERS_OMM": {
        "subject": "EMC00015",
        "DWI_dicom": "xnat://xnat.bmia.nl/data/archive/projects/bbmri-wp3-dev/subjects/EMC00015/experiments/EMC00015_20091210_1158_MRI_HERS_OMM/scans/7/resources/DICOM"
    },
    "EMC00016_20091209_1250_MRI_HERS_OMM": {
        "subject": "EMC00016",
        "DWI_dicom": "xnat://xnat.bmia.nl/data/archive/projects/bbmri-wp3-dev/subjects/EMC00016/experiments/EMC00016_20091209_1250_MRI_HERS_OMM/scans/7/resources/DICOM"
    },
    "EMC00016_20100119_1452_MRI_HERS_OMM": {
        "subject": "EMC00016",
        "DWI_dicom": "xnat://xnat.bmia.nl/data/archive/projects/bbmri-wp3-dev/subjects/EMC00016/experiments/EMC00016_20100119_1452_MRI_HERS_OMM/scans/7/resources/DICOM"
    },
    "EMC00017_20091203_1130_MRI_HERS_OMM": {
        "subject": "EMC00017",
        "DWI_dicom": "xnat://xnat.bmia.nl/data/archive/projects/bbmri-wp3-dev/subjects/EMC00017/experiments/EMC00017_20091203_1130_MRI_HERS_OMM/scans/7/resources/DICOM"
    },
    "EMC00017_20100125_1227_MRI_HERS_OMM": {
        "subject": "EMC00017",
        "DWI_dicom": "xnat://xnat.bmia.nl/data/archive/projects/bbmri-wp3-dev/subjects/EMC00017/experiments/EMC00017_20100125_1227_MRI_HERS_OMM/scans/7/resources/DICOM"
    },
    "EMC00018_20091124_1915_MRI_HERS_OMM": {
        "subject": "EMC00018",
        "DWI_dicom": "xnat://xnat.bmia.nl/data/archive/projects/bbmri-wp3-dev/subjects/EMC00018/experiments/EMC00018_20091124_1915_MRI_HERS_OMM/scans/7/resources/DICOM"
    },
    "EMC00018_20091210_1422_MRI_HERS_OMM": {
        "subject": "EMC00018",
        "DWI_dicom": "xnat://xnat.bmia.nl/data/archive/projects/bbmri-wp3-dev/subjects/EMC00018/experiments/EMC00018_20091210_1422_MRI_HERS_OMM/scans/7/resources/DICOM"
    },
    "EMC00019_20091124_1825_MRI_HERS_OMM": {
        "subject": "EMC00019",
        "DWI_dicom": "xnat://xnat.bmia.nl/data/archive/projects/bbmri-wp3-dev/subjects/EMC00019/experiments/EMC00019_20091124_1825_MRI_HERS_OMM/scans/7/resources/DICOM"
    },
    "EMC00019_20091208_1809_MRI_HERS_OMM": {
        "subject": "EMC00019",
        "DWI_dicom": "xnat://xnat.bmia.nl/data/archive/projects/bbmri-wp3-dev/subjects/EMC00019/experiments/EMC00019_20091208_1809_MRI_HERS_OMM/scans/7/resources/DICOM"
    },
    "EMC00020_20091210_1250_MRI_HERS_OMM": {
        "subject": "EMC00020",
        "DWI_dicom": "xnat://xnat.bmia.nl/data/archive/projects/bbmri-wp3-dev/subjects/EMC00020/experiments/EMC00020_20091210_1250_MRI_HERS_OMM/scans/7/resources/DICOM"
    },
    "EMC00020_20091223_0944_MRI_HERS_OMM": {
        "subject": "EMC00020",
        "DWI_dicom": "xnat://xnat.bmia.nl/data/archive/projects/bbmri-wp3-dev/subjects/EMC00020/experiments/EMC00020_20091223_0944_MRI_HERS_OMM/scans/7/resources/DICOM"
    },
    "EMC00021_20091124_2005_MRI_HERS_OMM": {
        "subject": "EMC00021",
        "DWI_dicom": "xnat://xnat.bmia.nl/data/archive/projects/bbmri-wp3-dev/subjects/EMC00021/experiments/EMC00021_20091124_2005_MRI_HERS_OMM/scans/7/resources/DICOM"
    },
    "EMC00021_20091208_1904_MRI_HERS_OMM": {
        "subject": "EMC00021",
        "DWI_dicom": "xnat://xnat.bmia.nl/data/archive/projects/bbmri-wp3-dev/subjects/EMC00021/experiments/EMC00021_20091208_1904_MRI_HERS_OMM/scans/7/resources/DICOM"
    },
    "EMC00022_20091118_1047_MRI_HERS_OMM": {
        "subject": "EMC00022",
        "DWI_dicom": "xnat://xnat.bmia.nl/data/archive/projects/bbmri-wp3-dev/subjects/EMC00022/experiments/EMC00022_20091118_1047_MRI_HERS_OMM/scans/7/resources/DICOM"
    },
    "EMC00022_20091209_1037_MRI_HERS_OMM": {
        "subject": "EMC00022",
        "DWI_dicom": "xnat://xnat.bmia.nl/data/archive/projects/bbmri-wp3-dev/subjects/EMC00022/experiments/EMC00022_20091209_1037_MRI_HERS_OMM/scans/7/resources/DICOM"
    },
    "EMC00023_20091203_1314_MRI_HERS_OMM": {
        "subject": "EMC00023",
        "DWI_dicom": "xnat://xnat.bmia.nl/data/archive/projects/bbmri-wp3-dev/subjects/EMC00023/experiments/EMC00023_20091203_1314_MRI_HERS_OMM/scans/7/resources/DICOM"
    },
    "EMC00023_20091217_0947_MRI_HERS_OMM": {
        "subject": "EMC00023",
        "DWI_dicom": "xnat://xnat.bmia.nl/data/archive/projects/bbmri-wp3-dev/subjects/EMC00023/experiments/EMC00023_20091217_0947_MRI_HERS_OMM/scans/7/resources/DICOM"
    },
    "EMC00024_20091201_1433_MRI_HERS_OMM": {
        "subject": "EMC00024",
        "DWI_dicom": "xnat://xnat.bmia.nl/data/archive/projects/bbmri-wp3-dev/subjects/EMC00024/experiments/EMC00024_20091201_1433_MRI_HERS_OMM/scans/7/resources/DICOM"
    },
    "EMC00024_20091216_1118_MRI_HERS_OMM": {
        "subject": "EMC00024",
        "DWI_dicom": "xnat://xnat.bmia.nl/data/archive/projects/bbmri-wp3-dev/subjects/EMC00024/experiments/EMC00024_20091216_1118_MRI_HERS_OMM/scans/7/resources/DICOM"
    },
    "EMC00025_20100104_0852_MRI_HERS_OMM": {
        "subject": "EMC00025",
        "DWI_dicom": "xnat://xnat.bmia.nl/data/archive/projects/bbmri-wp3-dev/subjects/EMC00025/experiments/EMC00025_20100104_0852_MRI_HERS_OMM/scans/7/resources/DICOM"
    },
    "EMC00025_20100118_1326_MRI_HERS_OMM": {
        "subject": "EMC00025",
        "DWI_dicom": "xnat://xnat.bmia.nl/data/archive/projects/bbmri-wp3-dev/subjects/EMC00025/experiments/EMC00025_20100118_1326_MRI_HERS_OMM/scans/7/resources/DICOM"
    },
     "EMC00026_20091207_0902_MRI_HERS_OMM": {
        "subject": "EMC00026",
        "DWI_dicom": "xnat://xnat.bmia.nl/data/archive/projects/bbmri-wp3-dev/subjects/EMC00026/experiments/EMC00026_20091207_0902_MRI_HERS_OMM/scans/7/resources/DICOM"
    },
    "EMC00026_20100112_1602_MRI_HERS_OMM": {
        "subject": "EMC00026",
        "DWI_dicom": "xnat://xnat.bmia.nl/data/archive/projects/bbmri-wp3-dev/subjects/EMC00026/experiments/EMC00026_20100112_1602_MRI_HERS_OMM/scans/7/resources/DICOM"
    },
      "EMC00027_20091214_0824_MRI_HERS_OMM": {
        "subject": "EMC00027",
        "DWI_dicom": "xnat://xnat.bmia.nl/data/archive/projects/bbmri-wp3-dev/subjects/EMC00027/experiments/EMC00027_20091214_0824_MRI_HERS_OMM/scans/7/resources/DICOM"
    },
    "EMC00027_20100104_0727_MRI_HERS_OMM": {
        "subject": "EMC00027",
        "DWI_dicom": "xnat://xnat.bmia.nl/data/archive/projects/bbmri-wp3-dev/subjects/EMC00027/experiments/EMC00027_20100104_0727_MRI_HERS_OMM/scans/7/resources/DICOM"
    },
     "EMC00028_20091123_0827_MRI_HERS_OMM": {
        "subject": "EMC00028",
        "DWI_dicom": "xnat://xnat.bmia.nl/data/archive/projects/bbmri-wp3-dev/subjects/EMC00028/experiments/EMC00028_20091123_0827_MRI_HERS_OMM/scans/7/resources/DICOM"
    },
    "EMC00028_20091209_1120_MR_HER": {
        "subject": "EMC00028",
        "DWI_dicom": "xnat://xnat.bmia.nl/data/archive/projects/bbmri-wp3-dev/subjects/EMC00028/experiments/EMC00028_20091209_1120_MR_HER/scans/7/resources/DICOM"
    },
    "EMC00029_20100118_0802_MRI_HERS_OMM": {
        "subject": "EMC00029",
        "DWI_dicom": "xnat://xnat.bmia.nl/data/archive/projects/bbmri-wp3-dev/subjects/EMC00029/experiments/EMC00029_20100118_0802_MRI_HERS_OMM/scans/7/resources/DICOM"
    },
    "EMC00029_20100201_0806_MRI_HERS_OMM": {
        "subject": "EMC00029",
        "DWI_dicom": "xnat://xnat.bmia.nl/data/archive/projects/bbmri-wp3-dev/subjects/EMC00029/experiments/EMC00029_20100201_0806_MRI_HERS_OMM/scans/7/resources/DICOM"
    },
    "EMC00030_20091209_0907_MRI_HERS_OMM": {
        "subject": "EMC00030",
        "DWI_dicom": "xnat://xnat.bmia.nl/data/archive/projects/bbmri-wp3-dev/subjects/EMC00030/experiments/EMC00030_20091209_0907_MRI_HERS_OMM/scans/7/resources/DICOM"
    },
    "EMC00030_20100111_1006_MRI_HERS_OMM": {
        "subject": "EMC00030",
        "DWI_dicom": "xnat://xnat.bmia.nl/data/archive/projects/bbmri-wp3-dev/subjects/EMC00030/experiments/EMC00030_20100111_1006_MRI_HERS_OMM/scans/7/resources/DICOM"
    },
    "EMC00031_20100506_0743_MRI_HERS_OMM": {
        "subject": "EMC00031",
        "DWI_dicom": "xnat://xnat.bmia.nl/data/archive/projects/bbmri-wp3-dev/subjects/EMC00031/experiments/EMC00031_20100506_0743_MRI_HERS_OMM/scans/7/resources/DICOM"
    },
    "EMC00031_20100708_1051_MRI_HERS_OMM": {
        "subject": "EMC00031",
        "DWI_dicom": "xnat://xnat.bmia.nl/data/archive/projects/bbmri-wp3-dev/subjects/EMC00031/experiments/EMC00031_20100708_1051_MRI_HERS_OMM/scans/9/resources/DICOM"
    },
    "EMC00032_20071119_1450_MRI_HERS_OMM": {
        "subject": "EMC00032",
        "DWI_dicom": "xnat://xnat.bmia.nl/data/archive/projects/bbmri-wp3-dev/subjects/EMC00032/experiments/EMC00032_20071119_1450_MRI_HERS_OMM/scans/7/resources/DICOM"
    },
    "EMC00032_20080115_1505_MRI_HERS_OMM": {
        "subject": "EMC00032",
        "Weight": "0.1",
        "DWI_dicom": "xnat://xnat.bmia.nl/data/archive/projects/bbmri-wp3-dev/subjects/EMC00032/experiments/EMC00032_20080115_1505_MRI_HERS_OMM/scans/7/resources/DICOM"
    },
    "EMC00033_20071107_1023_MRI_HERS_OMM": {
        "subject": "EMC00033",
        "DWI_dicom": "xnat://xnat.bmia.nl/data/archive/projects/bbmri-wp3-dev/subjects/EMC00033/experiments/EMC00033_20071107_1023_MRI_HERS_OMM/scans/7/resources/DICOM"
    },
    "EMC00033_20071212_1341_MRI_HERS_OMM": {
        "subject": "EMC00033",
        "DWI_dicom": "xnat://xnat.bmia.nl/data/archive/projects/bbmri-wp3-dev/subjects/EMC00033/experiments/EMC00033_20071212_1341_MRI_HERS_OMM/scans/7/resources/DICOM"
    },
    "EMC00034_20071107_1238_MRI_HERS_OMM": {
        "subject": "EMC00034",
        "DWI_dicom": "xnat://xnat.bmia.nl/data/archive/projects/bbmri-wp3-dev/subjects/EMC00034/experiments/EMC00034_20071107_1238_MRI_HERS_OMM/scans/7/resources/DICOM"
    },
    "EMC00034_20071212_1429_MRI_HERS_OMM": {
        "subject": "EMC00034",
        "DWI_dicom": "xnat://xnat.bmia.nl/data/archive/projects/bbmri-wp3-dev/subjects/EMC00034/experiments/EMC00034_20071212_1429_MRI_HERS_OMM/scans/7/resources/DICOM"
    },
    "EMC00035_20071119_1101_MRI_HERS_OMM": {
        "subject": "EMC00035",
        "DWI_dicom": "xnat://xnat.bmia.nl/data/archive/projects/bbmri-wp3-dev/subjects/EMC00035/experiments/EMC00035_20071119_1101_MRI_HERS_OMM/scans/7/resources/DICOM"
    },
    "EMC00035_20071219_1551_MRI_HERS_OMM": {
        "subject": "EMC00035",
        "DWI_dicom": "xnat://xnat.bmia.nl/data/archive/projects/bbmri-wp3-dev/subjects/EMC00035/experiments/EMC00035_20071219_1551_MRI_HERS_OMM/scans/7/resources/DICOM"
    },
    "EMC00036_20100603_1219_MRI_HERS_OMM": {
        "subject": "EMC00036",
        "DWI_dicom": "xnat://xnat.bmia.nl/data/archive/projects/bbmri-wp3-dev/subjects/EMC00036/experiments/EMC00036_20100603_1219_MRI_HERS_OMM/scans/7/resources/DICOM"
    },
    "EMC00036_20100701_1046_MR_HERS_OMM": {
        "subject": "EMC00036",
        "DWI_dicom": "xnat://xnat.bmia.nl/data/archive/projects/bbmri-wp3-dev/subjects/EMC00036/experiments/EMC00036_20100701_1046_MR_HERS_OMM/scans/7/resources/DICOM"
    },
    "EMC00037_20100603_1311_MRI_HERS_OMM": {
        "subject": "EMC00037",
        "DWI_dicom": "xnat://xnat.bmia.nl/data/archive/projects/bbmri-wp3-dev/subjects/EMC00037/experiments/EMC00037_20100603_1311_MRI_HERS_OMM/scans/9/resources/DICOM"
    },
    "EMC00037_20100701_0925_MR_HERS_OMM": {
        "subject": "EMC00037",
        "DWI_dicom": "xnat://xnat.bmia.nl/data/archive/projects/bbmri-wp3-dev/subjects/EMC00037/experiments/EMC00037_20100701_0925_MR_HERS_OMM/scans/9/resources/DICOM"
    },
    "EMC00038_20071217_0917_MRI_HERS_OMM": {
        "subject": "EMC00038",
        "DWI_dicom": "xnat://xnat.bmia.nl/data/archive/projects/bbmri-wp3-dev/subjects/EMC00038/experiments/EMC00038_20071217_0917_MRI_HERS_OMM/scans/7/resources/DICOM"
    },
    "EMC00038_20080114_1236_MRI_HERS_OMM": {
        "subject": "EMC00038",
        "DWI_dicom": "xnat://xnat.bmia.nl/data/archive/projects/bbmri-wp3-dev/subjects/EMC00038/experiments/EMC00038_20080114_1236_MRI_HERS_OMM/scans/7/resources/DICOM"
    },
    "EMC00039_20080114_0928_MRI_HERS_OMM": {
        "subject": "EMC00039",
        "DWI_dicom": "xnat://xnat.bmia.nl/data/archive/projects/bbmri-wp3-dev/subjects/EMC00039/experiments/EMC00039_20080114_0928_MRI_HERS_OMM/scans/7/resources/DICOM"
    },
    "EMC00039_20080211_0849_MRI_HERS_OMM": {
        "subject": "EMC00039",
        "DWI_dicom": "xnat://xnat.bmia.nl/data/archive/projects/bbmri-wp3-dev/subjects/EMC00039/experiments/EMC00039_20080211_0849_MRI_HERS_OMM/scans/7/resources/DICOM"
    },
    "EMC00040_20071122_1015_MRI_HERS_OMM": {
        "subject": "EMC00040",
        "DWI_dicom": "xnat://xnat.bmia.nl/data/archive/projects/bbmri-wp3-dev/subjects/EMC00040/experiments/EMC00040_20071122_1015_MRI_HERS_OMM/scans/7/resources/DICOM"
    },
    "EMC00040_20071218_1429_MRI_HERS_OMM": {
        "subject": "EMC00040",
        "DWI_dicom": "xnat://xnat.bmia.nl/data/archive/projects/bbmri-wp3-dev/subjects/EMC00040/experiments/EMC00040_20071218_1429_MRI_HERS_OMM/scans/7/resources/DICOM"
    },
    "EMC00041_20071119_1401_MRI_HERS_OMM": {
        "subject": "EMC00041",
        "DWI_dicom": "xnat://xnat.bmia.nl/data/archive/projects/bbmri-wp3-dev/subjects/EMC00041/experiments/EMC00041_20071119_1401_MRI_HERS_OMM/scans/7/resources/DICOM"
    },
    "EMC00041_20071212_1643_MRI_HERS_OMM": {
        "subject": "EMC00041",
        "DWI_dicom": "xnat://xnat.bmia.nl/data/archive/projects/bbmri-wp3-dev/subjects/EMC00041/experiments/EMC00041_20071212_1643_MRI_HERS_OMM/scans/7/resources/DICOM"
    },
    "EMC00042_20071120_1516_MRI_HERS_OMM": {
        "subject": "EMC00042",
        "DWI_dicom": "xnat://xnat.bmia.nl/data/archive/projects/bbmri-wp3-dev/subjects/EMC00042/experiments/EMC00042_20071120_1516_MRI_HERS_OMM/scans/7/resources/DICOM"
    },
    "EMC00042_20071213_1310_MRI_HERS_OMM": {
        "subject": "EMC00042",
        "DWI_dicom": "xnat://xnat.bmia.nl/data/archive/projects/bbmri-wp3-dev/subjects/EMC00042/experiments/EMC00042_20071213_1310_MRI_HERS_OMM/scans/5/resources/DICOM"
    },
    "EMC00043_20071119_1226_MRI_HERS_OMM": {
        "subject": "EMC00043",
        "DWI_dicom": "xnat://xnat.bmia.nl/data/archive/projects/bbmri-wp3-dev/subjects/EMC00043/experiments/EMC00043_20071119_1226_MRI_HERS_OMM/scans/7/resources/DICOM"
    },
    "EMC00043_20071212_1509_MRI_HERS_OMM": {
        "subject": "EMC00043",
        "DWI_dicom": "xnat://xnat.bmia.nl/data/archive/projects/bbmri-wp3-dev/subjects/EMC00043/experiments/EMC00043_20071212_1509_MRI_HERS_OMM/scans/7/resources/DICOM"
    },
    "EMC00044_20071119_1306_MRI_HERS_OMM": {
        "subject": "EMC00044",
        "DWI_dicom": "xnat://xnat.bmia.nl/data/archive/projects/bbmri-wp3-dev/subjects/EMC00044/experiments/EMC00044_20071119_1306_MRI_HERS_OMM/scans/7/resources/DICOM"
    },
    "EMC00044_20071212_1550_MRI_HERS_OMM": {
        "subject": "EMC00044",
        "DWI_dicom": "xnat://xnat.bmia.nl/data/archive/projects/bbmri-wp3-dev/subjects/EMC00044/experiments/EMC00044_20071212_1550_MRI_HERS_OMM/scans/7/resources/DICOM"
    },
    "EMC00045_20071122_0843_MRI_HERS_OMM": {
        "subject": "EMC00045",
        "DWI_dicom": "xnat://xnat.bmia.nl/data/archive/projects/bbmri-wp3-dev/subjects/EMC00045/experiments/EMC00045_20071122_0843_MRI_HERS_OMM/scans/7/resources/DICOM"
    },
    "EMC00045_20071213_0757_MRI_HERS_OMM": {
        "subject": "EMC00045",
        "DWI_dicom": "xnat://xnat.bmia.nl/data/archive/projects/bbmri-wp3-dev/subjects/EMC00045/experiments/EMC00045_20071213_0757_MRI_HERS_OMM/scans/7/resources/DICOM"
    },
    "EMC00046_20071121_0804_MRI_HERS_OMM": {
        "subject": "EMC00046",
        "DWI_dicom": "xnat://xnat.bmia.nl/data/archive/projects/bbmri-wp3-dev/subjects/EMC00046/experiments/EMC00046_20071121_0804_MRI_HERS_OMM/scans/7/resources/DICOM"
    },
    "EMC00046_20071212_1254_MRI_HERS_OMM": {
        "subject": "EMC00046",
        "DWI_dicom": "xnat://xnat.bmia.nl/data/archive/projects/bbmri-wp3-dev/subjects/EMC00046/experiments/EMC00046_20071212_1254_MRI_HERS_OMM/scans/7/resources/DICOM"
    },
    "EMC00047_20100615_1356_MRI_HERS_OMM": {
        "subject": "EMC00047",
        "DWI_dicom": "xnat://xnat.bmia.nl/data/archive/projects/bbmri-wp3-dev/subjects/EMC00047/experiments/EMC00047_20100615_1356_MRI_HERS_OMM/scans/5/resources/DICOM"
    },
    "EMC00047_20100705_1000_MRI_HERS_OMM": {
        "subject": "EMC00047",
        "DWI_dicom": "xnat://xnat.bmia.nl/data/archive/projects/bbmri-wp3-dev/subjects/EMC00047/experiments/EMC00047_20100705_1000_MRI_HERS_OMM/scans/5/resources/DICOM"
    },
    "EMC00048_20100527_1433_MR_HERS_OMM": {
        "subject": "EMC00048",
        "DWI_dicom": "xnat://xnat.bmia.nl/data/archive/projects/bbmri-wp3-dev/subjects/EMC00048/experiments/EMC00048_20100527_1433_MR_HERS_OMM/scans/5/resources/DICOM"
    },
    "EMC00048_20100614_0956_MRI_HERS_OMM": {
        "subject": "EMC00048",
        "DWI_dicom": "xnat://xnat.bmia.nl/data/archive/projects/bbmri-wp3-dev/subjects/EMC00048/experiments/EMC00048_20100614_0956_MRI_HERS_OMM/scans/5/resources/DICOM"
    },
    "EMC00049_20100603_1040_MRI_HERS_OMM": {
        "subject": "EMC00049",
        "DWI_dicom": "xnat://xnat.bmia.nl/data/archive/projects/bbmri-wp3-dev/subjects/EMC00049/experiments/EMC00049_20100603_1040_MRI_HERS_OMM/scans/7/resources/DICOM"
    },
    "EMC00049_20100621_1335_MRI_HERS_OMM": {
        "subject": "EMC00049",
        "DWI_dicom": "xnat://xnat.bmia.nl/data/archive/projects/bbmri-wp3-dev/subjects/EMC00049/experiments/EMC00049_20100621_1335_MRI_HERS_OMM/scans/5/resources/DICOM"
    },
    "EMC00050_20100527_1340_MR_HERS_OMM": {
        "subject": "EMC00050",
        "DWI_dicom": "xnat://xnat.bmia.nl/data/archive/projects/bbmri-wp3-dev/subjects/EMC00050/experiments/EMC00050_20100527_1340_MR_HERS_OMM/scans/6/resources/DICOM"
    },
    "EMC00050_20100614_0906_MRI_HERS_OMM": {
        "subject": "EMC00050",
        "DWI_dicom": "xnat://xnat.bmia.nl/data/archive/projects/bbmri-wp3-dev/subjects/EMC00050/experiments/EMC00050_20100614_0906_MRI_HERS_OMM/scans/5/resources/DICOM"
    },
    "EMC00051_20100607_1218_MR_HERS_OMM": {
        "subject": "EMC00051",
        "DWI_dicom": "xnat://xnat.bmia.nl/data/archive/projects/bbmri-wp3-dev/subjects/EMC00051/experiments/EMC00051_20100607_1218_MR_HERS_OMM/scans/5/resources/DICOM"
    },
    "EMC00051_20100624_0753_MRI_HERS_OMM": {
        "subject": "EMC00051",
        "DWI_dicom": "xnat://xnat.bmia.nl/data/archive/projects/bbmri-wp3-dev/subjects/EMC00051/experiments/EMC00051_20100624_0753_MRI_HERS_OMM/scans/5/resources/DICOM"
    },
    "EMC00052_20100601_1514_MRI_HERS_OMM": {
        "subject": "EMC00052",
        "DWI_dicom": "xnat://xnat.bmia.nl/data/archive/projects/bbmri-wp3-dev/subjects/EMC00052/experiments/EMC00052_20100601_1514_MRI_HERS_OMM/scans/5/resources/DICOM"
    },
    "EMC00052_20100617_1330_MRI_HERS_OMMOORD": {
        "subject": "EMC00052",
        "DWI_dicom": "xnat://xnat.bmia.nl/data/archive/projects/bbmri-wp3-dev/subjects/EMC00052/experiments/EMC00052_20100617_1330_MRI_HERS_OMMOORD/scans/5/resources/DICOM"
    },
    "EMC00053_20071127_1727_MRI_HERS_OMM": {
        "subject": "EMC00053",
        "DWI_dicom": "xnat://xnat.bmia.nl/data/archive/projects/bbmri-wp3-dev/subjects/EMC00053/experiments/EMC00053_20071127_1727_MRI_HERS_OMM/scans/7/resources/DICOM"
    },
    "EMC00053_20071213_1009_MRI_HERS_OMM": {
        "subject": "EMC00053",
        "DWI_dicom": "xnat://xnat.bmia.nl/data/archive/projects/bbmri-wp3-dev/subjects/EMC00053/experiments/EMC00053_20071213_1009_MRI_HERS_OMM/scans/7/resources/DICOM"
    },
    "EMC00054_20100510_1001_MRI_HERS_OMM": {
        "subject": "EMC00054",
        "DWI_dicom": "xnat://xnat.bmia.nl/data/archive/projects/bbmri-wp3-dev/subjects/EMC00054/experiments/EMC00054_20100510_1001_MRI_HERS_OMM/scans/7/resources/DICOM"
    },
    "EMC00054_20100525_1313_e_1_MRI_HERS_OMM": {
        "subject": "EMC00054",
        "DWI_dicom": "xnat://xnat.bmia.nl/data/archive/projects/bbmri-wp3-dev/subjects/EMC00054/experiments/EMC00054_20100525_1313_e_1_MRI_HERS_OMM/scans/5/resources/DICOM"
    },
    "EMC00055_20100511_1456_MRI_HERS_OMM": {
        "subject": "EMC00055",
        "DWI_dicom": "xnat://xnat.bmia.nl/data/archive/projects/bbmri-wp3-dev/subjects/EMC00055/experiments/EMC00055_20100511_1456_MRI_HERS_OMM/scans/7/resources/DICOM"
    },
    "EMC00055_20100526_1212_MRI_HERS_OMM": {
        "subject": "EMC00055",
        "DWI_dicom": "xnat://xnat.bmia.nl/data/archive/projects/bbmri-wp3-dev/subjects/EMC00055/experiments/EMC00055_20100526_1212_MRI_HERS_OMM/scans/5/resources/DICOM"
    },
    "EMC00056_20100511_1315_MRI_HERS_OMM": {
        "subject": "EMC00056",
        "DWI_dicom": "xnat://xnat.bmia.nl/data/archive/projects/bbmri-wp3-dev/subjects/EMC00056/experiments/EMC00056_20100511_1315_MRI_HERS_OMM/scans/7/resources/DICOM"
    },
    "EMC00056_20100526_1259_MRI_HERS_OMM": {
        "subject": "EMC00056",
        "DWI_dicom": "xnat://xnat.bmia.nl/data/archive/projects/bbmri-wp3-dev/subjects/EMC00056/experiments/EMC00056_20100526_1259_MRI_HERS_OMM/scans/5/resources/DICOM"
    },
    "EMC00057_20071127_1521_MRI_HERS_OMM": {
        "subject": "EMC00057",
        "DWI_dicom": "xnat://xnat.bmia.nl/data/archive/projects/bbmri-wp3-dev/subjects/EMC00057/experiments/EMC00057_20071127_1521_MRI_HERS_OMM/scans/8/resources/DICOM"
    },
    "EMC00057_20071212_1859_MRI_HERS_OMM": {
        "subject": "EMC00057",
        "DWI_dicom": "xnat://xnat.bmia.nl/data/archive/projects/bbmri-wp3-dev/subjects/EMC00057/experiments/EMC00057_20071212_1859_MRI_HERS_OMM/scans/7/resources/DICOM"
    },
    "EMC00058_20100614_0736_MRI_HERS_OMM": {
        "subject": "EMC00058",
        "DWI_dicom": "xnat://xnat.bmia.nl/data/archive/projects/bbmri-wp3-dev/subjects/EMC00058/experiments/EMC00058_20100614_0736_MRI_HERS_OMM/scans/7/resources/DICOM"
    },
    "EMC00058_20100628_0758_MRI_HERS_OMM": {
        "subject": "EMC00058",
        "DWI_dicom": "xnat://xnat.bmia.nl/data/archive/projects/bbmri-wp3-dev/subjects/EMC00058/experiments/EMC00058_20100628_0758_MRI_HERS_OMM/scans/5/resources/DICOM"
    },
    "EMC00059_20100517_0828_MRI_HERS_OMM": {
        "subject": "EMC00059",
        "DWI_dicom": "xnat://xnat.bmia.nl/data/archive/projects/bbmri-wp3-dev/subjects/EMC00059/experiments/EMC00059_20100517_0828_MRI_HERS_OMM/scans/5/resources/DICOM"
    },
    "EMC00059_20100531_0823_MRI_HERS_OMM": {
        "subject": "EMC00059",
        "DWI_dicom": "xnat://xnat.bmia.nl/data/archive/projects/bbmri-wp3-dev/subjects/EMC00059/experiments/EMC00059_20100531_0823_MRI_HERS_OMM/scans/5/resources/DICOM"
    },
    "EMC00060_20100506_1052_MRI_HERS_OMM": {
        "subject": "EMC00060",
        "DWI_dicom": "xnat://xnat.bmia.nl/data/archive/projects/bbmri-wp3-dev/subjects/EMC00060/experiments/EMC00060_20100506_1052_MRI_HERS_OMM/scans/7/resources/DICOM"
    },
       "EMC00060_20100520_0956_MRI_HERS_OMM": {
        "subject": "EMC00060",
        "DWI_dicom": "xnat://xnat.bmia.nl/data/archive/projects/bbmri-wp3-dev/subjects/EMC00060/experiments/EMC00060_20100520_0956_MRI_HERS_OMM/scans/5/resources/DICOM"
    },
    "EMC00061_20100505_1056_MRI_HERS_OMM": {
        "subject": "EMC00061",
        "DWI_dicom": "xnat://xnat.bmia.nl/data/archive/projects/bbmri-wp3-dev/subjects/EMC00061/experiments/EMC00061_20100505_1056_MRI_HERS_OMM/scans/7/resources/DICOM"
    },
    "EMC00061_20100519_1008_MRI_HERS_OMM": {
        "subject": "EMC00061",
        "DWI_dicom": "xnat://xnat.bmia.nl/data/archive/projects/bbmri-wp3-dev/subjects/EMC00061/experiments/EMC00061_20100519_1008_MRI_HERS_OMM/scans/5/resources/DICOM"
    },
    "EMC00062_20100525_1611_MRI_HERS_OMM": {
        "subject": "EMC00062",
        "DWI_dicom": "xnat://xnat.bmia.nl/data/archive/projects/bbmri-wp3-dev/subjects/EMC00062/experiments/EMC00062_20100525_1611_MRI_HERS_OMM/scans/7/resources/DICOM"
    },
    "EMC00062_20100608_1348_MRI_HERS_OMM": {
        "subject": "EMC00062",
        "DWI_dicom": "xnat://xnat.bmia.nl/data/archive/projects/bbmri-wp3-dev/subjects/EMC00062/experiments/EMC00062_20100608_1348_MRI_HERS_OMM/scans/5/resources/DICOM"
    },
    "EMC00063_20100531_0909_MRI_HERS_OMM": {
        "subject": "EMC00063",
        "DWI_dicom": "xnat://xnat.bmia.nl/data/archive/projects/bbmri-wp3-dev/subjects/EMC00063/experiments/EMC00063_20100531_0909_MRI_HERS_OMM/scans/7/resources/DICOM"
    },
    "EMC00063_20100614_1042_MRI_HERS_OMM": {
        "subject": "EMC00063",
        "DWI_dicom": "xnat://xnat.bmia.nl/data/archive/projects/bbmri-wp3-dev/subjects/EMC00063/experiments/EMC00063_20100614_1042_MRI_HERS_OMM/scans/5/resources/DICOM"
    },
    "EMC00064_20100505_1008_MRI_HERS_OMM": {
        "subject": "EMC00064",
        "DWI_dicom": "xnat://xnat.bmia.nl/data/archive/projects/bbmri-wp3-dev/subjects/EMC00064/experiments/EMC00064_20100505_1008_MRI_HERS_OMM/scans/7/resources/DICOM"
    },
    "EMC00064_20100519_0910_MRI_HERS_OMM": {
        "subject": "EMC00064",
        "DWI_dicom": "xnat://xnat.bmia.nl/data/archive/projects/bbmri-wp3-dev/subjects/EMC00064/experiments/EMC00064_20100519_0910_MRI_HERS_OMM/scans/5/resources/DICOM"
    },
    "EMC00065_20100607_0820_e_1_MR_HERS_OMM": {
        "subject": "EMC00065",
        "DWI_dicom": "xnat://xnat.bmia.nl/data/archive/projects/bbmri-wp3-dev/subjects/EMC00065/experiments/EMC00065_20100607_0820_e_1_MR_HERS_OMM/scans/5/resources/DICOM"
    },
    "EMC00065_20100621_0859_MR_HERS_OMM": {
        "subject": "EMC00065",
        "DWI_dicom": "xnat://xnat.bmia.nl/data/archive/projects/bbmri-wp3-dev/subjects/EMC00065/experiments/EMC00065_20100621_0859_MR_HERS_OMM/scans/5/resources/DICOM"
    },
    "EMC00066_20100607_0955_MR_HERS_OMM": {
        "subject": "EMC00066",
        "DWI_dicom": "xnat://xnat.bmia.nl/data/archive/projects/bbmri-wp3-dev/subjects/EMC00066/experiments/EMC00066_20100607_0955_MR_HERS_OMM/scans/5/resources/DICOM"
    },
    "EMC00066_20100621_1010_MRI_HERS_OMM": {
        "subject": "EMC00066",
        "DWI_dicom": "xnat://xnat.bmia.nl/data/archive/projects/bbmri-wp3-dev/subjects/EMC00066/experiments/EMC00066_20100621_1010_MRI_HERS_OMM/scans/5/resources/DICOM"
    },
    "EMC00067_20100525_1525_MRI_HERS_OMM": {
        "subject": "EMC00067",
        "DWI_dicom": "xnat://xnat.bmia.nl/data/archive/projects/bbmri-wp3-dev/subjects/EMC00067/experiments/EMC00067_20100525_1525_MRI_HERS_OMM/scans/6/resources/DICOM"
    },
    "EMC00067_20100608_1259_MRI_HERS_OMM": {
        "subject": "EMC00067",
        "DWI_dicom": "xnat://xnat.bmia.nl/data/archive/projects/bbmri-wp3-dev/subjects/EMC00067/experiments/EMC00067_20100608_1259_MRI_HERS_OMM/scans/5/resources/DICOM"
    },
    "EMC00068_20100506_0834_MRI_HERS_OMM": {
        "subject": "EMC00068",
        "DWI_dicom": "xnat://xnat.bmia.nl/data/archive/projects/bbmri-wp3-dev/subjects/EMC00068/experiments/EMC00068_20100506_0834_MRI_HERS_OMM/scans/7/resources/DICOM"
    },
    "EMC00068_20100520_0741_MRI_HERS_OMM": {
        "subject": "EMC00068",
        "DWI_dicom": "xnat://xnat.bmia.nl/data/archive/projects/bbmri-wp3-dev/subjects/EMC00068/experiments/EMC00068_20100520_0741_MRI_HERS_OMM/scans/5/resources/DICOM"
    },
    "EMC00069_20071129_1014_MRI_HERS_OMM": {
        "subject": "EMC00069",
        "DWI_dicom": "xnat://xnat.bmia.nl/data/archive/projects/bbmri-wp3-dev/subjects/EMC00069/experiments/EMC00069_20071129_1014_MRI_HERS_OMM/scans/7/resources/DICOM"
    },
    "EMC00069_20071213_0842_MRI_HERS_OMM": {
        "subject": "EMC00069",
        "DWI_dicom": "xnat://xnat.bmia.nl/data/archive/projects/bbmri-wp3-dev/subjects/EMC00069/experiments/EMC00069_20071213_0842_MRI_HERS_OMM/scans/7/resources/DICOM"
    },
    "EMC00070_20071205_0944_MRI_HERS_OMM": {
        "subject": "EMC00070",
        "DWI_dicom": "xnat://xnat.bmia.nl/data/archive/projects/bbmri-wp3-dev/subjects/EMC00070/experiments/EMC00070_20071205_0944_MRI_HERS_OMM/scans/7/resources/DICOM"
    },
    "EMC00070_20071219_1510_MRI_HERS_OMM": {
        "subject": "EMC00070",
        "DWI_dicom": "xnat://xnat.bmia.nl/data/archive/projects/bbmri-wp3-dev/subjects/EMC00070/experiments/EMC00070_20071219_1510_MRI_HERS_OMM/scans/7/resources/DICOM"
    },
    "EMC00071_20080114_1100_MRI_HERS_OMM": {
        "subject": "EMC00071",
        "DWI_dicom": "xnat://xnat.bmia.nl/data/archive/projects/bbmri-wp3-dev/subjects/EMC00071/experiments/EMC00071_20080114_1100_MRI_HERS_OMM/scans/7/resources/DICOM"
    },
    "EMC00071_20080128_1315_MRI_HERS_OMM": {
        "subject": "EMC00071",
        "DWI_dicom": "xnat://xnat.bmia.nl/data/archive/projects/bbmri-wp3-dev/subjects/EMC00071/experiments/EMC00071_20080128_1315_MRI_HERS_OMM/scans/7/resources/DICOM"
    },
    "EMC00072_20071129_1229_MRI_HERS_OMM": {
        "subject": "EMC00072",
        "DWI_dicom": "xnat://xnat.bmia.nl/data/archive/projects/bbmri-wp3-dev/subjects/EMC00072/experiments/EMC00072_20071129_1229_MRI_HERS_OMM/scans/7/resources/DICOM"
    },
    "EMC00072_20071213_1224_MRI_HERS_OMM": {
        "subject": "EMC00072",
        "DWI_dicom": "xnat://xnat.bmia.nl/data/archive/projects/bbmri-wp3-dev/subjects/EMC00072/experiments/EMC00072_20071213_1224_MRI_HERS_OMM/scans/7/resources/DICOM"
    },
    "EMC00073_20071203_1006_MRI_HERS_OMM": {
        "subject": "EMC00073",
        "DWI_dicom": "xnat://xnat.bmia.nl/data/archive/projects/bbmri-wp3-dev/subjects/EMC00073/experiments/EMC00073_20071203_1006_MRI_HERS_OMM/scans/7/resources/DICOM"
    },
    "EMC00073_20071217_1003_MRI_HERS_OMM": {
        "subject": "EMC00073",
        "DWI_dicom": "xnat://xnat.bmia.nl/data/archive/projects/bbmri-wp3-dev/subjects/EMC00073/experiments/EMC00073_20071217_1003_MRI_HERS_OMM/scans/7/resources/DICOM"
    },
    "EMC00074_20071206_0929_MRI_HERS_OMM": {
        "subject": "EMC00074",
        "DWI_dicom": "xnat://xnat.bmia.nl/data/archive/projects/bbmri-wp3-dev/subjects/EMC00074/experiments/EMC00074_20071206_0929_MRI_HERS_OMM/scans/7/resources/DICOM"
    },
    "EMC00074_20071219_1723_MRI_HERS_OMM": {
        "subject": "EMC00074",
        "DWI_dicom": "xnat://xnat.bmia.nl/data/archive/projects/bbmri-wp3-dev/subjects/EMC00074/experiments/EMC00074_20071219_1723_MRI_HERS_OMM/scans/7/resources/DICOM"
    },
    "EMC00075_20100505_0828_MRI_HERS_OMM": {
        "subject": "EMC00075",
        "DWI_dicom": "xnat://xnat.bmia.nl/data/archive/projects/bbmri-wp3-dev/subjects/EMC00075/experiments/EMC00075_20100505_0828_MRI_HERS_OMM/scans/7/resources/DICOM"
    },
    "EMC00075_20100517_0741_MRI_HERS_OMM": {
        "subject": "EMC00075",
        "DWI_dicom": "xnat://xnat.bmia.nl/data/archive/projects/bbmri-wp3-dev/subjects/EMC00075/experiments/EMC00075_20100517_0741_MRI_HERS_OMM/scans/5/resources/DICOM"
    },
    "EMC00076_20071203_0751_MRI_HERS_OMM": {
        "subject": "EMC00076",
        "DWI_dicom": "xnat://xnat.bmia.nl/data/archive/projects/bbmri-wp3-dev/subjects/EMC00076/experiments/EMC00076_20071203_0751_MRI_HERS_OMM/scans/7/resources/DICOM"
    },
    "EMC00076_20071213_0712_MRI_HERS_OMM": {
        "subject": "EMC00076",
        "DWI_dicom": "xnat://xnat.bmia.nl/data/archive/projects/bbmri-wp3-dev/subjects/EMC00076/experiments/EMC00076_20071213_0712_MRI_HERS_OMM/scans/7/resources/DICOM"
    },
    "EMC00077_20080114_1147_MRI_HERS_OMM": {
        "subject": "EMC00077",
        "DWI_dicom": "xnat://xnat.bmia.nl/data/archive/projects/bbmri-wp3-dev/subjects/EMC00077/experiments/EMC00077_20080114_1147_MRI_HERS_OMM/scans/7/resources/DICOM"
    },
    "EMC00077_20080124_1148_MRI_HERS_OMM": {
        "subject": "EMC00077",
        "DWI_dicom": "xnat://xnat.bmia.nl/data/archive/projects/bbmri-wp3-dev/subjects/EMC00077/experiments/EMC00077_20080124_1148_MRI_HERS_OMM/scans/7/resources/DICOM"
    },
    "EMC00078_20100510_1220_MRI_HERS_OMM": {
        "subject": "EMC00078",
        "DWI_dicom": "xnat://xnat.bmia.nl/data/archive/projects/bbmri-wp3-dev/subjects/EMC00078/experiments/EMC00078_20100510_1220_MRI_HERS_OMM/scans/7/resources/DICOM"
    },
    "EMC00078_20100519_1057_MRI_HERS_OMM": {
        "subject": "EMC00078",
        "Weight": "0.1",
        "DWI_dicom": "xnat://xnat.bmia.nl/data/archive/projects/bbmri-wp3-dev/subjects/EMC00078/experiments/EMC00078_20100519_1057_MRI_HERS_OMM/scans/5/resources/DICOM"
    },
    "EMC00079_20080128_0713_MRI_HERS_OMM": {
        "subject": "EMC00079",
        "DWI_dicom": "xnat://xnat.bmia.nl/data/archive/projects/bbmri-wp3-dev/subjects/EMC00079/experiments/EMC00079_20080128_0713_MRI_HERS_OMM/scans/7/resources/DICOM"
    },
    "EMC00079_20080206_1315_MRI_HERS_OMM": {
        "subject": "EMC00079",
        "DWI_dicom": "xnat://xnat.bmia.nl/data/archive/projects/bbmri-wp3-dev/subjects/EMC00079/experiments/EMC00079_20080206_1315_MRI_HERS_OMM/scans/7/resources/DICOM"
    },
    "EMC00080_20080114_1317_MRI_HERS_OMM": {
        "subject": "EMC00080",
        "DWI_dicom": "xnat://xnat.bmia.nl/data/archive/projects/bbmri-wp3-dev/subjects/EMC00080/experiments/EMC00080_20080114_1317_MRI_HERS_OMM/scans/7/resources/DICOM"
    },
    "EMC00080_20080123_1356_MRI_HERS_OMM": {
        "subject": "EMC00080",
        "DWI_dicom": "xnat://xnat.bmia.nl/data/archive/projects/bbmri-wp3-dev/subjects/EMC00080/experiments/EMC00080_20080123_1356_MRI_HERS_OMM/scans/7/resources/DICOM"
    },
    "EMC00081_20071203_1309_MRI_HERS_OMM": {
        "subject": "EMC00081",
        "DWI_dicom": "xnat://xnat.bmia.nl/data/archive/projects/bbmri-wp3-dev/subjects/EMC00081/experiments/EMC00081_20071203_1309_MRI_HERS_OMM/scans/7/resources/DICOM"
    },
    "EMC00081_20071212_1801_MRI_HERS_OMM": {
        "subject": "EMC00081",
        "DWI_dicom": "xnat://xnat.bmia.nl/data/archive/projects/bbmri-wp3-dev/subjects/EMC00081/experiments/EMC00081_20071212_1801_MRI_HERS_OMM/scans/7/resources/DICOM"
    },
    "EMC00082_20071206_0842_MRI_HERS_OMM": {
        "subject": "EMC00082",
        "DWI_dicom": "xnat://xnat.bmia.nl/data/archive/projects/bbmri-wp3-dev/subjects/EMC00082/experiments/EMC00082_20071206_0842_MRI_HERS_OMM/scans/7/resources/DICOM"
    },
    "EMC00082_20071213_0922_MRI_HERS_OMM": {
        "subject": "EMC00082",
        "DWI_dicom": "xnat://xnat.bmia.nl/data/archive/projects/bbmri-wp3-dev/subjects/EMC00082/experiments/EMC00082_20071213_0922_MRI_HERS_OMM/scans/7/resources/DICOM"
    },
    "EMC00083_20071206_0759_MRI_HERS_OMM": {
        "subject": "EMC00083",
        "DWI_dicom": "xnat://xnat.bmia.nl/data/archive/projects/bbmri-wp3-dev/subjects/EMC00083/experiments/EMC00083_20071206_0759_MRI_HERS_OMM/scans/7/resources/DICOM"
    },
    "EMC00083_20071213_1354_MRI_HERS_OMM": {
        "subject": "EMC00083",
        "DWI_dicom": "xnat://xnat.bmia.nl/data/archive/projects/bbmri-wp3-dev/subjects/EMC00083/experiments/EMC00083_20071213_1354_MRI_HERS_OMM/scans/7/resources/DICOM"
    },
    "EMC00084_20071206_1018_MRI_HERS_OMM": {
        "subject": "EMC00084",
        "DWI_dicom": "xnat://xnat.bmia.nl/data/archive/projects/bbmri-wp3-dev/subjects/EMC00084/experiments/EMC00084_20071206_1018_MRI_HERS_OMM/scans/7/resources/DICOM"
    },
    "EMC00084_20071213_1144_MRI_HERS_OMM": {
        "subject": "EMC00084",
        "DWI_dicom": "xnat://xnat.bmia.nl/data/archive/projects/bbmri-wp3-dev/subjects/EMC00084/experiments/EMC00084_20071213_1144_MRI_HERS_OMM/scans/7/resources/DICOM"
    },
    "EMC00085_20080310_1106_MRI_HERS_OMM": {
        "subject": "EMC00085",
        "DWI_dicom": "xnat://xnat.bmia.nl/data/archive/projects/bbmri-wp3-dev/subjects/EMC00085/experiments/EMC00085_20080310_1106_MRI_HERS_OMM/scans/7/resources/DICOM"
    },
    "EMC00085_20080311_1636_MRI_HERS_OMM": {
        "subject": "EMC00085",
        "DWI_dicom": "xnat://xnat.bmia.nl/data/archive/projects/bbmri-wp3-dev/subjects/EMC00085/experiments/EMC00085_20080311_1636_MRI_HERS_OMM/scans/7/resources/DICOM"
    }
}
