{
 "add_total_row": 1,
 "creation": "2020-05-05 18:07:11.546023",
 "disable_prepared_report": 0,
 "disabled": 0,
 "docstatus": 0,
 "doctype": "Report",
 "idx": 0,
 "is_standard": "Yes",
 "modified": "2020-05-07 22:51:35.157592",
 "modified_by": "Administrator",
 "module": "CSF TZ",
 "name": "ITX 230.01.E \u2013 Withholding Tax Statement",
 "owner": "Administrator",
 "prepared_report": 0,
 "query": "SELECT cmp.tax_id AS \"TIN:Data:0\",\n       pi.company AS \"Withhoder:Data:0\",\n       cmp.p_o_box AS \"P O Box:Data:0\",\n       cmp.city AS \"City:Data:0\",\n       cmp.plot_number AS \"Plot No.:Data:0\",\n       cmp.block_number AS \"Block No.:Data:0\",\n       cmp.street AS \"Street:Data:0\",\n       cmp.phone_no AS \"Phone:Data:0\",\n       cmp.fax AS \"Fax:Data:0\",\n       cmp.email AS \"Email:Data:0\",\n       pi.tax_id AS \"Withholdee TIN:Data:0\",\n       pi.supplier AS \"Withholdee:Data:0\",\n       pii.base_amount AS \"Gross Payment:Currency:0\",\n       (pii.withholding_tax_rate/100) * pii.base_amount AS \"Tax Withheld:Currency:0\"\nFROM `tabPurchase Invoice` pi LEFT JOIN `tabPurchase Invoice Item` pii ON pi.name = pii.parent\n                              LEFT JOIN `tabCompany` cmp ON pi.company = cmp.company_name\nWHERE pii.withholding_tax_rate > 0\nAND   pi.docstatus = 1\nAND   pi.posting_date >= %(from_date)s \nAND   pi.posting_date <= %(to_date)s",
 "ref_doctype": "Purchase Invoice",
 "report_name": "ITX 230.01.E \u2013 Withholding Tax Statement",
 "report_type": "Query Report",
 "roles": []
}