Номер,Название,13
1,Алтайский край,6
2,"Федеральная территория ""Сириус""",20
3,Краснодарский край,22
4,Красноярский край,8
5,Приморский край,32
7,Ставропольский край,55
8,Хабаровский край,28
10,Амурская область,83
11,Архангельская область,20
12,Астраханская область,44
14,Белгородская область,88
15,Брянская область,62
17,Владимирская область,43
18,Волгоградская область,58
19,Вологодская область,77
20,Воронежская область,36
22,Нижегородская область,52
24,Ивановская область,29
25,Иркутская область,95
26,Республика Ингушетия,86
27,Калининградская область,90
28,Тверская область,60
29,Калужская область,72
30,Камчатский край,8
32,Кемеровская область - Кузбасс,38
33,Кировская область,27
34,Костромская область,63
35,Республика Крым,22
36,Самарская область,17
37,Курганская область,70
38,Курская область,62
40,Город Санкт-Петербург город федерального значения,73
41,Ленинградская область,58
42,Липецкая область,67
44,Магаданская область,75
45,Город Москва столица Российской Федерации город федерального значения,72
46,Московская область,65
47,Мурманская область,30
47,"Сельские населенные пункты областного подчинения Мурманской области, находящиеся в ведении федеральных органов государственной власти и управления/",22
47,нп Видяево,39
47,нп Чан-Ручей,52
49,Новгородская область,50
50,Новосибирская область,4
52,Омская область,89
53,Оренбургская область,15
53,"Сельские населенные пункты областного подчинения Оренбургской области, находящиеся в ведении федеральных органов государственной власти и управления/",84
53,п Комаровский,6
54,Орловская область,23
56,Пензенская область,78
57,Пермский край,69
58,Псковская область,50
60,Ростовская область,39
61,Рязанская область,93
63,Саратовская область,87
63,Сельские населенные пункты областного значения Саратовской области/,3
63,п Михайловский,35
63,п Новооктябрьский,5
63,п Светлый,60
64,Сахалинская область,83
65,Свердловская область,45
66,Смоленская область,78
67,Город федерального значения Севастополь,93
68,Тамбовская область,3
69,Томская область,42
70,Тульская область,23
71,Тюменская область,55
73,Ульяновская область,89
75,Челябинская область,72
76,Забайкальский край,35
77,Чукотский автономный округ,40
78,Ярославская область,60
79,Республика Адыгея (Адыгея),48
80,Республика Башкортостан,85
81,Республика Бурятия,91
82,Республика Дагестан,0
83,Кабардино-Балкарская Республика,92
84,Республика Алтай,7
85,Республика Калмыкия,61
86,Республика Карелия,13
87,Республика Коми,45
88,Республика Марий Эл,79
89,Республика Мордовия,76
90,Республика Северная Осетия-Алания,83
91,Карачаево-Черкесская Республика,1
92,Республика Татарстан (Татарстан),80
93,Республика Тыва,48
94,Удмуртская Республика,0
95,Республика Хакасия,87
96,Чеченская Республика,58
97,Чувашская Республика - Чувашия,13
98,Республика Саха (Якутия),1
99,Еврейская автономная область,78
