﻿{
    "version":  "8.3.7.2027",
    "description":  "1C:Enterprise 8.3 All Clients",
	"url":  "ftp://user53013:hXZOMtfXY5hh@93.189.41.9/8.3.7.2027_Windows_RePack.zip#/dl.7z",
	"hash": "435d4a119764a8998a76e2077d0ad371e712ac4d5f7fec9d28b3e50a1d13609e",
    "homepage":  "http://v8.1c.ru/overview/Platform.htm",
	"installer": {
		"script": [
			"Remove-Item $dir\\*.cmd",
			"Write-Host 'Extracting setup files...' -ForegroundColor Yellow",
			"7z x -r -y -o\"$dir\" $dir\\1cEntRepack.exe *.*",
			"$ArgList = \"/i `\"$dir\\1CEnterprise8.msi`\" /qn TRANSFORMS=1049.mst INSTALLSRVRASSRVC=1 DESIGNERALLCLIENTS=1 THICKCLIENT=1 THINCLIENTFILE=1 THINCLIENT=1 WEBSERVEREXT=1 SERVER=0 CONFREPOSSERVER=1 SERVERCLIENT=1	 LANGUAGES=RU USEHWLICENSES=1 HASPInstall=no \"",
			"Write-Host 'Start setup...' -ForegroundColor Yellow",
			"sudo Start-Process msiexec.exe -Wait -ArgumentList \"$ArgList\"",
			"Remove-Item $dir\\* -Recurse -Exclude *.json,*.msi"
		]
	},
    "uninstaller": {
		"script": [
			"sudo Start-Process msiexec.exe -Wait -ArgumentList \"/x `\"$dir\\1CEnterprise8.msi`\" /qn\""
		]
    },
	"depends": "sudo"
}
