{
    "homepage": "http://oscript.io",
	"version":  "1.9.0",
    "url":  "https://oscript.io/downloads/latest/x64/OneScript-1.9.0-x64.exe",
    "env_add_path": "bin",
    "installer": {
        "args": [
            "/VERYSILENT",
            "/NOCLOSEAPPLICATIONS",
            "/DIR=$dir"
        ]
    },
    "uninstaller": {
        "file": "unins000.exe",
        "args": [
            "/VERYSILENT"
        ]
    },
    "post_install": [
		"Write-Host \"opm update -all\" -ForegroundColor Yellow",
		"opm update -all"
		]
}
