﻿{
    "version":  "8.3.13.1809",
    "description":  "1C:Enterprise 8.3 All Clients",
	"url":  "ftp://user53013:hXZOMtfXY5hh@93.189.41.9/8.3.13.1809_Windows_Repack_x86.zip#/dl.7z",
    "homepage":  "http://v8.1c.ru/overview/Platform.htm",
	"installer": {
		"script": [
			"Remove-Item $dir\\*.cmd",
			"Write-Host 'Decompress setup files...' -ForegroundColor Yellow",
			"7z x -r -y -o\"$dir\" $dir\\1cEntRepack_x86.exe *.*",
			"Remove-Item $dir\\1cEntRepack_x86.exe",
			"$ArgList = \"/i `\"$dir\\1CEnterprise8.msi`\" /qn TRANSFORMS=1049.mst INSTALLSRVRASSRVC=0 DESIGNERALLCLIENTS=1 THICKCLIENT=1 THINCLIENTFILE=1 THINCLIENT=1 WEBSERVEREXT=0 SERVER=0 CONFREPOSSERVER=1 SERVERCLIENT=0 LANGUAGES=RU USEHWLICENSES=1 HASPInstall=no \"",
			"Write-Host 'Start setup...' -ForegroundColor Yellow",
			"sudo Start-Process msiexec.exe -Wait -ArgumentList \"$ArgList\"",
			"Remove-Item $dir\\* -Recurse -Exclude *.json,*.msi"
		]
	},
    "uninstaller": {
		"script": [
			"sudo Start-Process msiexec.exe -Wait -ArgumentList \"/x `\"$dir\\1CEnterprise8.msi`\" /qn\""
		]
    },
	"depends": "sudo"
}
