﻿{
    "version":  "8.3.10.2580",
    "description":  "1C:Enterprise 8.3 Server",
    "homepage":  "http://v8.1c.ru/overview/Platform.htm", 
    "url":  "ftp://user53013:hXZOMtfXY5hh@93.189.41.9/1c.windows.8.3.10.2580.zip",
	"hash": "SHA256:92e505dadcd86385c9283971a75e2ee69878dbb62f443b41ddb75407466dac6c",
    "installer": {
		"script": [
			"$ArgList = \"/i `\"$dir\\1CEnterprise 8.msi`\" /qn TRANSFORMS=1049.mst INSTALLSRVRASSRVC=0 DESIGNERALLCLIENTS=0 THICKCLIENT=0 THINCLIENTFILE=0 THINCLIENT=0 WEBSERVEREXT=1 SERVER=1 CONFREPOSSERVER=0 SERVERCLIENT=0 LANGUAGES=RU\"",
			"Start-Process msiexec.exe -Wait -ArgumentList \"$ArgList\"",
			"Remove-Item $dir\\* -Exclude *.json,Setup.ini"
		]
    },
    "uninstaller": {
		"script": [
			"$ProductCode=''",
			"foreach($str in Get-Content $dir\\Setup.ini) {if($str.StartsWith('ProductCode')){$ProductCode = (ConvertFrom-StringData $str).ProductCode}}",
			"Start-Process msiexec.exe -Wait -ArgumentList \"/x $ProductCode /qn\""
		]
    }
}
