﻿{
    "homepage": "http://www.7-zip.org/",
    "description": "A free and open-source file archiver with a high compression ratio  ",
    "license": "http://www.7-zip.org/license.txt",
    "version": "18.05",
	"url": "ftp://user53013:hXZOMtfXY5hh@93.189.41.9/7z1805-x64.msi",
	"hash": "898c1ca0015183fe2ba7d55cacf0a1dea35e873bf3f8090f362a6288c6ef08d7",
    "extract_dir": "Files/7-Zip",
    "bin": "7z.exe",
    "shortcuts": [
        [
            "7zFM.exe",
            "7-Zip"
        ]
    ]
}