main.c:78:5:main	112	static
main.c:170:6:SystemClock_Config	240	static
main.c:226:13:MX_USART2_UART_Init	8	static
main.c:259:13:MX_DMA_Init	16	static
main.c:277:13:MX_GPIO_Init	40	static
main.c:322:6:Thread3	56	static
main.c:353:6:Thread1	40	static
main.c:376:6:Thread2	48	static
main.c:405:6:HAL_TIM_PeriodElapsedCallback	16	static
main.c:422:6:Error_Handler	4	static,ignoring_inline_asm
