main.c:75:5:main	160	static
main.c:209:6:SystemClock_Config	104	static
main.c:261:13:MX_SPI1_Init	8	static
main.c:301:13:MX_TIM6_Init	24	static
main.c:337:13:MX_DMA_Init	16	static
main.c:355:13:MX_GPIO_Init	48	static
main.c:405:6:Error_Handler	4	static
