fast_math.h:27:7:constexpr FastMathClass::FastMathClass()	16	static
display.cpp:31:1:Display::Display()	16	static
display.cpp:39:6:void Display::initDisplay()	16	static
display.cpp:56:6:void Display::drawArc(uint16_t, uint16_t)	32	static
display.cpp:70:6:void Display::drawMainScreen(char*, uint16_t, Display::Time_t*)	24	static
display.cpp:89:6:void Display::drawMemberScreen(char*, uint16_t, uint16_t, uint16_t, uint16_t)	40	static
display.cpp:107:6:void Display::drawTime(Display::Time_t*)	32	static
display.cpp:153:6:void Display::drawNameWithTag(char*, uint16_t)	40	static
display.cpp:177:6:void Display::setDistance(uint16_t, uint16_t, uint16_t)	48	static
display.cpp:209:6:void Display::setName(char*, uint16_t, uint16_t, uint16_t)	32	static
display.cpp:230:6:void Display::centerTextCust(char*, uint16_t, uint8_t)	32	static
display.cpp:248:6:void Display::customTextposition(char*, uint16_t, uint16_t, uint16_t)	24	static
display.cpp:266:6:void Display::setCursorOffset(uint16_t, uint16_t)	16	static
display.cpp:281:6:void Display::setLineNum(uint8_t)	16	static
display.cpp:294:8:size_t Display::printcrlf()	24	static
display.cpp:309:8:size_t Display::println(char*, uint16_t)	32	static
display.cpp:323:8:size_t Display::print(char*, uint16_t)	40	static
display.cpp:346:8:size_t Display::writeStream(const uint8_t*, size_t)	32	static
display.cpp:367:6:void Display::drawLynqLabel(uint16_t)	32	static
display.cpp:384:6:void Display::drawShape(Display::Shape_t, uint16_t, void*)	168	static
display.cpp:566:11:uint8_t* Display::getDisplayPtr(uint16_t)	16	static
display.cpp:583:7:void Display::setDisplayPtr(uint16_t, uint8_t)	16	static
display.cpp:597:6:void Display::testTrigFunct()	16	static
display.cpp:634:6:void Display::testShapes()	16	static
display.cpp:647:6:void Display::testCharacters()	24	static
display.cpp:664:30:void __static_initialization_and_destruction_0(int, int)	16	static
display.cpp:664:30:cpp)	8	static
