^C:\USERS\RONB\SOURCE\REPOS\MFC PROJECTS\LANDNAVAPPPOC\MFC BOILERPLATE TEMPLATE\LANDNAVAPP.CPP
/c /ZI /JMC /nologo /W3 /WX- /diagnostics:classic /Od /Oy- /D WIN32 /D _DEBUG /D _WINDOWS /D _UNICODE /D UNICODE /Gm- /EHsc /RTC1 /MTd /GS /fp:precise /Zc:wchar_t /Zc:forScope /Zc:inline /Fo"DEBUG\\" /Fd"DEBUG\VC141.PDB" /Gd /TP /analyze- /FC C:\USERS\RONB\SOURCE\REPOS\MFC PROJECTS\LANDNAVAPPPOC\MFC BOILERPLATE TEMPLATE\LANDNAVAPP.CPP
^C:\USERS\RONB\SOURCE\REPOS\MFC PROJECTS\LANDNAVAPPPOC\MFC BOILERPLATE TEMPLATE\LANDNAVIGATION.CPP
/c /ZI /JMC /nologo /W3 /WX- /diagnostics:classic /Od /Oy- /D WIN32 /D _DEBUG /D _WINDOWS /D _UNICODE /D UNICODE /Gm- /EHsc /RTC1 /MTd /GS /fp:precise /Zc:wchar_t /Zc:forScope /Zc:inline /Fo"DEBUG\\" /Fd"DEBUG\VC141.PDB" /Gd /TP /analyze- /FC C:\USERS\RONB\SOURCE\REPOS\MFC PROJECTS\LANDNAVAPPPOC\MFC BOILERPLATE TEMPLATE\LANDNAVIGATION.CPP
^C:\USERS\RONB\SOURCE\REPOS\MFC PROJECTS\LANDNAVAPPPOC\MFC BOILERPLATE TEMPLATE\MAIN.CPP
/c /ZI /JMC /nologo /W3 /WX- /diagnostics:classic /Od /Oy- /D WIN32 /D _DEBUG /D _WINDOWS /D _UNICODE /D UNICODE /Gm- /EHsc /RTC1 /MTd /GS /fp:precise /Zc:wchar_t /Zc:forScope /Zc:inline /Fo"DEBUG\\" /Fd"DEBUG\VC141.PDB" /Gd /TP /analyze- /FC C:\USERS\RONB\SOURCE\REPOS\MFC PROJECTS\LANDNAVAPPPOC\MFC BOILERPLATE TEMPLATE\MAIN.CPP
^C:\USERS\RONB\SOURCE\REPOS\MFC PROJECTS\LANDNAVAPPPOC\MFC BOILERPLATE TEMPLATE\XSLEEP.CPP
/c /ZI /JMC /nologo /W3 /WX- /diagnostics:classic /Od /Oy- /D WIN32 /D _DEBUG /D _WINDOWS /D _UNICODE /D UNICODE /Gm- /EHsc /RTC1 /MTd /GS /fp:precise /Zc:wchar_t /Zc:forScope /Zc:inline /Fo"DEBUG\\" /Fd"DEBUG\VC141.PDB" /Gd /TP /analyze- /FC C:\USERS\RONB\SOURCE\REPOS\MFC PROJECTS\LANDNAVAPPPOC\MFC BOILERPLATE TEMPLATE\XSLEEP.CPP
