^D:\MY CODE\C++\MFC PROJECTS\LANDNAVAPP\MFC BOILERPLATE TEMPLATE\RELEASE\INTERFACE1.RES|D:\MY CODE\C++\MFC PROJECTS\LANDNAVAPP\MFC BOILERPLATE TEMPLATE\RELEASE\LANDNAVAPP.OBJ|D:\MY CODE\C++\MFC PROJECTS\LANDNAVAPP\MFC BOILERPLATE TEMPLATE\RELEASE\LANDNAVIGATION.OBJ|D:\MY CODE\C++\MFC PROJECTS\LANDNAVAPP\MFC BOILERPLATE TEMPLATE\RELEASE\MAIN.OBJ|D:\MY CODE\C++\MFC PROJECTS\LANDNAVAPP\MFC BOILERPLATE TEMPLATE\RELEASE\XSLEEP.OBJ
D:\MY CODE\C++\MFC PROJECTS\LANDNAVAPP\MFC BOILERPLATE TEMPLATE\RELEASE\INTERFACE1.RES
D:\MY CODE\C++\MFC PROJECTS\LANDNAVAPP\MFC BOILERPLATE TEMPLATE\RELEASE\LANDNAVAPP.OBJ
D:\MY CODE\C++\MFC PROJECTS\LANDNAVAPP\MFC BOILERPLATE TEMPLATE\RELEASE\LANDNAVIGATION.OBJ
D:\MY CODE\C++\MFC PROJECTS\LANDNAVAPP\MFC BOILERPLATE TEMPLATE\RELEASE\MAIN.OBJ
D:\MY CODE\C++\MFC PROJECTS\LANDNAVAPP\MFC BOILERPLATE TEMPLATE\RELEASE\XSLEEP.OBJ
C:\WINDOWS\GLOBALIZATION\SORTING\SORTDEFAULT.NLS
D:\PROGRAM FILES\VS2010\VC\BIN\C2.DLL
D:\PROGRAM FILES\VS2010\VC\ATLMFC\LIB\UAFXCW.LIB
D:\PROGRAM FILES\VS2010\VC\LIB\LIBCMT.LIB
C:\PROGRAM FILES (X86)\MICROSOFT SDKS\WINDOWS\V7.0A\LIB\KERNEL32.LIB
C:\PROGRAM FILES (X86)\MICROSOFT SDKS\WINDOWS\V7.0A\LIB\USER32.LIB
C:\PROGRAM FILES (X86)\MICROSOFT SDKS\WINDOWS\V7.0A\LIB\GDI32.LIB
C:\PROGRAM FILES (X86)\MICROSOFT SDKS\WINDOWS\V7.0A\LIB\MSIMG32.LIB
C:\PROGRAM FILES (X86)\MICROSOFT SDKS\WINDOWS\V7.0A\LIB\COMDLG32.LIB
C:\PROGRAM FILES (X86)\MICROSOFT SDKS\WINDOWS\V7.0A\LIB\WINSPOOL.LIB
C:\PROGRAM FILES (X86)\MICROSOFT SDKS\WINDOWS\V7.0A\LIB\ADVAPI32.LIB
C:\PROGRAM FILES (X86)\MICROSOFT SDKS\WINDOWS\V7.0A\LIB\SHELL32.LIB
C:\PROGRAM FILES (X86)\MICROSOFT SDKS\WINDOWS\V7.0A\LIB\COMCTL32.LIB
C:\PROGRAM FILES (X86)\MICROSOFT SDKS\WINDOWS\V7.0A\LIB\SHLWAPI.LIB
C:\PROGRAM FILES (X86)\MICROSOFT SDKS\WINDOWS\V7.0A\LIB\WINDOWSCODECS.LIB
C:\PROGRAM FILES (X86)\MICROSOFT SDKS\WINDOWS\V7.0A\LIB\UUID.LIB
D:\PROGRAM FILES\VS2010\VC\ATLMFC\LIB\ATLS.LIB
C:\PROGRAM FILES (X86)\MICROSOFT SDKS\WINDOWS\V7.0A\LIB\OLE32.LIB
C:\PROGRAM FILES (X86)\MICROSOFT SDKS\WINDOWS\V7.0A\LIB\OLEAUT32.LIB
C:\PROGRAM FILES (X86)\MICROSOFT SDKS\WINDOWS\V7.0A\LIB\GDIPLUS.LIB
D:\PROGRAM FILES\VS2010\VC\LIB\OLDNAMES.LIB
C:\PROGRAM FILES (X86)\MICROSOFT SDKS\WINDOWS\V7.0A\LIB\WS2_32.LIB
C:\PROGRAM FILES (X86)\MICROSOFT SDKS\WINDOWS\V7.0A\LIB\MSWSOCK.LIB
C:\PROGRAM FILES (X86)\MICROSOFT SDKS\WINDOWS\V7.0A\LIB\OLEACC.LIB
D:\PROGRAM FILES\VS2010\VC\LIB\COMSUPPW.LIB
C:\PROGRAM FILES (X86)\MICROSOFT SDKS\WINDOWS\V7.0A\LIB\IMM32.LIB
C:\PROGRAM FILES (X86)\MICROSOFT SDKS\WINDOWS\V7.0A\LIB\WINMM.LIB
C:\PROGRAM FILES (X86)\MICROSOFT SDKS\WINDOWS\V7.0A\LIB\MSXML2.LIB
C:\PROGRAM FILES (X86)\MICROSOFT SDKS\WINDOWS\V7.0A\LIB\OLEDLG.LIB
C:\PROGRAM FILES (X86)\MICROSOFT SDKS\WINDOWS\V7.0A\LIB\URLMON.LIB
D:\PROGRAM FILES\VS2010\VC\BIN\1033\LINKUI.DLL
D:\PROGRAM FILES\VS2010\VC\BIN\CVTRES.EXE
C:\WINDOWS\SYSTEM32\TZRES.DLL
C:\WINDOWS\SYSTEM32\RSAENH.DLL
