^D:\MY CODE\C++\CUSTOMCONTAINERS\CUSTOMCONTAINERS\MAIN.CPP
D:\MY CODE\C++\CUSTOMCONTAINERS\CUSTOMCONTAINERS\DEBUG\VC120.PDB
D:\MY CODE\C++\CUSTOMCONTAINERS\CUSTOMCONTAINERS\DEBUG\VC120.IDB
D:\MY CODE\C++\CUSTOMCONTAINERS\CUSTOMCONTAINERS\DEBUG\MAIN.OBJ
^C:\USERS\RONB\SOURCE\REPOS\CUSTOMCONTAINERS\CUSTOMCONTAINERS\MAIN.CPP
C:\USERS\RONB\SOURCE\REPOS\CUSTOMCONTAINERS\CUSTOMCONTAINERS\DEBUG\VC141.PDB
C:\USERS\RONB\SOURCE\REPOS\CUSTOMCONTAINERS\CUSTOMCONTAINERS\DEBUG\VC141.IDB
C:\USERS\RONB\SOURCE\REPOS\CUSTOMCONTAINERS\CUSTOMCONTAINERS\DEBUG\MAIN.OBJ
