^D:\MY CODE\C++\CUSTOMCONTAINERS\CUSTOMCONTAINERS\DEBUG\MAIN.OBJ
/OUT:"D:\MY CODE\C++\CUSTOMCONTAINERS\DEBUG\CUSTOMCONTAINERS.EXE" /INCREMENTAL /NOLOGO kernel32.lib user32.lib gdi32.lib winspool.lib comdlg32.lib advapi32.lib shell32.lib ole32.lib oleaut32.lib uuid.lib odbc32.lib odbccp32.lib /MANIFEST /MANIFESTUAC:"level='asInvoker' uiAccess='false'" /manifest:embed /DEBUG /PDB:"D:\MY CODE\C++\CUSTOMCONTAINERS\DEBUG\CUSTOMCONTAINERS.PDB" /TLBID:1 /DYNAMICBASE /NXCOMPAT /IMPLIB:"D:\MY CODE\C++\CUSTOMCONTAINERS\DEBUG\CUSTOMCONTAINERS.LIB" /MACHINE:X86 DEBUG\MAIN.OBJ
^C:\USERS\RONB\SOURCE\REPOS\CUSTOMCONTAINERS\CUSTOMCONTAINERS\DEBUG\MAIN.OBJ
/OUT:"C:\USERS\RONB\SOURCE\REPOS\CUSTOMCONTAINERS\DEBUG\CUSTOMCONTAINERS.EXE" /INCREMENTAL /NOLOGO KERNEL32.LIB USER32.LIB GDI32.LIB WINSPOOL.LIB COMDLG32.LIB ADVAPI32.LIB SHELL32.LIB OLE32.LIB OLEAUT32.LIB UUID.LIB ODBC32.LIB ODBCCP32.LIB /MANIFEST /MANIFESTUAC:"level='asInvoker' uiAccess='false'" /manifest:embed /DEBUG:FASTLINK /PDB:"C:\USERS\RONB\SOURCE\REPOS\CUSTOMCONTAINERS\DEBUG\CUSTOMCONTAINERS.PDB" /TLBID:1 /DYNAMICBASE /NXCOMPAT /IMPLIB:"C:\USERS\RONB\SOURCE\REPOS\CUSTOMCONTAINERS\DEBUG\CUSTOMCONTAINERS.LIB" /MACHINE:X86 DEBUG\MAIN.OBJ
