^D:\MY CODE\C++\BUFFEROVERFLOW\BUFFEROVERFLOWEXAMPLE\BUFFEROVERFLOWEXAMPLE\MAIN.CPP
D:\MY CODE\C++\BUFFEROVERFLOW\BUFFEROVERFLOWEXAMPLE\BUFFEROVERFLOWEXAMPLE\DEBUG\VC120.PDB
D:\MY CODE\C++\BUFFEROVERFLOW\BUFFEROVERFLOWEXAMPLE\BUFFEROVERFLOWEXAMPLE\DEBUG\VC120.IDB
D:\MY CODE\C++\BUFFEROVERFLOW\BUFFEROVERFLOWEXAMPLE\BUFFEROVERFLOWEXAMPLE\DEBUG\MAIN.OBJ
^C:\USERS\RONB\SOURCE\REPOS\BUFFEROVERFLOW\BUFFEROVERFLOWEXAMPLE\BUFFEROVERFLOWEXAMPLE\MAIN.CPP
C:\USERS\RONB\SOURCE\REPOS\BUFFEROVERFLOW\BUFFEROVERFLOWEXAMPLE\BUFFEROVERFLOWEXAMPLE\DEBUG\VC141.PDB
C:\USERS\RONB\SOURCE\REPOS\BUFFEROVERFLOW\BUFFEROVERFLOWEXAMPLE\BUFFEROVERFLOWEXAMPLE\DEBUG\VC141.IDB
C:\USERS\RONB\SOURCE\REPOS\BUFFEROVERFLOW\BUFFEROVERFLOWEXAMPLE\BUFFEROVERFLOWEXAMPLE\DEBUG\MAIN.OBJ
