-- Merging decision tree log ---
manifest
ADDED from C:\Users\RonB\AndroidStudioProjects\AndroidCourses\Ex_Files_Android_SDK_Animation_Transition\Ch05\05_01\CrossFade\app\src\main\AndroidManifest.xml:2:1-41:12
INJECTED from C:\Users\RonB\AndroidStudioProjects\AndroidCourses\Ex_Files_Android_SDK_Animation_Transition\Ch05\05_01\CrossFade\app\src\main\AndroidManifest.xml:2:1-41:12
INJECTED from C:\Users\RonB\AndroidStudioProjects\AndroidCourses\Ex_Files_Android_SDK_Animation_Transition\Ch05\05_01\CrossFade\app\src\main\AndroidManifest.xml:2:1-41:12
INJECTED from C:\Users\RonB\AndroidStudioProjects\AndroidCourses\Ex_Files_Android_SDK_Animation_Transition\Ch05\05_01\CrossFade\app\src\main\AndroidManifest.xml:2:1-41:12
MERGED from [com.android.support:design:23.3.0] C:\Users\RonB\.gradle\caches\transforms-2\files-2.1\7b0d284c35a17c9c0b37224c750bacfe\design-23.3.0\AndroidManifest.xml:17:1-24:12
MERGED from [com.android.support:appcompat-v7:23.3.0] C:\Users\RonB\.gradle\caches\transforms-2\files-2.1\edf9b1036bba906e2c1e92a525008ebd\appcompat-v7-23.3.0\AndroidManifest.xml:17:1-27:12
MERGED from [com.android.support:animated-vector-drawable:23.3.0] C:\Users\RonB\.gradle\caches\transforms-2\files-2.1\b7ecc649464e3f3e2162064fd272bcb0\animated-vector-drawable-23.3.0\AndroidManifest.xml:2:1-9:12
MERGED from [com.android.support:support-vector-drawable:23.3.0] C:\Users\RonB\.gradle\caches\transforms-2\files-2.1\6d0b8437ec9faa57ec725e5ac83fab08\support-vector-drawable-23.3.0\AndroidManifest.xml:2:1-9:12
MERGED from [com.android.support:recyclerview-v7:23.3.0] C:\Users\RonB\.gradle\caches\transforms-2\files-2.1\bec95f201c55d500e5a0f18f1cc6e325\recyclerview-v7-23.3.0\AndroidManifest.xml:17:1-22:12
MERGED from [com.android.support:support-v4:23.3.0] C:\Users\RonB\.gradle\caches\transforms-2\files-2.1\1209f5b34d2b452934200e99f385e47e\support-v4-23.3.0\AndroidManifest.xml:17:1-24:12
INJECTED from C:\Users\RonB\AndroidStudioProjects\AndroidCourses\Ex_Files_Android_SDK_Animation_Transition\Ch05\05_01\CrossFade\app\src\main\AndroidManifest.xml:2:1-41:12
INJECTED from C:\Users\RonB\AndroidStudioProjects\AndroidCourses\Ex_Files_Android_SDK_Animation_Transition\Ch05\05_01\CrossFade\app\src\main\AndroidManifest.xml:2:1-41:12
INJECTED from C:\Users\RonB\AndroidStudioProjects\AndroidCourses\Ex_Files_Android_SDK_Animation_Transition\Ch05\05_01\CrossFade\app\src\main\AndroidManifest.xml:2:1-41:12
	package
		ADDED from C:\Users\RonB\AndroidStudioProjects\AndroidCourses\Ex_Files_Android_SDK_Animation_Transition\Ch05\05_01\CrossFade\app\src\main\AndroidManifest.xml:3:5-41
		INJECTED from C:\Users\RonB\AndroidStudioProjects\AndroidCourses\Ex_Files_Android_SDK_Animation_Transition\Ch05\05_01\CrossFade\app\src\main\AndroidManifest.xml
		INJECTED from C:\Users\RonB\AndroidStudioProjects\AndroidCourses\Ex_Files_Android_SDK_Animation_Transition\Ch05\05_01\CrossFade\app\src\main\AndroidManifest.xml
	android:versionName
		INJECTED from C:\Users\RonB\AndroidStudioProjects\AndroidCourses\Ex_Files_Android_SDK_Animation_Transition\Ch05\05_01\CrossFade\app\src\main\AndroidManifest.xml
		ADDED from C:\Users\RonB\AndroidStudioProjects\AndroidCourses\Ex_Files_Android_SDK_Animation_Transition\Ch05\05_01\CrossFade\app\src\main\AndroidManifest.xml:2:1-41:12
		INJECTED from C:\Users\RonB\AndroidStudioProjects\AndroidCourses\Ex_Files_Android_SDK_Animation_Transition\Ch05\05_01\CrossFade\app\src\main\AndroidManifest.xml
	android:versionCode
		INJECTED from C:\Users\RonB\AndroidStudioProjects\AndroidCourses\Ex_Files_Android_SDK_Animation_Transition\Ch05\05_01\CrossFade\app\src\main\AndroidManifest.xml
		ADDED from C:\Users\RonB\AndroidStudioProjects\AndroidCourses\Ex_Files_Android_SDK_Animation_Transition\Ch05\05_01\CrossFade\app\src\main\AndroidManifest.xml:2:1-41:12
		INJECTED from C:\Users\RonB\AndroidStudioProjects\AndroidCourses\Ex_Files_Android_SDK_Animation_Transition\Ch05\05_01\CrossFade\app\src\main\AndroidManifest.xml
	xmlns:android
		ADDED from C:\Users\RonB\AndroidStudioProjects\AndroidCourses\Ex_Files_Android_SDK_Animation_Transition\Ch05\05_01\CrossFade\app\src\main\AndroidManifest.xml:2:11-69
application
ADDED from C:\Users\RonB\AndroidStudioProjects\AndroidCourses\Ex_Files_Android_SDK_Animation_Transition\Ch05\05_01\CrossFade\app\src\main\AndroidManifest.xml:5:5-39:19
MERGED from [com.android.support:design:23.3.0] C:\Users\RonB\.gradle\caches\transforms-2\files-2.1\7b0d284c35a17c9c0b37224c750bacfe\design-23.3.0\AndroidManifest.xml:22:5-20
MERGED from [com.android.support:design:23.3.0] C:\Users\RonB\.gradle\caches\transforms-2\files-2.1\7b0d284c35a17c9c0b37224c750bacfe\design-23.3.0\AndroidManifest.xml:22:5-20
MERGED from [com.android.support:appcompat-v7:23.3.0] C:\Users\RonB\.gradle\caches\transforms-2\files-2.1\edf9b1036bba906e2c1e92a525008ebd\appcompat-v7-23.3.0\AndroidManifest.xml:25:5-20
MERGED from [com.android.support:appcompat-v7:23.3.0] C:\Users\RonB\.gradle\caches\transforms-2\files-2.1\edf9b1036bba906e2c1e92a525008ebd\appcompat-v7-23.3.0\AndroidManifest.xml:25:5-20
MERGED from [com.android.support:animated-vector-drawable:23.3.0] C:\Users\RonB\.gradle\caches\transforms-2\files-2.1\b7ecc649464e3f3e2162064fd272bcb0\animated-vector-drawable-23.3.0\AndroidManifest.xml:7:5-20
MERGED from [com.android.support:animated-vector-drawable:23.3.0] C:\Users\RonB\.gradle\caches\transforms-2\files-2.1\b7ecc649464e3f3e2162064fd272bcb0\animated-vector-drawable-23.3.0\AndroidManifest.xml:7:5-20
MERGED from [com.android.support:support-vector-drawable:23.3.0] C:\Users\RonB\.gradle\caches\transforms-2\files-2.1\6d0b8437ec9faa57ec725e5ac83fab08\support-vector-drawable-23.3.0\AndroidManifest.xml:7:5-20
MERGED from [com.android.support:support-vector-drawable:23.3.0] C:\Users\RonB\.gradle\caches\transforms-2\files-2.1\6d0b8437ec9faa57ec725e5ac83fab08\support-vector-drawable-23.3.0\AndroidManifest.xml:7:5-20
MERGED from [com.android.support:support-v4:23.3.0] C:\Users\RonB\.gradle\caches\transforms-2\files-2.1\1209f5b34d2b452934200e99f385e47e\support-v4-23.3.0\AndroidManifest.xml:22:5-20
MERGED from [com.android.support:support-v4:23.3.0] C:\Users\RonB\.gradle\caches\transforms-2\files-2.1\1209f5b34d2b452934200e99f385e47e\support-v4-23.3.0\AndroidManifest.xml:22:5-20
	android:supportsRtl
		ADDED from C:\Users\RonB\AndroidStudioProjects\AndroidCourses\Ex_Files_Android_SDK_Animation_Transition\Ch05\05_01\CrossFade\app\src\main\AndroidManifest.xml:9:9-35
	android:label
		ADDED from C:\Users\RonB\AndroidStudioProjects\AndroidCourses\Ex_Files_Android_SDK_Animation_Transition\Ch05\05_01\CrossFade\app\src\main\AndroidManifest.xml:8:9-41
	android:icon
		ADDED from C:\Users\RonB\AndroidStudioProjects\AndroidCourses\Ex_Files_Android_SDK_Animation_Transition\Ch05\05_01\CrossFade\app\src\main\AndroidManifest.xml:7:9-43
	android:allowBackup
		ADDED from C:\Users\RonB\AndroidStudioProjects\AndroidCourses\Ex_Files_Android_SDK_Animation_Transition\Ch05\05_01\CrossFade\app\src\main\AndroidManifest.xml:6:9-35
	android:theme
		ADDED from C:\Users\RonB\AndroidStudioProjects\AndroidCourses\Ex_Files_Android_SDK_Animation_Transition\Ch05\05_01\CrossFade\app\src\main\AndroidManifest.xml:10:9-40
activity#com.example.hsport.catalog.MainActivity
ADDED from C:\Users\RonB\AndroidStudioProjects\AndroidCourses\Ex_Files_Android_SDK_Animation_Transition\Ch05\05_01\CrossFade\app\src\main\AndroidManifest.xml:11:9-20:20
	android:label
		ADDED from C:\Users\RonB\AndroidStudioProjects\AndroidCourses\Ex_Files_Android_SDK_Animation_Transition\Ch05\05_01\CrossFade\app\src\main\AndroidManifest.xml:13:13-45
	android:theme
		ADDED from C:\Users\RonB\AndroidStudioProjects\AndroidCourses\Ex_Files_Android_SDK_Animation_Transition\Ch05\05_01\CrossFade\app\src\main\AndroidManifest.xml:14:13-56
	android:name
		ADDED from C:\Users\RonB\AndroidStudioProjects\AndroidCourses\Ex_Files_Android_SDK_Animation_Transition\Ch05\05_01\CrossFade\app\src\main\AndroidManifest.xml:12:13-41
intent-filter#action:name:android.intent.action.MAIN+category:name:android.intent.category.LAUNCHER
ADDED from C:\Users\RonB\AndroidStudioProjects\AndroidCourses\Ex_Files_Android_SDK_Animation_Transition\Ch05\05_01\CrossFade\app\src\main\AndroidManifest.xml:15:13-19:29
action#android.intent.action.MAIN
ADDED from C:\Users\RonB\AndroidStudioProjects\AndroidCourses\Ex_Files_Android_SDK_Animation_Transition\Ch05\05_01\CrossFade\app\src\main\AndroidManifest.xml:16:17-69
	android:name
		ADDED from C:\Users\RonB\AndroidStudioProjects\AndroidCourses\Ex_Files_Android_SDK_Animation_Transition\Ch05\05_01\CrossFade\app\src\main\AndroidManifest.xml:16:25-66
category#android.intent.category.LAUNCHER
ADDED from C:\Users\RonB\AndroidStudioProjects\AndroidCourses\Ex_Files_Android_SDK_Animation_Transition\Ch05\05_01\CrossFade\app\src\main\AndroidManifest.xml:18:17-77
	android:name
		ADDED from C:\Users\RonB\AndroidStudioProjects\AndroidCourses\Ex_Files_Android_SDK_Animation_Transition\Ch05\05_01\CrossFade\app\src\main\AndroidManifest.xml:18:27-74
activity#com.example.hsport.catalog.AboutActivity
ADDED from C:\Users\RonB\AndroidStudioProjects\AndroidCourses\Ex_Files_Android_SDK_Animation_Transition\Ch05\05_01\CrossFade\app\src\main\AndroidManifest.xml:21:9-29:20
	android:parentActivityName
		ADDED from C:\Users\RonB\AndroidStudioProjects\AndroidCourses\Ex_Files_Android_SDK_Animation_Transition\Ch05\05_01\CrossFade\app\src\main\AndroidManifest.xml:24:13-55
	android:label
		ADDED from C:\Users\RonB\AndroidStudioProjects\AndroidCourses\Ex_Files_Android_SDK_Animation_Transition\Ch05\05_01\CrossFade\app\src\main\AndroidManifest.xml:23:13-57
	android:theme
		ADDED from C:\Users\RonB\AndroidStudioProjects\AndroidCourses\Ex_Files_Android_SDK_Animation_Transition\Ch05\05_01\CrossFade\app\src\main\AndroidManifest.xml:25:13-56
	android:name
		ADDED from C:\Users\RonB\AndroidStudioProjects\AndroidCourses\Ex_Files_Android_SDK_Animation_Transition\Ch05\05_01\CrossFade\app\src\main\AndroidManifest.xml:22:13-42
meta-data#android.support.PARENT_ACTIVITY
ADDED from C:\Users\RonB\AndroidStudioProjects\AndroidCourses\Ex_Files_Android_SDK_Animation_Transition\Ch05\05_01\CrossFade\app\src\main\AndroidManifest.xml:26:13-28:75
	android:value
		ADDED from C:\Users\RonB\AndroidStudioProjects\AndroidCourses\Ex_Files_Android_SDK_Animation_Transition\Ch05\05_01\CrossFade\app\src\main\AndroidManifest.xml:28:17-72
	android:name
		ADDED from C:\Users\RonB\AndroidStudioProjects\AndroidCourses\Ex_Files_Android_SDK_Animation_Transition\Ch05\05_01\CrossFade\app\src\main\AndroidManifest.xml:27:17-63
activity#com.example.hsport.catalog.DetailActivity
ADDED from C:\Users\RonB\AndroidStudioProjects\AndroidCourses\Ex_Files_Android_SDK_Animation_Transition\Ch05\05_01\CrossFade\app\src\main\AndroidManifest.xml:30:9-38:20
	android:parentActivityName
		ADDED from C:\Users\RonB\AndroidStudioProjects\AndroidCourses\Ex_Files_Android_SDK_Animation_Transition\Ch05\05_01\CrossFade\app\src\main\AndroidManifest.xml:33:13-55
	android:label
		ADDED from C:\Users\RonB\AndroidStudioProjects\AndroidCourses\Ex_Files_Android_SDK_Animation_Transition\Ch05\05_01\CrossFade\app\src\main\AndroidManifest.xml:32:13-58
	android:theme
		ADDED from C:\Users\RonB\AndroidStudioProjects\AndroidCourses\Ex_Files_Android_SDK_Animation_Transition\Ch05\05_01\CrossFade\app\src\main\AndroidManifest.xml:34:13-56
	android:name
		ADDED from C:\Users\RonB\AndroidStudioProjects\AndroidCourses\Ex_Files_Android_SDK_Animation_Transition\Ch05\05_01\CrossFade\app\src\main\AndroidManifest.xml:31:13-43
uses-sdk
INJECTED from C:\Users\RonB\AndroidStudioProjects\AndroidCourses\Ex_Files_Android_SDK_Animation_Transition\Ch05\05_01\CrossFade\app\src\main\AndroidManifest.xml reason: use-sdk injection requested
INJECTED from C:\Users\RonB\AndroidStudioProjects\AndroidCourses\Ex_Files_Android_SDK_Animation_Transition\Ch05\05_01\CrossFade\app\src\main\AndroidManifest.xml
INJECTED from C:\Users\RonB\AndroidStudioProjects\AndroidCourses\Ex_Files_Android_SDK_Animation_Transition\Ch05\05_01\CrossFade\app\src\main\AndroidManifest.xml
MERGED from [com.android.support:design:23.3.0] C:\Users\RonB\.gradle\caches\transforms-2\files-2.1\7b0d284c35a17c9c0b37224c750bacfe\design-23.3.0\AndroidManifest.xml:20:5-43
MERGED from [com.android.support:design:23.3.0] C:\Users\RonB\.gradle\caches\transforms-2\files-2.1\7b0d284c35a17c9c0b37224c750bacfe\design-23.3.0\AndroidManifest.xml:20:5-43
MERGED from [com.android.support:appcompat-v7:23.3.0] C:\Users\RonB\.gradle\caches\transforms-2\files-2.1\edf9b1036bba906e2c1e92a525008ebd\appcompat-v7-23.3.0\AndroidManifest.xml:21:5-23:78
MERGED from [com.android.support:appcompat-v7:23.3.0] C:\Users\RonB\.gradle\caches\transforms-2\files-2.1\edf9b1036bba906e2c1e92a525008ebd\appcompat-v7-23.3.0\AndroidManifest.xml:21:5-23:78
MERGED from [com.android.support:animated-vector-drawable:23.3.0] C:\Users\RonB\.gradle\caches\transforms-2\files-2.1\b7ecc649464e3f3e2162064fd272bcb0\animated-vector-drawable-23.3.0\AndroidManifest.xml:5:5-44
MERGED from [com.android.support:animated-vector-drawable:23.3.0] C:\Users\RonB\.gradle\caches\transforms-2\files-2.1\b7ecc649464e3f3e2162064fd272bcb0\animated-vector-drawable-23.3.0\AndroidManifest.xml:5:5-44
MERGED from [com.android.support:support-vector-drawable:23.3.0] C:\Users\RonB\.gradle\caches\transforms-2\files-2.1\6d0b8437ec9faa57ec725e5ac83fab08\support-vector-drawable-23.3.0\AndroidManifest.xml:5:5-43
MERGED from [com.android.support:support-vector-drawable:23.3.0] C:\Users\RonB\.gradle\caches\transforms-2\files-2.1\6d0b8437ec9faa57ec725e5ac83fab08\support-vector-drawable-23.3.0\AndroidManifest.xml:5:5-43
MERGED from [com.android.support:recyclerview-v7:23.3.0] C:\Users\RonB\.gradle\caches\transforms-2\files-2.1\bec95f201c55d500e5a0f18f1cc6e325\recyclerview-v7-23.3.0\AndroidManifest.xml:20:5-43
MERGED from [com.android.support:recyclerview-v7:23.3.0] C:\Users\RonB\.gradle\caches\transforms-2\files-2.1\bec95f201c55d500e5a0f18f1cc6e325\recyclerview-v7-23.3.0\AndroidManifest.xml:20:5-43
MERGED from [com.android.support:support-v4:23.3.0] C:\Users\RonB\.gradle\caches\transforms-2\files-2.1\1209f5b34d2b452934200e99f385e47e\support-v4-23.3.0\AndroidManifest.xml:20:5-43
MERGED from [com.android.support:support-v4:23.3.0] C:\Users\RonB\.gradle\caches\transforms-2\files-2.1\1209f5b34d2b452934200e99f385e47e\support-v4-23.3.0\AndroidManifest.xml:20:5-43
INJECTED from C:\Users\RonB\AndroidStudioProjects\AndroidCourses\Ex_Files_Android_SDK_Animation_Transition\Ch05\05_01\CrossFade\app\src\main\AndroidManifest.xml
INJECTED from C:\Users\RonB\AndroidStudioProjects\AndroidCourses\Ex_Files_Android_SDK_Animation_Transition\Ch05\05_01\CrossFade\app\src\main\AndroidManifest.xml
	tools:overrideLibrary
		ADDED from [com.android.support:appcompat-v7:23.3.0] C:\Users\RonB\.gradle\caches\transforms-2\files-2.1\edf9b1036bba906e2c1e92a525008ebd\appcompat-v7-23.3.0\AndroidManifest.xml:23:9-75
	android:targetSdkVersion
		INJECTED from C:\Users\RonB\AndroidStudioProjects\AndroidCourses\Ex_Files_Android_SDK_Animation_Transition\Ch05\05_01\CrossFade\app\src\main\AndroidManifest.xml
		ADDED from C:\Users\RonB\AndroidStudioProjects\AndroidCourses\Ex_Files_Android_SDK_Animation_Transition\Ch05\05_01\CrossFade\app\src\main\AndroidManifest.xml
		INJECTED from C:\Users\RonB\AndroidStudioProjects\AndroidCourses\Ex_Files_Android_SDK_Animation_Transition\Ch05\05_01\CrossFade\app\src\main\AndroidManifest.xml
	android:minSdkVersion
		INJECTED from C:\Users\RonB\AndroidStudioProjects\AndroidCourses\Ex_Files_Android_SDK_Animation_Transition\Ch05\05_01\CrossFade\app\src\main\AndroidManifest.xml
		ADDED from C:\Users\RonB\AndroidStudioProjects\AndroidCourses\Ex_Files_Android_SDK_Animation_Transition\Ch05\05_01\CrossFade\app\src\main\AndroidManifest.xml
		INJECTED from C:\Users\RonB\AndroidStudioProjects\AndroidCourses\Ex_Files_Android_SDK_Animation_Transition\Ch05\05_01\CrossFade\app\src\main\AndroidManifest.xml
