﻿ID;"На что жалоба";Регион;"Населенный пункт";"Дата подачи жалобы";"Что не понравилось";Баллы
Айнура;2021-01-01;2021-12-01;2021-12-01;2021-12-01;2021-12-01;2021-12-01
Максат;2021-01-01;2021-12-01;2021-12-01;2021-12-01;2021-12-01;2021-12-01
Руслан;2021-01-01;2021-12-01;2021-12-01;2021-12-01;2021-12-01;2021-12-01
maksat;2021-01-01;2021-12-01;2021-12-01;2021-12-01;2021-12-01;2021-12-01
﻿