{
  "debug": true,
  "server": {
    "address": ":8090"
  },
  "context": {
    "timeout": 10000
  },
  "jwt": {
    "secret_key": "secret",
    "secret_key_expire_minutes_count": 15
  },
  "database": {
    "host": "localhost",
    "port": "5432",
    "user": "postgres",
    "pass": "mysecret",
    "name": "mini-wallet-exercise",
    "sslmode": "disable"
  }
}