{
	"info": {
		"_postman_id": "1e2c9319-2bea-404b-83b8-ea09ac932b33",
		"name": "Capstone 2 - ECommerce API",
		"schema": "https://schema.getpostman.com/json/collection/v2.1.0/collection.json",
		"_exporter_id": "24289495"
	},
	"item": [
		{
			"name": "Check Email",
			"request": {
				"method": "POST",
				"header": [],
				"body": {
					"mode": "raw",
					"raw": "",
					"options": {
						"raw": {
							"language": "json"
						}
					}
				},
				"url": {
					"raw": "http://localhost:4000/users/checkEmail",
					"protocol": "http",
					"host": [
						"localhost"
					],
					"port": "4000",
					"path": [
						"users",
						"checkEmail"
					]
				}
			},
			"response": []
		},
		{
			"name": "User Registration",
			"request": {
				"method": "POST",
				"header": [],
				"body": {
					"mode": "raw",
					"raw": "{\"email\": \"jervisrod@gmail.com\",\r\n\"password\": \"123456789\",\r\n\"mobileNo\": \"09123356411\",\r\n\"firstName\": \"Jervis\",\r\n\"lastName\": \"Rod\"}",
					"options": {
						"raw": {
							"language": "json"
						}
					}
				},
				"url": {
					"raw": "http://localhost:4000/users/register",
					"protocol": "http",
					"host": [
						"localhost"
					],
					"port": "4000",
					"path": [
						"users",
						"register"
					]
				}
			},
			"response": []
		},
		{
			"name": "User Authentication (Log-in)",
			"event": [
				{
					"listen": "test",
					"script": {
						"exec": [
							"const response = pm.response.json();\r",
							"pm.globals.set(\"jwt_token\", response.access);"
						],
						"type": "text/javascript"
					}
				}
			],
			"request": {
				"auth": {
					"type": "bearer",
					"bearer": [
						{
							"key": "token",
							"value": "eyJhbGciOiJIUzI1NiIsInR5cCI6IkpXVCJ9.eyJpZCI6IjYzY2ZjMmM5ODQzOTJjNDAwNzZhMjZmMSIsImVtYWlsIjoibWFya3JhbWlyZXpAZ21haWwuY29tIiwiaXNBZG1pbiI6ZmFsc2UsImlhdCI6MTY3NDU2NjA4MH0.LpZ6ipzr4wD2QN0yr3eznvp3391kkii4jB81deWm59s",
							"type": "string"
						}
					]
				},
				"method": "POST",
				"header": [],
				"body": {
					"mode": "raw",
					"raw": "{\"email\": \"princessamt@gmail.com\",\r\n\"password\": \"123456789\"}",
					"options": {
						"raw": {
							"language": "json"
						}
					}
				},
				"url": {
					"raw": "http://localhost:4000/users/login",
					"protocol": "http",
					"host": [
						"localhost"
					],
					"port": "4000",
					"path": [
						"users",
						"login"
					]
				}
			},
			"response": []
		},
		{
			"name": "Retrieve User Details",
			"protocolProfileBehavior": {
				"disableBodyPruning": true
			},
			"request": {
				"auth": {
					"type": "bearer",
					"bearer": [
						{
							"key": "token",
							"value": "eyJhbGciOiJIUzI1NiIsInR5cCI6IkpXVCJ9.eyJpZCI6IjYzY2ZjMmM5ODQzOTJjNDAwNzZhMjZmMSIsImVtYWlsIjoibWFya3JhbWlyZXpAZ21haWwuY29tIiwiaXNBZG1pbiI6ZmFsc2UsImlhdCI6MTY3NDU2MTA1MX0.9kNZvEDaxw7MFasWyL9_BwCTuaaDcFglqjF3v8UDyY0",
							"type": "string"
						}
					]
				},
				"method": "GET",
				"header": [],
				"body": {
					"mode": "raw",
					"raw": "",
					"options": {
						"raw": {
							"language": "json"
						}
					}
				},
				"url": {
					"raw": "http://localhost:4000/users/details",
					"protocol": "http",
					"host": [
						"localhost"
					],
					"port": "4000",
					"path": [
						"users",
						"details"
					]
				}
			},
			"response": []
		},
		{
			"name": "Create Product",
			"request": {
				"auth": {
					"type": "bearer",
					"bearer": [
						{
							"key": "token",
							"value": "{{jwt_token}}",
							"type": "string"
						}
					]
				},
				"method": "POST",
				"header": [],
				"body": {
					"mode": "raw",
					"raw": "{\"name\": \"Angle Bar - 2mm x 1 1/2inch\",\r\n    \"description\": \"2mm thickness x 1 1/2inch width x 6m length\",\r\n    \"category\": [\"Steel\"],\r\n    \"supply\": 1000,\r\n    \"price\": 487}",
					"options": {
						"raw": {
							"language": "json"
						}
					}
				},
				"url": {
					"raw": "http://localhost:4000/products/addProduct",
					"protocol": "http",
					"host": [
						"localhost"
					],
					"port": "4000",
					"path": [
						"products",
						"addProduct"
					]
				}
			},
			"response": []
		},
		{
			"name": "Retrieve All Active Products",
			"request": {
				"method": "GET",
				"header": [],
				"url": {
					"raw": "http://localhost:4000/products/allActiveProducts",
					"protocol": "http",
					"host": [
						"localhost"
					],
					"port": "4000",
					"path": [
						"products",
						"allActiveProducts"
					]
				}
			},
			"response": []
		},
		{
			"name": "Retrieve A Product",
			"request": {
				"method": "GET",
				"header": []
			},
			"response": []
		},
		{
			"name": "Update Product",
			"request": {
				"auth": {
					"type": "bearer",
					"bearer": [
						{
							"key": "token",
							"value": "{{jwt_token}}",
							"type": "string"
						}
					]
				},
				"method": "PUT",
				"header": [],
				"body": {
					"mode": "raw",
					"raw": "{\r\n    \"name\": \"Bistay Sand\",\r\n    \"description\": \"Approx 13kg/bag\",\r\n    \"price\": 35,\r\n    \"supply\": 1000,\r\n    \"isActive\": true\r\n}",
					"options": {
						"raw": {
							"language": "json"
						}
					}
				},
				"url": {
					"raw": "http://localhost:4000/products/63d0fa22d09508e79568452d",
					"protocol": "http",
					"host": [
						"localhost"
					],
					"port": "4000",
					"path": [
						"products",
						"63d0fa22d09508e79568452d"
					]
				}
			},
			"response": []
		},
		{
			"name": "Archive Product",
			"request": {
				"auth": {
					"type": "bearer",
					"bearer": [
						{
							"key": "token",
							"value": "{{jwt_token}}",
							"type": "string"
						}
					]
				},
				"method": "DELETE",
				"header": [],
				"url": {
					"raw": "http://localhost:4000/products/archiveProduct/",
					"protocol": "http",
					"host": [
						"localhost"
					],
					"port": "4000",
					"path": [
						"products",
						"archiveProduct",
						""
					]
				}
			},
			"response": []
		},
		{
			"name": "Check Out Order (Buy Now)",
			"request": {
				"auth": {
					"type": "bearer",
					"bearer": [
						{
							"key": "token",
							"value": "{{jwt_token}}",
							"type": "string"
						}
					]
				},
				"method": "POST",
				"header": [],
				"body": {
					"mode": "raw",
					"raw": "[{\"_id\": \"63d7b4c5c8c90ef6a6517754\",\r\n        \"name\": \"Concrete Hollow Block - 4inch\", \"quantity\":10},{\"_id\": \"63d7c37cd1e17ba006a9385f\",\r\n        \"name\": \"Deformed Bar G33 - 8mm\", \"quantity\":30}]",
					"options": {
						"raw": {
							"language": "json"
						}
					}
				},
				"url": {
					"raw": "http://localhost:4000/users/checkOutOrder",
					"protocol": "http",
					"host": [
						"localhost"
					],
					"port": "4000",
					"path": [
						"users",
						"checkOutOrder"
					]
				}
			},
			"response": []
		},
		{
			"name": "User Access To Admin",
			"request": {
				"auth": {
					"type": "bearer",
					"bearer": [
						{
							"key": "token",
							"value": "{{jwt_token}}",
							"type": "string"
						}
					]
				},
				"method": "PATCH",
				"header": [],
				"url": {
					"raw": "http://localhost:4000/users/userAccess/63cfc2a784392c40076a26ed",
					"protocol": "http",
					"host": [
						"localhost"
					],
					"port": "4000",
					"path": [
						"users",
						"userAccess",
						"63cfc2a784392c40076a26ed"
					]
				}
			},
			"response": []
		},
		{
			"name": "Get My Orders (Non-Admin)",
			"request": {
				"auth": {
					"type": "bearer",
					"bearer": [
						{
							"key": "token",
							"value": "{{jwt_token}}",
							"type": "string"
						}
					]
				},
				"method": "GET",
				"header": [],
				"url": {
					"raw": "http://localhost:4000/users/myOrders",
					"protocol": "http",
					"host": [
						"localhost"
					],
					"port": "4000",
					"path": [
						"users",
						"myOrders"
					]
				}
			},
			"response": []
		},
		{
			"name": "Get All Orders by Users (Admin)",
			"request": {
				"auth": {
					"type": "bearer",
					"bearer": [
						{
							"key": "token",
							"value": "{{jwt_token}}",
							"type": "string"
						}
					]
				},
				"method": "GET",
				"header": [],
				"url": {
					"raw": "http://localhost:4000/users/allOrders",
					"protocol": "http",
					"host": [
						"localhost"
					],
					"port": "4000",
					"path": [
						"users",
						"allOrders"
					]
				}
			},
			"response": []
		},
		{
			"name": "Get All Orders by Products (Admin)",
			"request": {
				"auth": {
					"type": "bearer",
					"bearer": [
						{
							"key": "token",
							"value": "{{jwt_token}}",
							"type": "string"
						}
					]
				},
				"method": "GET",
				"header": [],
				"url": {
					"raw": "http://localhost:4000/products/ordersTS",
					"protocol": "http",
					"host": [
						"localhost"
					],
					"port": "4000",
					"path": [
						"products",
						"ordersTS"
					]
				}
			},
			"response": []
		},
		{
			"name": "Add To Cart",
			"request": {
				"auth": {
					"type": "bearer",
					"bearer": [
						{
							"key": "token",
							"value": "{{jwt_token}}",
							"type": "string"
						}
					]
				},
				"method": "PUT",
				"header": [],
				"body": {
					"mode": "raw",
					"raw": "{\"productId\":\"63d0fbb6f5c340fb5a04ba9c\", \"productName\":\"Concrete Hollow Block - 4inch\"}",
					"options": {
						"raw": {
							"language": "json"
						}
					}
				},
				"url": {
					"raw": "http://localhost:4000/users/addToCart",
					"protocol": "http",
					"host": [
						"localhost"
					],
					"port": "4000",
					"path": [
						"users",
						"addToCart"
					]
				}
			},
			"response": []
		},
		{
			"name": "View My Cart",
			"request": {
				"method": "GET",
				"header": []
			},
			"response": []
		},
		{
			"name": "Change Product Quantity In My Cart",
			"request": {
				"auth": {
					"type": "bearer",
					"bearer": [
						{
							"key": "token",
							"value": "{{jwt_token}}",
							"type": "string"
						}
					]
				},
				"method": "PATCH",
				"header": [],
				"body": {
					"mode": "raw",
					"raw": "{\r\n        \"productId\": \"63d0fa22d09508e79568452d\",\r\n        \"productName\": \"Bistay Sand\",\r\n        \"quantity\": 1\r\n    }",
					"options": {
						"raw": {
							"language": "json"
						}
					}
				},
				"url": {
					"raw": "http://localhost:4000/users/changeProductQty",
					"protocol": "http",
					"host": [
						"localhost"
					],
					"port": "4000",
					"path": [
						"users",
						"changeProductQty"
					]
				}
			},
			"response": []
		},
		{
			"name": "Remove Product From Cart",
			"request": {
				"method": "DELETE",
				"header": [],
				"url": {
					"raw": ""
				}
			},
			"response": []
		},
		{
			"name": "Subtotal For Each Item In Cart",
			"request": {
				"method": "GET",
				"header": []
			},
			"response": []
		},
		{
			"name": "Total Price For All Items In Cart",
			"request": {
				"method": "GET",
				"header": []
			},
			"response": []
		},
		{
			"name": "Check Out Order (From Cart)",
			"request": {
				"auth": {
					"type": "bearer",
					"bearer": [
						{
							"key": "token",
							"value": "{{jwt_token}}",
							"type": "string"
						}
					]
				},
				"method": "POST",
				"header": [],
				"body": {
					"mode": "raw",
					"raw": "[{\"productId\":\"63d0fa22d09508e79568452d\", \"productName\":\"Bistay Sand\"},{\"productId\":\"63d0fbb6f5c340fb5a04ba9c\", \"productName\":\"Concrete Hollow Block - 4inch\"}]",
					"options": {
						"raw": {
							"language": "json"
						}
					}
				},
				"url": {
					"raw": "http://localhost:4000/users/checkOutfromCart",
					"protocol": "http",
					"host": [
						"localhost"
					],
					"port": "4000",
					"path": [
						"users",
						"checkOutfromCart"
					]
				}
			},
			"response": []
		}
	]
}