{
	"info": {
		"_postman_id": "c078e9b1-a5dd-4888-91ae-07511bbffef1",
		"name": "S27",
		"schema": "https://schema.getpostman.com/json/collection/v2.1.0/collection.json",
		"_exporter_id": "21503161"
	},
	"item": [
		{
			"name": "D1",
			"item": [
				{
					"name": "Create Users",
					"request": {
						"method": "POST",
						"header": [],
						"body": {
							"mode": "raw",
							"raw": "{\r\n    \"name\": \"John\"\r\n    \"email\": \"john@mail.com\"\r\n}",
							"options": {
								"raw": {
									"language": "json"
								}
							}
						},
						"url": {
							"raw": "localhost:4000/users",
							"host": [
								"localhost"
							],
							"port": "4000",
							"path": [
								"users"
							]
						}
					},
					"response": []
				},
				{
					"name": "Post Users",
					"request": {
						"method": "GET",
						"header": []
					},
					"response": []
				},
				{
					"name": "Retrieve Users",
					"request": {
						"method": "GET",
						"header": [],
						"url": {
							"raw": "localhost:4000/users",
							"host": [
								"localhost"
							],
							"port": "4000",
							"path": [
								"users"
							]
						}
					},
					"response": []
				},
				{
					"name": "Update a Users",
					"request": {
						"method": "PUT",
						"header": [],
						"body": {
							"mode": "raw",
							"raw": "{\r\n    \"name\": \"John\"\r\n    \"email\": \"john@mail.com\"\r\n}",
							"options": {
								"raw": {
									"language": "json"
								}
							}
						},
						"url": {
							"raw": "localhost:4000/users",
							"host": [
								"localhost"
							],
							"port": "4000",
							"path": [
								"users"
							]
						}
					},
					"response": []
				}
			]
		},
		{
			"name": "A1",
			"item": [
				{
					"name": "Homepage GET route",
					"request": {
						"method": "GET",
						"header": [],
						"url": {
							"raw": "localhost:4000/",
							"host": [
								"localhost"
							],
							"port": "4000",
							"path": [
								""
							]
						}
					},
					"response": []
				},
				{
					"name": "Profile GET route",
					"request": {
						"method": "GET",
						"header": [],
						"url": {
							"raw": "localhost:4000/profile",
							"host": [
								"localhost"
							],
							"port": "4000",
							"path": [
								"profile"
							]
						}
					},
					"response": []
				},
				{
					"name": "Course GET route",
					"request": {
						"method": "GET",
						"header": [],
						"url": {
							"raw": "localhost:4000/courses",
							"host": [
								"localhost"
							],
							"port": "4000",
							"path": [
								"courses"
							]
						}
					},
					"response": []
				},
				{
					"name": "course POST route",
					"request": {
						"method": "POST",
						"header": [],
						"body": {
							"mode": "raw",
							"raw": "{\"add course\" =\"update the course to our resources\"}"
						},
						"url": {
							"raw": "localhost:4000/addCourse",
							"host": [
								"localhost"
							],
							"port": "4000",
							"path": [
								"addCourse"
							]
						}
					},
					"response": []
				},
				{
					"name": "course PUT route",
					"request": {
						"method": "PUT",
						"header": [],
						"url": {
							"raw": "localhost:4000/updateCourse",
							"host": [
								"localhost"
							],
							"port": "4000",
							"path": [
								"updateCourse"
							]
						}
					},
					"response": []
				},
				{
					"name": "course DELETE route",
					"request": {
						"method": "DELETE",
						"header": [],
						"url": {
							"raw": "localhost:4000/archiveCourse",
							"host": [
								"localhost"
							],
							"port": "4000",
							"path": [
								"archiveCourse"
							]
						}
					},
					"response": []
				}
			]
		}
	]
}