{
	"info": {
		"_postman_id": "0c62e424-1890-4d46-a419-d60bd5c308dc",
		"name": "s34 Activity",
		"schema": "https://schema.getpostman.com/json/collection/v2.1.0/collection.json",
		"_exporter_id": "22828936"
	},
	"item": [
		{
			"name": "home route",
			"request": {
				"method": "GET",
				"header": [],
				"url": {
					"raw": "localhost:4000/home",
					"host": [
						"localhost"
					],
					"port": "4000",
					"path": [
						"home"
					]
				}
			},
			"response": []
		},
		{
			"name": "get users",
			"protocolProfileBehavior": {
				"disableBodyPruning": true
			},
			"request": {
				"method": "GET",
				"header": [],
				"body": {
					"mode": "raw",
					"raw": "",
					"options": {
						"raw": {
							"language": "json"
						}
					}
				},
				"url": {
					"raw": "localhost:4000/users",
					"host": [
						"localhost"
					],
					"port": "4000",
					"path": [
						"users"
					]
				}
			},
			"response": []
		},
		{
			"name": "delete user",
			"request": {
				"method": "DELETE",
				"header": [],
				"body": {
					"mode": "raw",
					"raw": "{\r\n    \"username\": \"johndoe\"\r\n}",
					"options": {
						"raw": {
							"language": "json"
						}
					}
				},
				"url": {
					"raw": "localhost:4000/delete-item",
					"host": [
						"localhost"
					],
					"port": "4000",
					"path": [
						"delete-item"
					]
				}
			},
			"response": []
		},
		{
			"name": "home",
			"request": {
				"method": "GET",
				"header": []
			},
			"response": []
		}
	]
}