{
	"info": {
		"_postman_id": "5fe36def-aebe-4e25-908f-9d0dcb90f931",
		"name": "S35",
		"schema": "https://schema.getpostman.com/json/collection/v2.1.0/collection.json",
		"_exporter_id": "24289512"
	},
	"item": [
		{
			"name": "create new task",
			"request": {
				"method": "POST",
				"header": [],
				"body": {
					"mode": "raw",
					"raw": "{\r\n    \"name\": \"Eat\"\r\n}",
					"options": {
						"raw": {
							"language": "json"
						}
					}
				},
				"url": {
					"raw": "http://localhost:3001/tasks",
					"protocol": "http",
					"host": [
						"localhost"
					],
					"port": "3001",
					"path": [
						"tasks"
					]
				}
			},
			"response": []
		},
		{
			"name": "new user",
			"request": {
				"method": "POST",
				"header": [],
				"url": {
					"raw": "http://localhost:3001/tasklist",
					"protocol": "http",
					"host": [
						"localhost"
					],
					"port": "3001",
					"path": [
						"tasklist"
					]
				}
			},
			"response": []
		}
	]
}