{
	"info": {
		"_postman_id": "5d138fd5-d6b4-4471-b8bb-78a5114d1883",
		"name": "s32 activity",
		"schema": "https://schema.getpostman.com/json/collection/v2.1.0/collection.json",
		"_exporter_id": "24277856"
	},
	"item": [
		{
			"name": "Homepage GET route",
			"request": {
				"method": "GET",
				"header": [],
				"url": {
					"raw": "localhost:4000/",
					"host": [
						"localhost"
					],
					"port": "4000",
					"path": [
						""
					]
				}
			},
			"response": []
		},
		{
			"name": "Profile GET route",
			"request": {
				"method": "GET",
				"header": [],
				"url": {
					"raw": "localhost:4000/profile",
					"host": [
						"localhost"
					],
					"port": "4000",
					"path": [
						"profile"
					]
				}
			},
			"response": []
		},
		{
			"name": "Course GET route",
			"request": {
				"method": "GET",
				"header": [],
				"url": {
					"raw": "localhost:4000/courses",
					"host": [
						"localhost"
					],
					"port": "4000",
					"path": [
						"courses"
					]
				}
			},
			"response": []
		},
		{
			"name": "Course POST route",
			"request": {
				"method": "POST",
				"header": [],
				"url": {
					"raw": "localhost:4000/addCourse",
					"host": [
						"localhost"
					],
					"port": "4000",
					"path": [
						"addCourse"
					]
				}
			},
			"response": []
		},
		{
			"name": "Course PUT route",
			"request": {
				"method": "PUT",
				"header": [],
				"url": {
					"raw": "localhost:4000/updateCourse",
					"host": [
						"localhost"
					],
					"port": "4000",
					"path": [
						"updateCourse"
					]
				}
			},
			"response": []
		},
		{
			"name": "Course DELETE route",
			"request": {
				"method": "DELETE",
				"header": [],
				"url": {
					"raw": "localhost:4000/archiveCourse",
					"host": [
						"localhost"
					],
					"port": "4000",
					"path": [
						"archiveCourse"
					]
				}
			},
			"response": []
		}
	]
}