{
	"_id" : "mncvnmbjkfgklmf001",
	"userID" : "dfghfdhdhfdhfh001",
	"productId" : "hkdfbhkfdnbjfbnjkjdf001",
	"transactionDate" : "2021-16-9T12:00:00.00Z",
	"status" : "picked up by shipping partner",
	"total" : "1"
}

{
	"_id" : "mncvnmbjkfgklmf002",
	"userID" : "dfghfdhdhfdhfh001",
	"productId" : "hkdfbhkfdnbjfbnjkjdf003",
	"transactionDate" : "2021-16-9T12:00:00.00Z",
	"status" : "delivered",
	"total" : "1"
}

// Test