{
	"_id" : "507f1f77bcf86cd799439011",
	"firstName" : "John",
	"lastName" : "Smith",
	"email" : "Johnsmith@gmail.com",
	"password" : "johnhandsome",
	"isAdmin" : false,
	"mobileNumber" : "09123456789",
	"enrollments" : ["601ccbe89bcd482ee8fa2c99",
"507f191e810c19729de860ea"],
	"dateTimeRegistered": "2020-03-15T15:00:00.00Z"
};

{
	"_id" : "507f1f77bcf86cd7994392231",
	"firstName" : "Blower",
	"lastName" : "Doe",
	"email" : "JaneDoe@gmail.com",
	"password" : "jane123",
	"isAdmin" : true,
	"mobileNumber" : "09123456788",
	"enrollments" : [],
	"dateTimeRegistered": "2020-03-15T15:00:00.00Z"
};
