{
	"info": {
		"_postman_id": "e97ca147-8fd3-457f-9f77-eb97282bcf8a",
		"name": "S32 Activity",
		"schema": "https://schema.getpostman.com/json/collection/v2.1.0/collection.json",
		"_exporter_id": "24284175"
	},
	"item": [
		{
			"name": "Add booking",
			"request": {
				"method": "GET",
				"header": []
			},
			"response": []
		},
		{
			"name": "Add Profile",
			"request": {
				"method": "GET",
				"header": []
			},
			"response": []
		},
		{
			"name": "Course Available",
			"request": {
				"method": "GET",
				"header": []
			},
			"response": []
		},
		{
			"name": "Add Course",
			"request": {
				"method": "POST",
				"header": [],
				"url": {
					"raw": "http://localhost:4000/addCourse",
					"protocol": "http",
					"host": [
						"localhost"
					],
					"port": "4000",
					"path": [
						"addCourse"
					]
				}
			},
			"response": []
		},
		{
			"name": "Update Course",
			"request": {
				"method": "PUT",
				"header": [],
				"url": {
					"raw": "http://localhost:4000/updateCourse",
					"protocol": "http",
					"host": [
						"localhost"
					],
					"port": "4000",
					"path": [
						"updateCourse"
					]
				}
			},
			"response": []
		},
		{
			"name": "Archive Courses",
			"request": {
				"method": "DELETE",
				"header": [],
				"url": {
					"raw": "http://localhost:4000/archiveCourses",
					"protocol": "http",
					"host": [
						"localhost"
					],
					"port": "4000",
					"path": [
						"archiveCourses"
					]
				}
			},
			"response": []
		}
	]
}